db-torque-dev mailing list archives

Site index · List index
Message view « Date » · « Thread »
Top « Date » · « Thread »
From Apache Jenkins Server <jenk...@builds.apache.org>
Subject Build failed in Jenkins: torque4-test-project-hsqldb #289
Date Thu, 04 Sep 2014 21:56:46 GMT
See <https://builds.apache.org/job/torque4-test-project-hsqldb/289/changes>

Changes:

[tfischer] TORQUE-317 use torqueGen.booleanOption() where sensible

------------------------------------------
[...truncated 13203 lines...]
INFO  org.apache.torque.generator.control.Controller - Start generation of File <https://builds.apache.org/job/torque4-test-project-hsqldb/ws/torque-test/target/generated-docs/datamodel.css>
INFO  org.apache.torque.generator.control.Controller - Processing source <https://builds.apache.org/job/torque4-test-project-hsqldb/ws/torque-test/target/torque/test/schema/databaseMapInit-schema.xml>
INFO  org.apache.torque.generator.control.Controller - Start generation of File <https://builds.apache.org/job/torque4-test-project-hsqldb/ws/torque-test/target/generated-docs/datamodel.css>
INFO  org.apache.torque.generator.control.Controller - Processing source <https://builds.apache.org/job/torque4-test-project-hsqldb/ws/torque-test/target/torque/test/schema/default-value-schema.xml>
INFO  org.apache.torque.generator.control.Controller - Start generation of File <https://builds.apache.org/job/torque4-test-project-hsqldb/ws/torque-test/target/generated-docs/datamodel.css>
INFO  org.apache.torque.generator.control.Controller - Processing source <https://builds.apache.org/job/torque4-test-project-hsqldb/ws/torque-test/target/torque/test/schema/foreign-key-schema.xml>
INFO  org.apache.torque.generator.control.Controller - Start generation of File <https://builds.apache.org/job/torque4-test-project-hsqldb/ws/torque-test/target/generated-docs/datamodel.css>
INFO  org.apache.torque.generator.control.Controller - Processing source <https://builds.apache.org/job/torque4-test-project-hsqldb/ws/torque-test/target/torque/test/schema/index.xml>
INFO  org.apache.torque.generator.control.Controller - Start generation of File <https://builds.apache.org/job/torque4-test-project-hsqldb/ws/torque-test/target/generated-docs/datamodel.css>
INFO  org.apache.torque.generator.control.Controller - Processing source <https://builds.apache.org/job/torque4-test-project-hsqldb/ws/torque-test/target/torque/test/schema/pk-schema.xml>
INFO  org.apache.torque.generator.control.Controller - Start generation of File <https://builds.apache.org/job/torque4-test-project-hsqldb/ws/torque-test/target/generated-docs/datamodel.css>
INFO  org.apache.torque.generator.control.Controller - Processing source <https://builds.apache.org/job/torque4-test-project-hsqldb/ws/torque-test/target/torque/test/schema/qualified-table-name-schema.xml>
INFO  org.apache.torque.generator.control.Controller - Start generation of File <https://builds.apache.org/job/torque4-test-project-hsqldb/ws/torque-test/target/generated-docs/datamodel.css>
INFO  org.apache.torque.generator.control.Controller - Processing source <https://builds.apache.org/job/torque4-test-project-hsqldb/ws/torque-test/target/torque/test/schema/save-method-in-peer-schema.xml>
INFO  org.apache.torque.generator.control.Controller - Start generation of File <https://builds.apache.org/job/torque4-test-project-hsqldb/ws/torque-test/target/generated-docs/datamodel.css>
INFO  org.apache.torque.generator.control.Controller - Processing source <https://builds.apache.org/job/torque4-test-project-hsqldb/ws/torque-test/target/torque/test/schema/test-schema.xml>
INFO  org.apache.torque.generator.control.Controller - Start generation of File <https://builds.apache.org/job/torque4-test-project-hsqldb/ws/torque-test/target/generated-docs/datamodel.css>
INFO  org.apache.torque.generator.control.Controller - Processing source <https://builds.apache.org/job/torque4-test-project-hsqldb/ws/torque-test/target/torque/test/schema/types-schema.xml>
INFO  org.apache.torque.generator.control.Controller - Start generation of File <https://builds.apache.org/job/torque4-test-project-hsqldb/ws/torque-test/target/generated-docs/datamodel.css>
INFO  org.apache.torque.generator.control.Controller - Processing output html-datamodel
INFO  org.apache.torque.generator.control.Controller - Processing source <https://builds.apache.org/job/torque4-test-project-hsqldb/ws/torque-test/target/torque/test/schema/bookstore-schema.xml>
INFO  org.apache.torque.generator.control.Controller - Start generation of File <https://builds.apache.org/job/torque4-test-project-hsqldb/ws/torque-test/target/generated-docs/bookstore-schema.html>
INFO  org.apache.torque.generator.control.Controller - Processing source <https://builds.apache.org/job/torque4-test-project-hsqldb/ws/torque-test/target/torque/test/schema/databaseMapInit-schema.xml>
INFO  org.apache.torque.generator.control.Controller - Start generation of File <https://builds.apache.org/job/torque4-test-project-hsqldb/ws/torque-test/target/generated-docs/databaseMapInit-schema.html>
INFO  org.apache.torque.generator.control.Controller - Processing source <https://builds.apache.org/job/torque4-test-project-hsqldb/ws/torque-test/target/torque/test/schema/default-value-schema.xml>
INFO  org.apache.torque.generator.control.Controller - Start generation of File <https://builds.apache.org/job/torque4-test-project-hsqldb/ws/torque-test/target/generated-docs/default-value-schema.html>
INFO  org.apache.torque.generator.control.Controller - Processing source <https://builds.apache.org/job/torque4-test-project-hsqldb/ws/torque-test/target/torque/test/schema/foreign-key-schema.xml>
INFO  org.apache.torque.generator.control.Controller - Start generation of File <https://builds.apache.org/job/torque4-test-project-hsqldb/ws/torque-test/target/generated-docs/foreign-key-schema.html>
INFO  org.apache.torque.generator.control.Controller - Processing source <https://builds.apache.org/job/torque4-test-project-hsqldb/ws/torque-test/target/torque/test/schema/index.xml>
INFO  org.apache.torque.generator.control.Controller - Start generation of File <https://builds.apache.org/job/torque4-test-project-hsqldb/ws/torque-test/target/generated-docs/index.html>
INFO  org.apache.torque.generator.control.Controller - Processing source <https://builds.apache.org/job/torque4-test-project-hsqldb/ws/torque-test/target/torque/test/schema/pk-schema.xml>
INFO  org.apache.torque.generator.control.Controller - Start generation of File <https://builds.apache.org/job/torque4-test-project-hsqldb/ws/torque-test/target/generated-docs/pk-schema.html>
INFO  org.apache.torque.generator.control.Controller - Processing source <https://builds.apache.org/job/torque4-test-project-hsqldb/ws/torque-test/target/torque/test/schema/qualified-table-name-schema.xml>
INFO  org.apache.torque.generator.control.Controller - Start generation of File <https://builds.apache.org/job/torque4-test-project-hsqldb/ws/torque-test/target/generated-docs/qualified-table-name-schema.html>
INFO  org.apache.torque.generator.control.Controller - Processing source <https://builds.apache.org/job/torque4-test-project-hsqldb/ws/torque-test/target/torque/test/schema/save-method-in-peer-schema.xml>
INFO  org.apache.torque.generator.control.Controller - Start generation of File <https://builds.apache.org/job/torque4-test-project-hsqldb/ws/torque-test/target/generated-docs/save-method-in-peer-schema.html>
INFO  org.apache.torque.generator.control.Controller - Processing source <https://builds.apache.org/job/torque4-test-project-hsqldb/ws/torque-test/target/torque/test/schema/test-schema.xml>
INFO  org.apache.torque.generator.control.Controller - Start generation of File <https://builds.apache.org/job/torque4-test-project-hsqldb/ws/torque-test/target/generated-docs/test-schema.html>
INFO  org.apache.torque.generator.control.Controller - Processing source <https://builds.apache.org/job/torque4-test-project-hsqldb/ws/torque-test/target/torque/test/schema/types-schema.xml>
INFO  org.apache.torque.generator.control.Controller - Start generation of File <https://builds.apache.org/job/torque4-test-project-hsqldb/ws/torque-test/target/generated-docs/types-schema.html>
[INFO] Generation successful
[WARNING] The parameter expression: 'project.build.resources' used in mojo: 'process' has
been deprecated. Use 'project.resources' instead.
[INFO] [remote-resources:process {execution: default}]
[debug] execute contextualize
[INFO] [resources:resources {execution: default-resources}]
[INFO] Using 'ISO-8859-1' encoding to copy filtered resources.
[INFO] skip non existing resourceDirectory <https://builds.apache.org/job/torque4-test-project-hsqldb/ws/torque-test/src/main/resources>
[INFO] Copying 3 resources
[INFO] [compiler:compile {execution: default-compile}]
[INFO] Compiling 996 source files to <https://builds.apache.org/job/torque4-test-project-hsqldb/ws/torque-test/target/classes>
[INFO] -------------------------------------------------------------
[ERROR] COMPILATION ERROR : 
[INFO] -------------------------------------------------------------
[ERROR] <https://builds.apache.org/job/torque4-test-project-hsqldb/ws/torque-test/target/generated-sources/org/apache/torque/test/dbobject/base/BaseSaveMethodInObjectFk.java>:[305,62]
cannot find symbol
symbol  : class SaveMethodInPeerManager
location: package org.apache.torque.test.manager

[ERROR] <https://builds.apache.org/job/torque4-test-project-hsqldb/ws/torque-test/target/generated-sources/org/apache/torque/test/dbobject/base/BaseSaveMethodInObjectFk.java>:[325,62]
cannot find symbol
symbol  : class SaveMethodInPeerManager
location: package org.apache.torque.test.manager

[ERROR] <https://builds.apache.org/job/torque4-test-project-hsqldb/ws/torque-test/target/generated-sources/org/apache/torque/test/dbobject/base/BaseSaveMethodInObjectFk.java>:[329,46]
cannot find symbol
symbol  : class SaveMethodInPeerManager
location: package org.apache.torque.test.manager

[ERROR] <https://builds.apache.org/job/torque4-test-project-hsqldb/ws/torque-test/target/generated-sources/org/apache/torque/test/dbobject/base/BaseSaveMethodInObjectFk.java>:[647,50]
cannot find symbol
symbol  : class SaveMethodInObjectFkManager
location: package org.apache.torque.test.manager

[ERROR] <https://builds.apache.org/job/torque4-test-project-hsqldb/ws/torque-test/target/generated-sources/org/apache/torque/test/peer/base/BaseSaveMethodInObjectFkPeer.java>:[90,60]
cannot find symbol
symbol  : class SaveMethodInObjectFkManager
location: package org.apache.torque.test.manager

[ERROR] <https://builds.apache.org/job/torque4-test-project-hsqldb/ws/torque-test/target/generated-sources/org/apache/torque/test/dbobject/base/BaseSaveMethodInPeerFk.java>:[303,62]
cannot find symbol
symbol  : class SaveMethodInPeerManager
location: package org.apache.torque.test.manager

[ERROR] <https://builds.apache.org/job/torque4-test-project-hsqldb/ws/torque-test/target/generated-sources/org/apache/torque/test/dbobject/base/BaseSaveMethodInPeerFk.java>:[323,62]
cannot find symbol
symbol  : class SaveMethodInPeerManager
location: package org.apache.torque.test.manager

[ERROR] <https://builds.apache.org/job/torque4-test-project-hsqldb/ws/torque-test/target/generated-sources/org/apache/torque/test/dbobject/base/BaseSaveMethodInPeerFk.java>:[327,46]
cannot find symbol
symbol  : class SaveMethodInPeerManager
location: package org.apache.torque.test.manager

[ERROR] <https://builds.apache.org/job/torque4-test-project-hsqldb/ws/torque-test/target/generated-sources/org/apache/torque/test/peer/base/BaseSaveMethodInPeerPeer.java>:[87,60]
cannot find symbol
symbol  : class SaveMethodInPeerManager
location: package org.apache.torque.test.manager

[ERROR] <https://builds.apache.org/job/torque4-test-project-hsqldb/ws/torque-test/target/generated-sources/org/apache/torque/test/peer/base/BaseSaveMethodInPeerFkPeer.java>:[90,60]
cannot find symbol
symbol  : class SaveMethodInPeerFkManager
location: package org.apache.torque.test.manager

[ERROR] <https://builds.apache.org/job/torque4-test-project-hsqldb/ws/torque-test/target/generated-sources/org/apache/torque/test/peer/base/BaseSaveMethodInPeerPeerImpl.java>:[416,20]
cannot find symbol
symbol  : method isCacheOnSave()
location: class org.apache.torque.test.peer.base.BaseSaveMethodInPeerPeerImpl

[ERROR] <https://builds.apache.org/job/torque4-test-project-hsqldb/ws/torque-test/target/generated-sources/org/apache/torque/test/peer/base/BaseSaveMethodInPeerPeerImpl.java>:[418,50]
cannot find symbol
symbol  : class SaveMethodInPeerManager
location: package org.apache.torque.test.manager

[ERROR] <https://builds.apache.org/job/torque4-test-project-hsqldb/ws/torque-test/target/generated-sources/org/apache/torque/test/peer/base/BaseSaveMethodInPeerFkPeerImpl.java>:[416,20]
cannot find symbol
symbol  : method isCacheOnSave()
location: class org.apache.torque.test.peer.base.BaseSaveMethodInPeerFkPeerImpl

[ERROR] <https://builds.apache.org/job/torque4-test-project-hsqldb/ws/torque-test/target/generated-sources/org/apache/torque/test/peer/base/BaseSaveMethodInPeerFkPeerImpl.java>:[418,50]
cannot find symbol
symbol  : class SaveMethodInPeerFkManager
location: package org.apache.torque.test.manager

[INFO] 14 errors 
[INFO] -------------------------------------------------------------
[INFO] ------------------------------------------------------------------------
[ERROR] BUILD FAILURE
[INFO] ------------------------------------------------------------------------
[INFO] Compilation failure

<https://builds.apache.org/job/torque4-test-project-hsqldb/ws/torque-test/target/generated-sources/org/apache/torque/test/dbobject/base/BaseSaveMethodInObjectFk.java>:[305,62]
cannot find symbol
symbol  : class SaveMethodInPeerManager
location: package org.apache.torque.test.manager

<https://builds.apache.org/job/torque4-test-project-hsqldb/ws/torque-test/target/generated-sources/org/apache/torque/test/dbobject/base/BaseSaveMethodInObjectFk.java>:[325,62]
cannot find symbol
symbol  : class SaveMethodInPeerManager
location: package org.apache.torque.test.manager

<https://builds.apache.org/job/torque4-test-project-hsqldb/ws/torque-test/target/generated-sources/org/apache/torque/test/dbobject/base/BaseSaveMethodInObjectFk.java>:[329,46]
cannot find symbol
symbol  : class SaveMethodInPeerManager
location: package org.apache.torque.test.manager

<https://builds.apache.org/job/torque4-test-project-hsqldb/ws/torque-test/target/generated-sources/org/apache/torque/test/dbobject/base/BaseSaveMethodInObjectFk.java>:[647,50]
cannot find symbol
symbol  : class SaveMethodInObjectFkManager
location: package org.apache.torque.test.manager

<https://builds.apache.org/job/torque4-test-project-hsqldb/ws/torque-test/target/generated-sources/org/apache/torque/test/peer/base/BaseSaveMethodInObjectFkPeer.java>:[90,60]
cannot find symbol
symbol  : class SaveMethodInObjectFkManager
location: package org.apache.torque.test.manager

<https://builds.apache.org/job/torque4-test-project-hsqldb/ws/torque-test/target/generated-sources/org/apache/torque/test/dbobject/base/BaseSaveMethodInPeerFk.java>:[303,62]
cannot find symbol
symbol  : class SaveMethodInPeerManager
location: package org.apache.torque.test.manager

<https://builds.apache.org/job/torque4-test-project-hsqldb/ws/torque-test/target/generated-sources/org/apache/torque/test/dbobject/base/BaseSaveMethodInPeerFk.java>:[323,62]
cannot find symbol
symbol  : class SaveMethodInPeerManager
location: package org.apache.torque.test.manager

<https://builds.apache.org/job/torque4-test-project-hsqldb/ws/torque-test/target/generated-sources/org/apache/torque/test/dbobject/base/BaseSaveMethodInPeerFk.java>:[327,46]
cannot find symbol
symbol  : class SaveMethodInPeerManager
location: package org.apache.torque.test.manager

<https://builds.apache.org/job/torque4-test-project-hsqldb/ws/torque-test/target/generated-sources/org/apache/torque/test/peer/base/BaseSaveMethodInPeerPeer.java>:[87,60]
cannot find symbol
symbol  : class SaveMethodInPeerManager
location: package org.apache.torque.test.manager

<https://builds.apache.org/job/torque4-test-project-hsqldb/ws/torque-test/target/generated-sources/org/apache/torque/test/peer/base/BaseSaveMethodInPeerFkPeer.java>:[90,60]
cannot find symbol
symbol  : class SaveMethodInPeerFkManager
location: package org.apache.torque.test.manager

<https://builds.apache.org/job/torque4-test-project-hsqldb/ws/torque-test/target/generated-sources/org/apache/torque/test/peer/base/BaseSaveMethodInPeerPeerImpl.java>:[416,20]
cannot find symbol
symbol  : method isCacheOnSave()
location: class org.apache.torque.test.peer.base.BaseSaveMethodInPeerPeerImpl

<https://builds.apache.org/job/torque4-test-project-hsqldb/ws/torque-test/target/generated-sources/org/apache/torque/test/peer/base/BaseSaveMethodInPeerPeerImpl.java>:[418,50]
cannot find symbol
symbol  : class SaveMethodInPeerManager
location: package org.apache.torque.test.manager

<https://builds.apache.org/job/torque4-test-project-hsqldb/ws/torque-test/target/generated-sources/org/apache/torque/test/peer/base/BaseSaveMethodInPeerFkPeerImpl.java>:[416,20]
cannot find symbol
symbol  : method isCacheOnSave()
location: class org.apache.torque.test.peer.base.BaseSaveMethodInPeerFkPeerImpl

<https://builds.apache.org/job/torque4-test-project-hsqldb/ws/torque-test/target/generated-sources/org/apache/torque/test/peer/base/BaseSaveMethodInPeerFkPeerImpl.java>:[418,50]
cannot find symbol
symbol  : class SaveMethodInPeerFkManager
location: package org.apache.torque.test.manager


[INFO] ------------------------------------------------------------------------
[INFO] For more information, run Maven with the -e switch
[INFO] ------------------------------------------------------------------------
[INFO] Total time: 5 minutes 25 seconds
[INFO] Finished at: Thu Sep 04 21:54:44 UTC 2014
[INFO] Final Memory: 122M/524M
[INFO] ------------------------------------------------------------------------
[JENKINS] Archiving <https://builds.apache.org/job/torque4-test-project-hsqldb/ws/torque-ant-tasks/pom.xml>
to org.apache.torque/torque-ant-tasks/4.1-SNAPSHOT/torque-ant-tasks-4.1-SNAPSHOT.pom
[JENKINS] Archiving <https://builds.apache.org/job/torque4-test-project-hsqldb/ws/torque-ant-tasks/target/torque-ant-tasks-4.1-SNAPSHOT.jar>
to org.apache.torque/torque-ant-tasks/4.1-SNAPSHOT/torque-ant-tasks-4.1-SNAPSHOT.jar
[JENKINS] Archiving <https://builds.apache.org/job/torque4-test-project-hsqldb/ws/torque-ant-tasks/target/torque-ant-tasks-4.1-SNAPSHOT-sources.jar>
to org.apache.torque/torque-ant-tasks/4.1-SNAPSHOT/torque-ant-tasks-4.1-SNAPSHOT-sources.jar
Sending artifact delta relative to torque4-test-project-hsqldb ? Torque Generator Ant tasks
#288
Archived 3 artifacts
Archive block size is 32768
Received 0 blocks and 28389 bytes
Compression is 0.0%
Took 0.15 sec
[JENKINS] Archiving <https://builds.apache.org/job/torque4-test-project-hsqldb/ws/torque-test/pom.xml>
to org.apache.torque/torque-test/4.1-SNAPSHOT/torque-test-4.1-SNAPSHOT.pom
Sending artifact delta relative to torque4-test-project-hsqldb ? Torque Test Project #288
Archived 1 artifacts
Archive block size is 32768
Received 0 blocks and 49963 bytes
Compression is 0.0%
Took 0.29 sec
[JENKINS] Archiving <https://builds.apache.org/job/torque4-test-project-hsqldb/ws/pom.xml>
to org.apache.torque/torque/4.1-SNAPSHOT/torque-4.1-SNAPSHOT.pom
Sending artifact delta relative to torque4-test-project-hsqldb ? Torque Maven Parent #288
Archived 1 artifacts
Archive block size is 32768
Received 0 blocks and 17106 bytes
Compression is 0.0%
Took 0.1 sec
[JENKINS] Archiving <https://builds.apache.org/job/torque4-test-project-hsqldb/ws/torque-runtime/pom.xml>
to org.apache.torque/torque-runtime/4.1-SNAPSHOT/torque-runtime-4.1-SNAPSHOT.pom
[JENKINS] Archiving <https://builds.apache.org/job/torque4-test-project-hsqldb/ws/torque-runtime/target/torque-runtime-4.1-SNAPSHOT.jar>
to org.apache.torque/torque-runtime/4.1-SNAPSHOT/torque-runtime-4.1-SNAPSHOT.jar
[JENKINS] Archiving <https://builds.apache.org/job/torque4-test-project-hsqldb/ws/torque-runtime/target/torque-runtime-4.1-SNAPSHOT-sources.jar>
to org.apache.torque/torque-runtime/4.1-SNAPSHOT/torque-runtime-4.1-SNAPSHOT-sources.jar
Sending artifact delta relative to torque4-test-project-hsqldb ? Torque Runtime #288
Archived 3 artifacts
Archive block size is 32768
Received 0 blocks and 466933 bytes
Compression is 0.0%
Took 0.44 sec
[JENKINS] Archiving <https://builds.apache.org/job/torque4-test-project-hsqldb/ws/torque-generator/pom.xml>
to org.apache.torque/torque-generator/4.1-SNAPSHOT/torque-generator-4.1-SNAPSHOT.pom
[JENKINS] Archiving <https://builds.apache.org/job/torque4-test-project-hsqldb/ws/torque-generator/target/torque-generator-4.1-SNAPSHOT.jar>
to org.apache.torque/torque-generator/4.1-SNAPSHOT/torque-generator-4.1-SNAPSHOT.jar
[JENKINS] Archiving <https://builds.apache.org/job/torque4-test-project-hsqldb/ws/torque-generator/target/torque-generator-4.1-SNAPSHOT-sources.jar>
to org.apache.torque/torque-generator/4.1-SNAPSHOT/torque-generator-4.1-SNAPSHOT-sources.jar
Sending artifact delta relative to torque4-test-project-hsqldb ? Torque Generator #288
Archived 3 artifacts
Archive block size is 32768
Received 0 blocks and 794355 bytes
Compression is 0.0%
Took 2.7 sec
[JENKINS] Archiving <https://builds.apache.org/job/torque4-test-project-hsqldb/ws/torque-templates/pom.xml>
to org.apache.torque/torque-templates/4.1-SNAPSHOT/torque-templates-4.1-SNAPSHOT.pom
[JENKINS] Archiving <https://builds.apache.org/job/torque4-test-project-hsqldb/ws/torque-templates/target/torque-templates-4.1-SNAPSHOT.jar>
to org.apache.torque/torque-templates/4.1-SNAPSHOT/torque-templates-4.1-SNAPSHOT.jar
[JENKINS] Archiving <https://builds.apache.org/job/torque4-test-project-hsqldb/ws/torque-templates/target/torque-templates-4.1-SNAPSHOT-sources.jar>
to org.apache.torque/torque-templates/4.1-SNAPSHOT/torque-templates-4.1-SNAPSHOT-sources.jar
Sending artifact delta relative to torque4-test-project-hsqldb ? Torque Templates #288
Archived 3 artifacts
Archive block size is 32768
Received 0 blocks and 1067419 bytes
Compression is 0.0%
Took 5.2 sec
[JENKINS] Archiving <https://builds.apache.org/job/torque4-test-project-hsqldb/ws/torque-site/pom.xml>
to org.apache.torque/torque-site/4.1-SNAPSHOT/torque-site-4.1-SNAPSHOT.pom
[JENKINS] Archiving <https://builds.apache.org/job/torque4-test-project-hsqldb/ws/torque-site/target/torque-site-4.1-SNAPSHOT-site.xml>
to org.apache.torque/torque-site/4.1-SNAPSHOT/torque-site-4.1-SNAPSHOT-site.xml
Sending artifact delta relative to torque4-test-project-hsqldb ? Torque Site #288
Archived 2 artifacts
Archive block size is 32768
Received 0 blocks and 24135 bytes
Compression is 0.0%
Took 0.14 sec
[JENKINS] Archiving <https://builds.apache.org/job/torque4-test-project-hsqldb/ws/torque-maven-plugin/pom.xml>
to org.apache.torque/torque-maven-plugin/4.1-SNAPSHOT/torque-maven-plugin-4.1-SNAPSHOT.pom
[JENKINS] Archiving <https://builds.apache.org/job/torque4-test-project-hsqldb/ws/torque-maven-plugin/target/torque-maven-plugin-4.1-SNAPSHOT.jar>
to org.apache.torque/torque-maven-plugin/4.1-SNAPSHOT/torque-maven-plugin-4.1-SNAPSHOT.jar
[JENKINS] Archiving <https://builds.apache.org/job/torque4-test-project-hsqldb/ws/torque-maven-plugin/target/torque-maven-plugin-4.1-SNAPSHOT-sources.jar>
to org.apache.torque/torque-maven-plugin/4.1-SNAPSHOT/torque-maven-plugin-4.1-SNAPSHOT-sources.jar
Sending artifact delta relative to torque4-test-project-hsqldb ? Torque Generator Maven 2
Plugin #288
Archived 3 artifacts
Archive block size is 32768
Received 0 blocks and 39466 bytes
Compression is 0.0%
Took 2.3 sec
Sending e-mails to: torque-dev@db.apache.org
channel stopped

---------------------------------------------------------------------
To unsubscribe, e-mail: torque-dev-unsubscribe@db.apache.org
For additional commands, e-mail: torque-dev-help@db.apache.org


Mime
View raw message