db-torque-dev mailing list archives

Site index · List index
Message view « Date » · « Thread »
Top « Date » · « Thread »
From Apache Jenkins Server <jenk...@builds.apache.org>
Subject Build failed in Jenkins: Torque4-trunk #483
Date Thu, 06 Mar 2014 00:27:45 GMT
See <https://builds.apache.org/job/Torque4-trunk/483/changes>

Changes:

[tfischer] TORQUE-310 detect presence of class name on already cleaned file, not on original
file

[tfischer] Fix test

[tfischer] TORQUE-310 add More realistic organize-imports-test

[tfischer] revert xerces version to 2.9.1 (2.10 fails tests)

[tfischer] Fix test name

[tfischer] TORQUE-310 document postprocessors

[tfischer] add insert ... select ... docs

[tfischer] TORQUE-310 add simple way to remove unused imports

[tfischer] use final where possible
add toString method

[tfischer] use final where possible
add toString method

[tfischer] use final where possible
javadoc fixes

[tfischer] new xerces version
exclude xmlParserAPIs dependency

[tfischer] use final where possible

[tfischer] TORQUE-310 add processors to organize imports and to convert windows linefeeds
to unix linefeeds.

------------------------------------------
[...truncated 5716 lines...]
DEBUG org.apache.torque.generator.configuration.PackageResources - Found the following files
[]
DEBUG org.apache.torque.generator.configuration.PackageResources - Analyzing directory src/test/deeplyNestedMergepoints/src/main/torque-gen/templates/.svn/tmp/prop-base
with subdirectory .svn/tmp/prop-base/ for files with suffix null
DEBUG org.apache.torque.generator.configuration.PackageResources - Found the following files
[]
DEBUG org.apache.torque.generator.configuration.PackageResources - Found the following files
[]
DEBUG org.apache.torque.generator.configuration.PackageResources - Analyzing directory src/test/deeplyNestedMergepoints/src/main/torque-gen/templates/.svn/props
with subdirectory .svn/props/ for files with suffix null
DEBUG org.apache.torque.generator.configuration.PackageResources - Found the following files
[]
DEBUG org.apache.torque.generator.configuration.PackageResources - Analyzing directory src/test/deeplyNestedMergepoints/src/main/torque-gen/templates/.svn/prop-base
with subdirectory .svn/prop-base/ for files with suffix null
DEBUG org.apache.torque.generator.configuration.PackageResources - Found the following files
[]
DEBUG org.apache.torque.generator.configuration.PackageResources - Found the following files
[.svn/text-base/content.vm.svn-base, .svn/text-base/nesting.vm.svn-base, .svn/entries, .svn/all-wcprops]
DEBUG org.apache.torque.generator.configuration.PackageResources - Found the following files
[content.vm, .svn/text-base/content.vm.svn-base, .svn/text-base/nesting.vm.svn-base, .svn/entries,
.svn/all-wcprops, nesting.vm]
DEBUG org.apache.torque.generator.configuration.UnitConfigurationReader - Sucessfully read
unitConfiguration for unit src/test/deeplyNestedMergepoints/src/main/torque-gen
INFO  org.apache.torque.generator.control.Controller - readConfiguration() : Configuration
read.
DEBUG org.apache.torque.generator.control.Controller - processGenerationUnit() : start
DEBUG org.apache.torque.generator.control.Controller - processGenerationUnit() : Loglevel
applied.
INFO  org.apache.torque.generator.control.Controller - Processing output output
DEBUG org.apache.torque.generator.source.stream.FileSourceProvider - initInternal(): 1 matching
files found.
INFO  org.apache.torque.generator.control.Controller - Processing source <https://builds.apache.org/job/Torque4-trunk/ws/torque4-trunk/torque-generator/src/test/deeplyNestedMergepoints/src/main/torque-gen/src/./source.xml>
DEBUG org.apache.torque.generator.source.stream.FileSource - start creating root Element
DEBUG org.apache.torque.generator.source.stream.FileSource - Reading file <https://builds.apache.org/job/Torque4-trunk/ws/torque4-trunk/torque-generator/src/test/deeplyNestedMergepoints/src/main/torque-gen/src/./source.xml>
of type xml
DEBUG org.apache.torque.generator.source.stream.FileSource - finished creating root Element,
source is
<sourceElement id="1"/>

DEBUG org.apache.torque.generator.control.Controller - Processing new model (name=sourceElement,attributes=(),children=())
INFO  org.apache.torque.generator.control.Controller - Start generation of File <https://builds.apache.org/job/Torque4-trunk/ws/torque4-trunk/torque-generator/target/test/deeplyNestedMergepoints/output.txt>
DEBUG org.apache.torque.generator.outlet.OutletImpl - Executing outlet nestingOutlet0 on element
(name=sourceElement,attributes=(),children=())
DEBUG org.apache.torque.generator.template.velocity.VelocityOutlet - Start executing VelocityOutlet
nestingOutlet0
DEBUG org.apache.torque.generator.template.velocity.VelocityOutlet - Put options in context
[]
DEBUG org.apache.torque.generator.template.velocity.VelocityOutlet - Put attributes in context
[]
DEBUG org.apache.torque.generator.template.velocity.VelocityOutlet - Put variables in context
[]
DEBUG org.apache.torque.generator.configuration.DirectoryConfigurationProvider - Reading template
file: '<https://builds.apache.org/job/Torque4-trunk/ws/torque4-trunk/torque-generator/src/test/deeplyNestedMergepoints/src/main/torque-gen/templates/nesting.vm'>
DEBUG org.apache.torque.generator.outlet.OutletImpl - mergepoint() : Start for mergepoint
mergepoint
DEBUG org.apache.torque.generator.outlet.OutletImpl - mergepoint() : Executing action (ApplyAction:
path = ., outlet = nestingOutlet1, acceptNotSet = true)
DEBUG org.apache.torque.generator.outlet.OutletImpl - Executing outlet nestingOutlet1 on element
(name=sourceElement,attributes=(),children=())
DEBUG org.apache.torque.generator.template.velocity.VelocityOutlet - Start executing VelocityOutlet
nestingOutlet1
DEBUG org.apache.torque.generator.template.velocity.VelocityOutlet - Put options in context
[]
DEBUG org.apache.torque.generator.template.velocity.VelocityOutlet - Put attributes in context
[]
DEBUG org.apache.torque.generator.template.velocity.VelocityOutlet - Put variables in context
[]
DEBUG org.apache.torque.generator.configuration.DirectoryConfigurationProvider - Reading template
file: '<https://builds.apache.org/job/Torque4-trunk/ws/torque4-trunk/torque-generator/src/test/deeplyNestedMergepoints/src/main/torque-gen/templates/nesting.vm'>
DEBUG org.apache.torque.generator.outlet.OutletImpl - mergepoint() : Start for mergepoint
mergepoint
DEBUG org.apache.torque.generator.outlet.OutletImpl - mergepoint() : Executing action (ApplyAction:
path = ., outlet = nestingOutlet2, acceptNotSet = true)
DEBUG org.apache.torque.generator.outlet.OutletImpl - Executing outlet nestingOutlet2 on element
(name=sourceElement,attributes=(),children=())
DEBUG org.apache.torque.generator.template.velocity.VelocityOutlet - Start executing VelocityOutlet
nestingOutlet2
DEBUG org.apache.torque.generator.template.velocity.VelocityOutlet - Put options in context
[]
DEBUG org.apache.torque.generator.template.velocity.VelocityOutlet - Put attributes in context
[]
DEBUG org.apache.torque.generator.template.velocity.VelocityOutlet - Put variables in context
[]
DEBUG org.apache.torque.generator.configuration.DirectoryConfigurationProvider - Reading template
file: '<https://builds.apache.org/job/Torque4-trunk/ws/torque4-trunk/torque-generator/src/test/deeplyNestedMergepoints/src/main/torque-gen/templates/nesting.vm'>
DEBUG org.apache.torque.generator.outlet.OutletImpl - mergepoint() : Start for mergepoint
mergepoint
DEBUG org.apache.torque.generator.outlet.OutletImpl - mergepoint() : Executing action (ApplyAction:
path = ., outlet = nestingOutlet3, acceptNotSet = true)
DEBUG org.apache.torque.generator.outlet.OutletImpl - Executing outlet nestingOutlet3 on element
(name=sourceElement,attributes=(),children=())
DEBUG org.apache.torque.generator.template.velocity.VelocityOutlet - Start executing VelocityOutlet
nestingOutlet3
DEBUG org.apache.torque.generator.template.velocity.VelocityOutlet - Put options in context
[]
DEBUG org.apache.torque.generator.template.velocity.VelocityOutlet - Put attributes in context
[]
DEBUG org.apache.torque.generator.template.velocity.VelocityOutlet - Put variables in context
[]
DEBUG org.apache.torque.generator.configuration.DirectoryConfigurationProvider - Reading template
file: '<https://builds.apache.org/job/Torque4-trunk/ws/torque4-trunk/torque-generator/src/test/deeplyNestedMergepoints/src/main/torque-gen/templates/nesting.vm'>
DEBUG org.apache.torque.generator.outlet.OutletImpl - mergepoint() : Start for mergepoint
mergepoint
DEBUG org.apache.torque.generator.outlet.OutletImpl - mergepoint() : Executing action (ApplyAction:
path = ., outlet = nestingOutlet4, acceptNotSet = true)
DEBUG org.apache.torque.generator.outlet.OutletImpl - Executing outlet nestingOutlet4 on element
(name=sourceElement,attributes=(),children=())
DEBUG org.apache.torque.generator.template.velocity.VelocityOutlet - Start executing VelocityOutlet
nestingOutlet4
DEBUG org.apache.torque.generator.template.velocity.VelocityOutlet - Put options in context
[]
DEBUG org.apache.torque.generator.template.velocity.VelocityOutlet - Put attributes in context
[]
DEBUG org.apache.torque.generator.template.velocity.VelocityOutlet - Put variables in context
[]
DEBUG org.apache.torque.generator.configuration.DirectoryConfigurationProvider - Reading template
file: '<https://builds.apache.org/job/Torque4-trunk/ws/torque4-trunk/torque-generator/src/test/deeplyNestedMergepoints/src/main/torque-gen/templates/nesting.vm'>
DEBUG org.apache.torque.generator.outlet.OutletImpl - mergepoint() : Start for mergepoint
mergepoint
DEBUG org.apache.torque.generator.outlet.OutletImpl - mergepoint() : Executing action (ApplyAction:
path = ., outlet = nestingOutlet5, acceptNotSet = true)
DEBUG org.apache.torque.generator.outlet.OutletImpl - Executing outlet nestingOutlet5 on element
(name=sourceElement,attributes=(),children=())
DEBUG org.apache.torque.generator.template.velocity.VelocityOutlet - Start executing VelocityOutlet
nestingOutlet5
DEBUG org.apache.torque.generator.template.velocity.VelocityOutlet - Put options in context
[]
DEBUG org.apache.torque.generator.template.velocity.VelocityOutlet - Put attributes in context
[]
DEBUG org.apache.torque.generator.template.velocity.VelocityOutlet - Put variables in context
[]
DEBUG org.apache.torque.generator.configuration.DirectoryConfigurationProvider - Reading template
file: '<https://builds.apache.org/job/Torque4-trunk/ws/torque4-trunk/torque-generator/src/test/deeplyNestedMergepoints/src/main/torque-gen/templates/nesting.vm'>
DEBUG org.apache.torque.generator.outlet.OutletImpl - mergepoint() : Start for mergepoint
mergepoint
DEBUG org.apache.torque.generator.outlet.OutletImpl - mergepoint() : Executing action (ApplyAction:
path = ., outlet = nestingOutlet6, acceptNotSet = true)
DEBUG org.apache.torque.generator.outlet.OutletImpl - Executing outlet nestingOutlet6 on element
(name=sourceElement,attributes=(),children=())
DEBUG org.apache.torque.generator.template.velocity.VelocityOutlet - Start executing VelocityOutlet
nestingOutlet6
DEBUG org.apache.torque.generator.template.velocity.VelocityOutlet - Put options in context
[]
DEBUG org.apache.torque.generator.template.velocity.VelocityOutlet - Put attributes in context
[]
DEBUG org.apache.torque.generator.template.velocity.VelocityOutlet - Put variables in context
[]
DEBUG org.apache.torque.generator.configuration.DirectoryConfigurationProvider - Reading template
file: '<https://builds.apache.org/job/Torque4-trunk/ws/torque4-trunk/torque-generator/src/test/deeplyNestedMergepoints/src/main/torque-gen/templates/nesting.vm'>
DEBUG org.apache.torque.generator.outlet.OutletImpl - mergepoint() : Start for mergepoint
mergepoint
DEBUG org.apache.torque.generator.outlet.OutletImpl - mergepoint() : Executing action (ApplyAction:
path = ., outlet = nestingOutlet7, acceptNotSet = true)
DEBUG org.apache.torque.generator.outlet.OutletImpl - Executing outlet nestingOutlet7 on element
(name=sourceElement,attributes=(),children=())
DEBUG org.apache.torque.generator.template.velocity.VelocityOutlet - Start executing VelocityOutlet
nestingOutlet7
DEBUG org.apache.torque.generator.template.velocity.VelocityOutlet - Put options in context
[]
DEBUG org.apache.torque.generator.template.velocity.VelocityOutlet - Put attributes in context
[]
DEBUG org.apache.torque.generator.template.velocity.VelocityOutlet - Put variables in context
[]
DEBUG org.apache.torque.generator.configuration.DirectoryConfigurationProvider - Reading template
file: '<https://builds.apache.org/job/Torque4-trunk/ws/torque4-trunk/torque-generator/src/test/deeplyNestedMergepoints/src/main/torque-gen/templates/nesting.vm'>
DEBUG org.apache.torque.generator.outlet.OutletImpl - mergepoint() : Start for mergepoint
mergepoint
DEBUG org.apache.torque.generator.outlet.OutletImpl - mergepoint() : Executing action (ApplyAction:
path = ., outlet = nestingOutlet8, acceptNotSet = true)
DEBUG org.apache.torque.generator.outlet.OutletImpl - Executing outlet nestingOutlet8 on element
(name=sourceElement,attributes=(),children=())
DEBUG org.apache.torque.generator.template.velocity.VelocityOutlet - Start executing VelocityOutlet
nestingOutlet8
DEBUG org.apache.torque.generator.template.velocity.VelocityOutlet - Put options in context
[]
DEBUG org.apache.torque.generator.template.velocity.VelocityOutlet - Put attributes in context
[]
DEBUG org.apache.torque.generator.template.velocity.VelocityOutlet - Put variables in context
[]
DEBUG org.apache.torque.generator.configuration.DirectoryConfigurationProvider - Reading template
file: '<https://builds.apache.org/job/Torque4-trunk/ws/torque4-trunk/torque-generator/src/test/deeplyNestedMergepoints/src/main/torque-gen/templates/nesting.vm'>
DEBUG org.apache.torque.generator.outlet.OutletImpl - mergepoint() : Start for mergepoint
mergepoint
DEBUG org.apache.torque.generator.outlet.OutletImpl - mergepoint() : Executing action (ApplyAction:
path = ., outlet = nestingOutlet9, acceptNotSet = true)
DEBUG org.apache.torque.generator.outlet.OutletImpl - Executing outlet nestingOutlet9 on element
(name=sourceElement,attributes=(),children=())
DEBUG org.apache.torque.generator.template.velocity.VelocityOutlet - Start executing VelocityOutlet
nestingOutlet9
DEBUG org.apache.torque.generator.template.velocity.VelocityOutlet - Put options in context
[]
DEBUG org.apache.torque.generator.template.velocity.VelocityOutlet - Put attributes in context
[]
DEBUG org.apache.torque.generator.template.velocity.VelocityOutlet - Put variables in context
[]
DEBUG org.apache.torque.generator.configuration.DirectoryConfigurationProvider - Reading template
file: '<https://builds.apache.org/job/Torque4-trunk/ws/torque4-trunk/torque-generator/src/test/deeplyNestedMergepoints/src/main/torque-gen/templates/nesting.vm'>
DEBUG org.apache.torque.generator.outlet.OutletImpl - mergepoint() : Start for mergepoint
mergepoint
DEBUG org.apache.torque.generator.outlet.OutletImpl - mergepoint() : Executing action (ApplyAction:
path = ., outlet = contentOutlet, acceptNotSet = true)
DEBUG org.apache.torque.generator.outlet.OutletImpl - Executing outlet contentOutlet on element
(name=sourceElement,attributes=(),children=())
DEBUG org.apache.torque.generator.template.velocity.VelocityOutlet - Start executing VelocityOutlet
contentOutlet
DEBUG org.apache.torque.generator.template.velocity.VelocityOutlet - Put options in context
[]
DEBUG org.apache.torque.generator.template.velocity.VelocityOutlet - Put attributes in context
[]
DEBUG org.apache.torque.generator.template.velocity.VelocityOutlet - Put variables in context
[]
DEBUG org.apache.torque.generator.configuration.DirectoryConfigurationProvider - Reading template
file: '<https://builds.apache.org/job/Torque4-trunk/ws/torque4-trunk/torque-generator/src/test/deeplyNestedMergepoints/src/main/torque-gen/templates/content.vm'>
DEBUG org.apache.torque.generator.template.velocity.VelocityOutlet - End executing VelocityOutlet
contentOutlet
DEBUG org.apache.torque.generator.outlet.OutletImpl - mergepoint() : End for mergepoint mergepoint
DEBUG org.apache.torque.generator.template.velocity.VelocityOutlet - End executing VelocityOutlet
nestingOutlet9
DEBUG org.apache.torque.generator.outlet.OutletImpl - mergepoint() : End for mergepoint mergepoint
DEBUG org.apache.torque.generator.template.velocity.VelocityOutlet - End executing VelocityOutlet
nestingOutlet8
DEBUG org.apache.torque.generator.outlet.OutletImpl - mergepoint() : End for mergepoint mergepoint
DEBUG org.apache.torque.generator.template.velocity.VelocityOutlet - End executing VelocityOutlet
nestingOutlet7
DEBUG org.apache.torque.generator.outlet.OutletImpl - mergepoint() : End for mergepoint mergepoint
DEBUG org.apache.torque.generator.template.velocity.VelocityOutlet - End executing VelocityOutlet
nestingOutlet6
DEBUG org.apache.torque.generator.outlet.OutletImpl - mergepoint() : End for mergepoint mergepoint
DEBUG org.apache.torque.generator.template.velocity.VelocityOutlet - End executing VelocityOutlet
nestingOutlet5
DEBUG org.apache.torque.generator.outlet.OutletImpl - mergepoint() : End for mergepoint mergepoint
DEBUG org.apache.torque.generator.template.velocity.VelocityOutlet - End executing VelocityOutlet
nestingOutlet4
DEBUG org.apache.torque.generator.outlet.OutletImpl - mergepoint() : End for mergepoint mergepoint
DEBUG org.apache.torque.generator.template.velocity.VelocityOutlet - End executing VelocityOutlet
nestingOutlet3
DEBUG org.apache.torque.generator.outlet.OutletImpl - mergepoint() : End for mergepoint mergepoint
DEBUG org.apache.torque.generator.template.velocity.VelocityOutlet - End executing VelocityOutlet
nestingOutlet2
DEBUG org.apache.torque.generator.outlet.OutletImpl - mergepoint() : End for mergepoint mergepoint
DEBUG org.apache.torque.generator.template.velocity.VelocityOutlet - End executing VelocityOutlet
nestingOutlet1
DEBUG org.apache.torque.generator.outlet.OutletImpl - mergepoint() : End for mergepoint mergepoint
DEBUG org.apache.torque.generator.template.velocity.VelocityOutlet - End executing VelocityOutlet
nestingOutlet0
DEBUG org.apache.torque.generator.control.Controller - End generation of Output File target/test/deeplyNestedMergepoints/output.txt
Tests run: 1, Failures: 0, Errors: 0, Skipped: 0, Time elapsed: 0.055 sec
Running org.apache.torque.generator.source.stream.CombinedFileSourceTest
Tests run: 5, Failures: 0, Errors: 0, Skipped: 0, Time elapsed: 0.132 sec
Running org.apache.torque.generator.control.OutputEncodingTest
INFO  org.apache.torque.generator.control.Controller - readConfiguration() : Starting to read
configuration files
INFO  org.apache.torque.generator.java.JavaOutlet - foo set to ???
INFO  org.apache.torque.generator.java.JavaOutlet - bar set to ???
INFO  org.apache.torque.generator.control.Controller - readConfiguration() : Configuration
read.
INFO  org.apache.torque.generator.control.Controller - Processing output defaultEncodingOutput
INFO  org.apache.torque.generator.control.Controller - Processing source <https://builds.apache.org/job/Torque4-trunk/ws/torque4-trunk/torque-generator/src/test/outputEncoding/src/main/torque-gen/src/./source.xml>
INFO  org.apache.torque.generator.control.Controller - Start generation of File <https://builds.apache.org/job/Torque4-trunk/ws/torque4-trunk/torque-generator/target/test/outputEncoding/defaultEncoding.txt>
INFO  org.apache.torque.generator.control.Controller - Processing output UTF8-Output
INFO  org.apache.torque.generator.control.Controller - Processing source <https://builds.apache.org/job/Torque4-trunk/ws/torque4-trunk/torque-generator/src/test/outputEncoding/src/main/torque-gen/src/./source.xml>
INFO  org.apache.torque.generator.control.Controller - Start generation of File <https://builds.apache.org/job/Torque4-trunk/ws/torque4-trunk/torque-generator/target/test/outputEncoding/utf8.txt>
INFO  org.apache.torque.generator.control.Controller - Processing output ISO8859-1-Output
INFO  org.apache.torque.generator.control.Controller - Processing source <https://builds.apache.org/job/Torque4-trunk/ws/torque4-trunk/torque-generator/src/test/outputEncoding/src/main/torque-gen/src/./source.xml>
INFO  org.apache.torque.generator.control.Controller - Start generation of File <https://builds.apache.org/job/Torque4-trunk/ws/torque4-trunk/torque-generator/target/test/outputEncoding/iso-8859-1.txt>
Tests run: 1, Failures: 0, Errors: 0, Skipped: 0, Time elapsed: 0.051 sec
Running org.apache.torque.generator.source.transform.model.PropertyAccessTest
Tests run: 67, Failures: 0, Errors: 0, Skipped: 0, Time elapsed: 0.052 sec
Running org.apache.torque.generator.source.SourcePathTest
Tests run: 24, Failures: 0, Errors: 0, Skipped: 0, Time elapsed: 0.025 sec
Running org.apache.torque.generator.source.jdbc.JdbcMetadataSourceTest
Tests run: 1, Failures: 0, Errors: 0, Skipped: 0, Time elapsed: 1.676 sec
Running org.apache.torque.generator.outlet.java.JavadocOutletTest
Tests run: 18, Failures: 0, Errors: 0, Skipped: 0, Time elapsed: 0.011 sec

Results :

Tests run: 299, Failures: 0, Errors: 0, Skipped: 0

[JENKINS] Recording test results
[INFO] 
[INFO] --- maven-jar-plugin:2.4:jar (default-jar) @ torque-generator ---
[INFO] Building jar: <https://builds.apache.org/job/Torque4-trunk/ws/torque4-trunk/torque-generator/target/torque-generator-4.1-SNAPSHOT.jar>
[INFO] 
[INFO] --- maven-site-plugin:2.4:attach-descriptor (attach-descriptor) @ torque-generator
---
[INFO] 
[INFO] --- maven-source-plugin:2.1.2:jar-no-fork (attach-sources) @ torque-generator ---
[INFO] org already added, skipping
[INFO] org/apache already added, skipping
[INFO] org/apache/torque already added, skipping
[INFO] org/apache/torque/generator already added, skipping
[INFO] org/apache/torque/generator/configuration already added, skipping
[INFO] META-INF already added, skipping
[INFO] META-INF/NOTICE already added, skipping
[INFO] META-INF/DEPENDENCIES already added, skipping
[INFO] META-INF/LICENSE already added, skipping
[INFO] Building jar: <https://builds.apache.org/job/Torque4-trunk/ws/torque4-trunk/torque-generator/target/torque-generator-4.1-SNAPSHOT-sources.jar>
[INFO] org already added, skipping
[INFO] org/apache already added, skipping
[INFO] org/apache/torque already added, skipping
[INFO] org/apache/torque/generator already added, skipping
[INFO] org/apache/torque/generator/configuration already added, skipping
[INFO] META-INF already added, skipping
[INFO] META-INF/NOTICE already added, skipping
[INFO] META-INF/DEPENDENCIES already added, skipping
[INFO] META-INF/LICENSE already added, skipping
[INFO] 
[INFO] --- apache-rat-plugin:0.8:check (default) @ torque-generator ---
[INFO] Exclude: velocity.log
[INFO] Exclude: .checkstyle
[INFO] Exclude: checkstyle-cache.ccf
[INFO] Exclude: derby.log
[INFO] Exclude: LICENSE-EDL.txt
[INFO] Exclude: DEPENDENCIES
[INFO] Exclude: torque-test/target/**/*
[INFO] Exclude: torque-test/.classpath
[INFO] Exclude: torque-test/.project
[INFO] Exclude: torque-test/.settings/**
[INFO] Exclude: torque-test/src/main/generated-java/**/*
[INFO] Exclude: torque-test/derby.log
[CHECKSTYLE] No report found for mojo check
[PMD] No report found for mojo check
[INFO] ------------------------------------------------------------------------
[INFO] Reactor Summary:
[INFO] 
[INFO] Torque Maven Parent ............................... SUCCESS [1:14.080s]
[INFO] Torque Runtime .................................... SUCCESS [2:22.401s]
[INFO] Torque Generator .................................. FAILURE [30.157s]
[INFO] Torque Templates .................................. SKIPPED
[INFO] Torque Generator Maven 2 Plugin ................... SKIPPED
[INFO] Torque Generator Ant tasks ........................ SKIPPED
[INFO] Torque Site ....................................... SKIPPED
[INFO] ------------------------------------------------------------------------
[INFO] BUILD FAILURE
[INFO] ------------------------------------------------------------------------
[INFO] Total time: 4:16.660s
[INFO] Finished at: Thu Mar 06 00:27:35 UTC 2014
[INFO] Final Memory: 48M/197M
[INFO] ------------------------------------------------------------------------
Waiting for Jenkins to finish collecting data[ERROR] Failed to execute goal org.apache.rat:apache-rat-plugin:0.8:check
(default) on project torque-generator: Too many unapproved licenses: 2 -> [Help 1]
[ERROR] 
[ERROR] To see the full stack trace of the errors, re-run Maven with the -e switch.
[ERROR] Re-run Maven using the -X switch to enable full debug logging.
[ERROR] 
[ERROR] For more information about the errors and possible solutions, please read the following
articles:
[ERROR] [Help 1] http://cwiki.apache.org/confluence/display/MAVEN/MojoFailureException
[ERROR] 
[ERROR] After correcting the problems, you can resume the build with the command
[ERROR]   mvn <goals> -rf :torque-generator

[JENKINS] Archiving <https://builds.apache.org/job/Torque4-trunk/ws/torque4-trunk/torque-ant-tasks/pom.xml>
to org.apache.torque/torque-ant-tasks/4.1-SNAPSHOT/torque-ant-tasks-4.1-SNAPSHOT.pom
[JENKINS] Archiving <https://builds.apache.org/job/Torque4-trunk/ws/torque4-trunk/pom.xml>
to org.apache.torque/torque/4.1-SNAPSHOT/torque-4.1-SNAPSHOT.pom
<https://builds.apache.org/job/Torque4-trunk/ws/torque4-trunk/pom.xml> is not inside
<https://builds.apache.org/job/Torque4-trunk/ws/torque4-trunk/torque4-trunk/;> will
archive in a separate pass
[JENKINS] Archiving <https://builds.apache.org/job/Torque4-trunk/ws/torque4-trunk/torque-runtime/pom.xml>
to org.apache.torque/torque-runtime/4.1-SNAPSHOT/torque-runtime-4.1-SNAPSHOT.pom
[JENKINS] Archiving <https://builds.apache.org/job/Torque4-trunk/ws/torque4-trunk/torque-runtime/target/torque-runtime-4.1-SNAPSHOT.jar>
to org.apache.torque/torque-runtime/4.1-SNAPSHOT/torque-runtime-4.1-SNAPSHOT.jar
[JENKINS] Archiving <https://builds.apache.org/job/Torque4-trunk/ws/torque4-trunk/torque-runtime/target/torque-runtime-4.1-SNAPSHOT-sources.jar>
to org.apache.torque/torque-runtime/4.1-SNAPSHOT/torque-runtime-4.1-SNAPSHOT-sources.jar
[JENKINS] Archiving <https://builds.apache.org/job/Torque4-trunk/ws/torque4-trunk/torque-generator/pom.xml>
to org.apache.torque/torque-generator/4.1-SNAPSHOT/torque-generator-4.1-SNAPSHOT.pom
[JENKINS] Archiving <https://builds.apache.org/job/Torque4-trunk/ws/torque4-trunk/torque-generator/target/torque-generator-4.1-SNAPSHOT.jar>
to org.apache.torque/torque-generator/4.1-SNAPSHOT/torque-generator-4.1-SNAPSHOT.jar
[JENKINS] Archiving <https://builds.apache.org/job/Torque4-trunk/ws/torque4-trunk/torque-generator/target/torque-generator-4.1-SNAPSHOT-sources.jar>
to org.apache.torque/torque-generator/4.1-SNAPSHOT/torque-generator-4.1-SNAPSHOT-sources.jar
[JENKINS] Archiving <https://builds.apache.org/job/Torque4-trunk/ws/torque4-trunk/torque-templates/pom.xml>
to org.apache.torque/torque-templates/4.1-SNAPSHOT/torque-templates-4.1-SNAPSHOT.pom
[JENKINS] Archiving <https://builds.apache.org/job/Torque4-trunk/ws/torque4-trunk/torque-site/pom.xml>
to org.apache.torque/torque-site/4.1-SNAPSHOT/torque-site-4.1-SNAPSHOT.pom
[JENKINS] Archiving <https://builds.apache.org/job/Torque4-trunk/ws/torque4-trunk/torque-maven-plugin/pom.xml>
to org.apache.torque/torque-maven-plugin/4.1-SNAPSHOT/torque-maven-plugin-4.1-SNAPSHOT.pom
Sending e-mails to: torque-dev@db.apache.org
channel stopped
Skipping Cobertura coverage report as build was not UNSTABLE or better ...

---------------------------------------------------------------------
To unsubscribe, e-mail: torque-dev-unsubscribe@db.apache.org
For additional commands, e-mail: torque-dev-help@db.apache.org


Mime
View raw message