db-torque-dev mailing list archives

Site index · List index
Message view « Date » · « Thread »
Top « Date » · « Thread »
From Apache Jenkins Server <jenk...@builds.apache.org>
Subject Build failed in Jenkins: torque4-test-project-hsqldb #281
Date Thu, 02 Jan 2014 12:06:08 GMT
See <https://builds.apache.org/job/torque4-test-project-hsqldb/281/>

------------------------------------------
[...truncated 11096 lines...]
INFO  org.apache.torque.generator.control.Controller - Processing source <https://builds.apache.org/job/torque4-test-project-hsqldb/ws/torque-test/target/torque/test/schema/qualified-table-name-schema.xml>
INFO  org.apache.torque.generator.control.Controller - No start Elements found for path all-views/view
INFO  org.apache.torque.generator.control.Controller - Processing source <https://builds.apache.org/job/torque4-test-project-hsqldb/ws/torque-test/target/torque/test/schema/save-method-in-peer-schema.xml>
INFO  org.apache.torque.generator.control.Controller - No start Elements found for path all-views/view
INFO  org.apache.torque.generator.control.Controller - Processing source <https://builds.apache.org/job/torque4-test-project-hsqldb/ws/torque-test/target/torque/test/schema/test-schema.xml>
INFO  org.apache.torque.generator.control.Controller - No start Elements found for path all-views/view
INFO  org.apache.torque.generator.control.Controller - Processing source <https://builds.apache.org/job/torque4-test-project-hsqldb/ws/torque-test/target/torque/test/schema/types-schema.xml>
INFO  org.apache.torque.generator.control.Controller - No start Elements found for path all-views/view
[INFO] Generation successful
[INFO] [torque:generate {execution: generate-sql}]
INFO  org.apache.torque.generator.control.Controller - readConfiguration() : Starting to read
configuration files
INFO  org.apache.torque.generator.control.Controller - readConfiguration() : Configuration
read.
INFO  org.apache.torque.generator.control.Controller - Processing output torque.sql.ddl
INFO  org.apache.torque.generator.control.Controller - Processing source <https://builds.apache.org/job/torque4-test-project-hsqldb/ws/torque-test/target/torque/test/schema/bookstore-schema.xml>
INFO  org.apache.torque.generator.control.Controller - Start generation of File <https://builds.apache.org/job/torque4-test-project-hsqldb/ws/torque-test/target/generated-sql/bookstore-schema.sql>
INFO  org.apache.torque.generator.control.Controller - Processing source <https://builds.apache.org/job/torque4-test-project-hsqldb/ws/torque-test/target/torque/test/schema/databaseMapInit-schema.xml>
INFO  org.apache.torque.generator.control.Controller - Start generation of File <https://builds.apache.org/job/torque4-test-project-hsqldb/ws/torque-test/target/generated-sql/databaseMapInit-schema.sql>
INFO  org.apache.torque.generator.control.Controller - Processing source <https://builds.apache.org/job/torque4-test-project-hsqldb/ws/torque-test/target/torque/test/schema/default-value-schema.xml>
INFO  org.apache.torque.generator.control.Controller - Start generation of File <https://builds.apache.org/job/torque4-test-project-hsqldb/ws/torque-test/target/generated-sql/default-value-schema.sql>
INFO  org.apache.torque.generator.control.Controller - Processing source <https://builds.apache.org/job/torque4-test-project-hsqldb/ws/torque-test/target/torque/test/schema/foreign-key-schema.xml>
INFO  org.apache.torque.generator.control.Controller - Start generation of File <https://builds.apache.org/job/torque4-test-project-hsqldb/ws/torque-test/target/generated-sql/foreign-key-schema.sql>
INFO  org.apache.torque.generator.control.Controller - Processing source <https://builds.apache.org/job/torque4-test-project-hsqldb/ws/torque-test/target/torque/test/schema/id-table-schema.xml>
INFO  org.apache.torque.generator.control.Controller - Start generation of File <https://builds.apache.org/job/torque4-test-project-hsqldb/ws/torque-test/target/generated-sql/id-table-schema.sql>
INFO  org.apache.torque.generator.control.Controller - Processing source <https://builds.apache.org/job/torque4-test-project-hsqldb/ws/torque-test/target/torque/test/schema/index.xml>
INFO  org.apache.torque.generator.control.Controller - Start generation of File <https://builds.apache.org/job/torque4-test-project-hsqldb/ws/torque-test/target/generated-sql/index.sql>
INFO  org.apache.torque.generator.control.Controller - Processing source <https://builds.apache.org/job/torque4-test-project-hsqldb/ws/torque-test/target/torque/test/schema/pk-schema.xml>
INFO  org.apache.torque.generator.control.Controller - Start generation of File <https://builds.apache.org/job/torque4-test-project-hsqldb/ws/torque-test/target/generated-sql/pk-schema.sql>
INFO  org.apache.torque.generator.control.Controller - Processing source <https://builds.apache.org/job/torque4-test-project-hsqldb/ws/torque-test/target/torque/test/schema/qualified-table-name-schema.xml>
INFO  org.apache.torque.generator.control.Controller - Start generation of File <https://builds.apache.org/job/torque4-test-project-hsqldb/ws/torque-test/target/generated-sql/qualified-table-name-schema.sql>
INFO  org.apache.torque.generator.control.Controller - Processing source <https://builds.apache.org/job/torque4-test-project-hsqldb/ws/torque-test/target/torque/test/schema/save-method-in-peer-schema.xml>
INFO  org.apache.torque.generator.control.Controller - Start generation of File <https://builds.apache.org/job/torque4-test-project-hsqldb/ws/torque-test/target/generated-sql/save-method-in-peer-schema.sql>
INFO  org.apache.torque.generator.control.Controller - Processing source <https://builds.apache.org/job/torque4-test-project-hsqldb/ws/torque-test/target/torque/test/schema/test-schema.xml>
INFO  org.apache.torque.generator.control.Controller - Start generation of File <https://builds.apache.org/job/torque4-test-project-hsqldb/ws/torque-test/target/generated-sql/test-schema.sql>
INFO  org.apache.torque.generator.control.Controller - Processing source <https://builds.apache.org/job/torque4-test-project-hsqldb/ws/torque-test/target/torque/test/schema/types-schema.xml>
INFO  org.apache.torque.generator.control.Controller - Start generation of File <https://builds.apache.org/job/torque4-test-project-hsqldb/ws/torque-test/target/generated-sql/types-schema.sql>
[INFO] Generation successful
[INFO] [torque:generate {execution: generate-createdb-sql}]
INFO  org.apache.torque.generator.control.Controller - readConfiguration() : Starting to read
configuration files
INFO  org.apache.torque.generator.control.Controller - readConfiguration() : Configuration
read.
INFO  org.apache.torque.generator.control.Controller - Processing output torque.sql.createdb
INFO  org.apache.torque.generator.control.Controller - Processing source <https://builds.apache.org/job/torque4-test-project-hsqldb/ws/torque-test/target/torque/test/schema/bookstore-schema.xml>
INFO  org.apache.torque.generator.control.Controller - Start generation of File <https://builds.apache.org/job/torque4-test-project-hsqldb/ws/torque-test/target/generated-createdb-sql/bookstore-schema-create.sql>
INFO  org.apache.torque.generator.control.Controller - Processing source <https://builds.apache.org/job/torque4-test-project-hsqldb/ws/torque-test/target/torque/test/schema/databaseMapInit-schema.xml>
INFO  org.apache.torque.generator.control.Controller - Start generation of File <https://builds.apache.org/job/torque4-test-project-hsqldb/ws/torque-test/target/generated-createdb-sql/databaseMapInit-schema-create.sql>
INFO  org.apache.torque.generator.control.Controller - Processing source <https://builds.apache.org/job/torque4-test-project-hsqldb/ws/torque-test/target/torque/test/schema/default-value-schema.xml>
INFO  org.apache.torque.generator.control.Controller - Start generation of File <https://builds.apache.org/job/torque4-test-project-hsqldb/ws/torque-test/target/generated-createdb-sql/default-value-schema-create.sql>
INFO  org.apache.torque.generator.control.Controller - Processing source <https://builds.apache.org/job/torque4-test-project-hsqldb/ws/torque-test/target/torque/test/schema/foreign-key-schema.xml>
INFO  org.apache.torque.generator.control.Controller - Start generation of File <https://builds.apache.org/job/torque4-test-project-hsqldb/ws/torque-test/target/generated-createdb-sql/foreign-key-schema-create.sql>
INFO  org.apache.torque.generator.control.Controller - Processing source <https://builds.apache.org/job/torque4-test-project-hsqldb/ws/torque-test/target/torque/test/schema/index.xml>
INFO  org.apache.torque.generator.control.Controller - Start generation of File <https://builds.apache.org/job/torque4-test-project-hsqldb/ws/torque-test/target/generated-createdb-sql/index-create.sql>
INFO  org.apache.torque.generator.control.Controller - Processing source <https://builds.apache.org/job/torque4-test-project-hsqldb/ws/torque-test/target/torque/test/schema/pk-schema.xml>
INFO  org.apache.torque.generator.control.Controller - Start generation of File <https://builds.apache.org/job/torque4-test-project-hsqldb/ws/torque-test/target/generated-createdb-sql/pk-schema-create.sql>
INFO  org.apache.torque.generator.control.Controller - Processing source <https://builds.apache.org/job/torque4-test-project-hsqldb/ws/torque-test/target/torque/test/schema/qualified-table-name-schema.xml>
INFO  org.apache.torque.generator.control.Controller - Start generation of File <https://builds.apache.org/job/torque4-test-project-hsqldb/ws/torque-test/target/generated-createdb-sql/qualified-table-name-schema-create.sql>
INFO  org.apache.torque.generator.control.Controller - Processing source <https://builds.apache.org/job/torque4-test-project-hsqldb/ws/torque-test/target/torque/test/schema/save-method-in-peer-schema.xml>
INFO  org.apache.torque.generator.control.Controller - Start generation of File <https://builds.apache.org/job/torque4-test-project-hsqldb/ws/torque-test/target/generated-createdb-sql/save-method-in-peer-schema-create.sql>
INFO  org.apache.torque.generator.control.Controller - Processing source <https://builds.apache.org/job/torque4-test-project-hsqldb/ws/torque-test/target/torque/test/schema/test-schema.xml>
INFO  org.apache.torque.generator.control.Controller - Start generation of File <https://builds.apache.org/job/torque4-test-project-hsqldb/ws/torque-test/target/generated-createdb-sql/test-schema-create.sql>
INFO  org.apache.torque.generator.control.Controller - Processing source <https://builds.apache.org/job/torque4-test-project-hsqldb/ws/torque-test/target/torque/test/schema/types-schema.xml>
INFO  org.apache.torque.generator.control.Controller - Start generation of File <https://builds.apache.org/job/torque4-test-project-hsqldb/ws/torque-test/target/generated-createdb-sql/types-schema-create.sql>
[INFO] Generation successful
[INFO] [torque:generate {execution: generate-idtable-sql}]
INFO  org.apache.torque.generator.control.Controller - readConfiguration() : Starting to read
configuration files
INFO  org.apache.torque.generator.control.Controller - readConfiguration() : Configuration
read.
INFO  org.apache.torque.generator.control.Controller - Processing output torque.sql.idtable.idtable
INFO  org.apache.torque.generator.control.Controller - Processing source <https://builds.apache.org/job/torque4-test-project-hsqldb/ws/torque-test/target/torque/test/schema/./bookstore-schema.xml>
INFO  org.apache.torque.generator.control.Controller - Start generation of File <https://builds.apache.org/job/torque4-test-project-hsqldb/ws/torque-test/target/generated-sql/bookstore-schema-idtable-init.sql>
INFO  org.apache.torque.generator.control.Controller - Processing source <https://builds.apache.org/job/torque4-test-project-hsqldb/ws/torque-test/target/torque/test/schema/./databaseMapInit-schema.xml>
INFO  org.apache.torque.generator.control.Controller - Start generation of File <https://builds.apache.org/job/torque4-test-project-hsqldb/ws/torque-test/target/generated-sql/databaseMapInit-schema-idtable-init.sql>
INFO  org.apache.torque.generator.control.Controller - Processing source <https://builds.apache.org/job/torque4-test-project-hsqldb/ws/torque-test/target/torque/test/schema/./default-value-schema.xml>
INFO  org.apache.torque.generator.control.Controller - Start generation of File <https://builds.apache.org/job/torque4-test-project-hsqldb/ws/torque-test/target/generated-sql/default-value-schema-idtable-init.sql>
INFO  org.apache.torque.generator.control.Controller - Processing source <https://builds.apache.org/job/torque4-test-project-hsqldb/ws/torque-test/target/torque/test/schema/./ext-schema.xml>
INFO  org.apache.torque.generator.control.Controller - Start generation of File <https://builds.apache.org/job/torque4-test-project-hsqldb/ws/torque-test/target/generated-sql/ext-schema-idtable-init.sql>
INFO  org.apache.torque.generator.control.Controller - Processing source <https://builds.apache.org/job/torque4-test-project-hsqldb/ws/torque-test/target/torque/test/schema/./extext-schema.xml>
INFO  org.apache.torque.generator.control.Controller - Start generation of File <https://builds.apache.org/job/torque4-test-project-hsqldb/ws/torque-test/target/generated-sql/extext-schema-idtable-init.sql>
INFO  org.apache.torque.generator.control.Controller - Processing source <https://builds.apache.org/job/torque4-test-project-hsqldb/ws/torque-test/target/torque/test/schema/./foreign-key-schema.xml>
INFO  org.apache.torque.generator.control.Controller - Start generation of File <https://builds.apache.org/job/torque4-test-project-hsqldb/ws/torque-test/target/generated-sql/foreign-key-schema-idtable-init.sql>
INFO  org.apache.torque.generator.control.Controller - Processing source <https://builds.apache.org/job/torque4-test-project-hsqldb/ws/torque-test/target/torque/test/schema/./included-from-included-schema.xml>
INFO  org.apache.torque.generator.control.Controller - Start generation of File <https://builds.apache.org/job/torque4-test-project-hsqldb/ws/torque-test/target/generated-sql/included-from-included-schema-idtable-init.sql>
INFO  org.apache.torque.generator.control.Controller - Processing source <https://builds.apache.org/job/torque4-test-project-hsqldb/ws/torque-test/target/torque/test/schema/./included-schema.xml>
INFO  org.apache.torque.generator.control.Controller - Start generation of File <https://builds.apache.org/job/torque4-test-project-hsqldb/ws/torque-test/target/generated-sql/included-schema-idtable-init.sql>
INFO  org.apache.torque.generator.control.Controller - Processing source <https://builds.apache.org/job/torque4-test-project-hsqldb/ws/torque-test/target/torque/test/schema/./pk-schema.xml>
INFO  org.apache.torque.generator.control.Controller - Start generation of File <https://builds.apache.org/job/torque4-test-project-hsqldb/ws/torque-test/target/generated-sql/pk-schema-idtable-init.sql>
INFO  org.apache.torque.generator.control.Controller - Processing source <https://builds.apache.org/job/torque4-test-project-hsqldb/ws/torque-test/target/torque/test/schema/./qualified-table-name-schema.xml>
INFO  org.apache.torque.generator.control.Controller - Start generation of File <https://builds.apache.org/job/torque4-test-project-hsqldb/ws/torque-test/target/generated-sql/qualified-table-name-schema-idtable-init.sql>
INFO  org.apache.torque.generator.control.Controller - Processing source <https://builds.apache.org/job/torque4-test-project-hsqldb/ws/torque-test/target/torque/test/schema/./save-method-in-peer-schema.xml>
INFO  org.apache.torque.generator.control.Controller - Start generation of File <https://builds.apache.org/job/torque4-test-project-hsqldb/ws/torque-test/target/generated-sql/save-method-in-peer-schema-idtable-init.sql>
INFO  org.apache.torque.generator.control.Controller - Processing source <https://builds.apache.org/job/torque4-test-project-hsqldb/ws/torque-test/target/torque/test/schema/./test-schema.xml>
INFO  org.apache.torque.generator.control.Controller - Start generation of File <https://builds.apache.org/job/torque4-test-project-hsqldb/ws/torque-test/target/generated-sql/test-schema-idtable-init.sql>
INFO  org.apache.torque.generator.control.Controller - Processing source <https://builds.apache.org/job/torque4-test-project-hsqldb/ws/torque-test/target/torque/test/schema/./types-schema.xml>
INFO  org.apache.torque.generator.control.Controller - Start generation of File <https://builds.apache.org/job/torque4-test-project-hsqldb/ws/torque-test/target/generated-sql/types-schema-idtable-init.sql>
[INFO] Generation successful
[INFO] [torque:generate {execution: generate-html-doc}]
INFO  org.apache.torque.generator.control.Controller - readConfiguration() : Starting to read
configuration files
INFO  org.apache.torque.generator.control.Controller - readConfiguration() : Configuration
read.
INFO  org.apache.torque.generator.control.Controller - Processing output torque.doc.html.css
INFO  org.apache.torque.generator.control.Controller - Processing source <https://builds.apache.org/job/torque4-test-project-hsqldb/ws/torque-test/target/torque/test/schema/bookstore-schema.xml>
INFO  org.apache.torque.generator.control.Controller - Start generation of File <https://builds.apache.org/job/torque4-test-project-hsqldb/ws/torque-test/target/generated-docs/datamodel.css>
INFO  org.apache.torque.generator.control.Controller - Processing source <https://builds.apache.org/job/torque4-test-project-hsqldb/ws/torque-test/target/torque/test/schema/databaseMapInit-schema.xml>
INFO  org.apache.torque.generator.control.Controller - Start generation of File <https://builds.apache.org/job/torque4-test-project-hsqldb/ws/torque-test/target/generated-docs/datamodel.css>
INFO  org.apache.torque.generator.control.Controller - Processing source <https://builds.apache.org/job/torque4-test-project-hsqldb/ws/torque-test/target/torque/test/schema/default-value-schema.xml>
INFO  org.apache.torque.generator.control.Controller - Start generation of File <https://builds.apache.org/job/torque4-test-project-hsqldb/ws/torque-test/target/generated-docs/datamodel.css>
INFO  org.apache.torque.generator.control.Controller - Processing source <https://builds.apache.org/job/torque4-test-project-hsqldb/ws/torque-test/target/torque/test/schema/foreign-key-schema.xml>
INFO  org.apache.torque.generator.control.Controller - Start generation of File <https://builds.apache.org/job/torque4-test-project-hsqldb/ws/torque-test/target/generated-docs/datamodel.css>
INFO  org.apache.torque.generator.control.Controller - Processing source <https://builds.apache.org/job/torque4-test-project-hsqldb/ws/torque-test/target/torque/test/schema/index.xml>
INFO  org.apache.torque.generator.control.Controller - Start generation of File <https://builds.apache.org/job/torque4-test-project-hsqldb/ws/torque-test/target/generated-docs/datamodel.css>
INFO  org.apache.torque.generator.control.Controller - Processing source <https://builds.apache.org/job/torque4-test-project-hsqldb/ws/torque-test/target/torque/test/schema/pk-schema.xml>
INFO  org.apache.torque.generator.control.Controller - Start generation of File <https://builds.apache.org/job/torque4-test-project-hsqldb/ws/torque-test/target/generated-docs/datamodel.css>
INFO  org.apache.torque.generator.control.Controller - Processing source <https://builds.apache.org/job/torque4-test-project-hsqldb/ws/torque-test/target/torque/test/schema/qualified-table-name-schema.xml>
INFO  org.apache.torque.generator.control.Controller - Start generation of File <https://builds.apache.org/job/torque4-test-project-hsqldb/ws/torque-test/target/generated-docs/datamodel.css>
INFO  org.apache.torque.generator.control.Controller - Processing source <https://builds.apache.org/job/torque4-test-project-hsqldb/ws/torque-test/target/torque/test/schema/save-method-in-peer-schema.xml>
INFO  org.apache.torque.generator.control.Controller - Start generation of File <https://builds.apache.org/job/torque4-test-project-hsqldb/ws/torque-test/target/generated-docs/datamodel.css>
INFO  org.apache.torque.generator.control.Controller - Processing source <https://builds.apache.org/job/torque4-test-project-hsqldb/ws/torque-test/target/torque/test/schema/test-schema.xml>
INFO  org.apache.torque.generator.control.Controller - Start generation of File <https://builds.apache.org/job/torque4-test-project-hsqldb/ws/torque-test/target/generated-docs/datamodel.css>
INFO  org.apache.torque.generator.control.Controller - Processing source <https://builds.apache.org/job/torque4-test-project-hsqldb/ws/torque-test/target/torque/test/schema/types-schema.xml>
INFO  org.apache.torque.generator.control.Controller - Start generation of File <https://builds.apache.org/job/torque4-test-project-hsqldb/ws/torque-test/target/generated-docs/datamodel.css>
INFO  org.apache.torque.generator.control.Controller - Processing output torque.doc.html.html
INFO  org.apache.torque.generator.control.Controller - Processing source <https://builds.apache.org/job/torque4-test-project-hsqldb/ws/torque-test/target/torque/test/schema/bookstore-schema.xml>
INFO  org.apache.torque.generator.control.Controller - Start generation of File <https://builds.apache.org/job/torque4-test-project-hsqldb/ws/torque-test/target/generated-docs/bookstore-schema.html>
INFO  org.apache.torque.generator.control.Controller - Processing source <https://builds.apache.org/job/torque4-test-project-hsqldb/ws/torque-test/target/torque/test/schema/databaseMapInit-schema.xml>
INFO  org.apache.torque.generator.control.Controller - Start generation of File <https://builds.apache.org/job/torque4-test-project-hsqldb/ws/torque-test/target/generated-docs/databaseMapInit-schema.html>
INFO  org.apache.torque.generator.control.Controller - Processing source <https://builds.apache.org/job/torque4-test-project-hsqldb/ws/torque-test/target/torque/test/schema/default-value-schema.xml>
INFO  org.apache.torque.generator.control.Controller - Start generation of File <https://builds.apache.org/job/torque4-test-project-hsqldb/ws/torque-test/target/generated-docs/default-value-schema.html>
INFO  org.apache.torque.generator.control.Controller - Processing source <https://builds.apache.org/job/torque4-test-project-hsqldb/ws/torque-test/target/torque/test/schema/foreign-key-schema.xml>
INFO  org.apache.torque.generator.control.Controller - Start generation of File <https://builds.apache.org/job/torque4-test-project-hsqldb/ws/torque-test/target/generated-docs/foreign-key-schema.html>
INFO  org.apache.torque.generator.control.Controller - Processing source <https://builds.apache.org/job/torque4-test-project-hsqldb/ws/torque-test/target/torque/test/schema/index.xml>
INFO  org.apache.torque.generator.control.Controller - Start generation of File <https://builds.apache.org/job/torque4-test-project-hsqldb/ws/torque-test/target/generated-docs/index.html>
INFO  org.apache.torque.generator.control.Controller - Processing source <https://builds.apache.org/job/torque4-test-project-hsqldb/ws/torque-test/target/torque/test/schema/pk-schema.xml>
INFO  org.apache.torque.generator.control.Controller - Start generation of File <https://builds.apache.org/job/torque4-test-project-hsqldb/ws/torque-test/target/generated-docs/pk-schema.html>
INFO  org.apache.torque.generator.control.Controller - Processing source <https://builds.apache.org/job/torque4-test-project-hsqldb/ws/torque-test/target/torque/test/schema/qualified-table-name-schema.xml>
INFO  org.apache.torque.generator.control.Controller - Start generation of File <https://builds.apache.org/job/torque4-test-project-hsqldb/ws/torque-test/target/generated-docs/qualified-table-name-schema.html>
INFO  org.apache.torque.generator.control.Controller - Processing source <https://builds.apache.org/job/torque4-test-project-hsqldb/ws/torque-test/target/torque/test/schema/save-method-in-peer-schema.xml>
INFO  org.apache.torque.generator.control.Controller - Start generation of File <https://builds.apache.org/job/torque4-test-project-hsqldb/ws/torque-test/target/generated-docs/save-method-in-peer-schema.html>
INFO  org.apache.torque.generator.control.Controller - Processing source <https://builds.apache.org/job/torque4-test-project-hsqldb/ws/torque-test/target/torque/test/schema/test-schema.xml>
INFO  org.apache.torque.generator.control.Controller - Start generation of File <https://builds.apache.org/job/torque4-test-project-hsqldb/ws/torque-test/target/generated-docs/test-schema.html>
INFO  org.apache.torque.generator.control.Controller - Processing source <https://builds.apache.org/job/torque4-test-project-hsqldb/ws/torque-test/target/torque/test/schema/types-schema.xml>
INFO  org.apache.torque.generator.control.Controller - Start generation of File <https://builds.apache.org/job/torque4-test-project-hsqldb/ws/torque-test/target/generated-docs/types-schema.html>
[INFO] Generation successful
[WARNING] The parameter expression: 'project.build.resources' used in mojo: 'process' has
been deprecated. Use 'project.resources' instead.
[INFO] [remote-resources:process {execution: default}]
[debug] execute contextualize
[INFO] [resources:resources {execution: default-resources}]
[INFO] Using 'ISO-8859-1' encoding to copy filtered resources.
[INFO] skip non existing resourceDirectory <https://builds.apache.org/job/torque4-test-project-hsqldb/ws/torque-test/src/main/resources>
[INFO] Copying 3 resources
[INFO] [compiler:compile {execution: default-compile}]
[INFO] Compiling 994 source files to <https://builds.apache.org/job/torque4-test-project-hsqldb/ws/torque-test/target/classes>
[INFO] [sql:execute {execution: execute-ddl}]
[INFO] Executing file: <https://builds.apache.org/job/torque4-test-project-hsqldb/ws/torque-test/target/generated-sql/bookstore-schema.sql>
[INFO] Executing file: <https://builds.apache.org/job/torque4-test-project-hsqldb/ws/torque-test/target/generated-sql/databaseMapInit-schema.sql>
[INFO] Executing file: <https://builds.apache.org/job/torque4-test-project-hsqldb/ws/torque-test/target/generated-sql/default-value-schema.sql>
[INFO] Executing file: <https://builds.apache.org/job/torque4-test-project-hsqldb/ws/torque-test/target/generated-sql/foreign-key-schema.sql>
[INFO] Executing file: <https://builds.apache.org/job/torque4-test-project-hsqldb/ws/torque-test/target/generated-sql/id-table-schema.sql>
[INFO] Executing file: <https://builds.apache.org/job/torque4-test-project-hsqldb/ws/torque-test/target/generated-sql/index.sql>
[INFO] Executing file: <https://builds.apache.org/job/torque4-test-project-hsqldb/ws/torque-test/target/generated-sql/pk-schema.sql>
[INFO] Executing file: <https://builds.apache.org/job/torque4-test-project-hsqldb/ws/torque-test/target/generated-sql/qualified-table-name-schema.sql>
[INFO] Executing file: <https://builds.apache.org/job/torque4-test-project-hsqldb/ws/torque-test/target/generated-sql/save-method-in-peer-schema.sql>
[INFO] Executing file: <https://builds.apache.org/job/torque4-test-project-hsqldb/ws/torque-test/target/generated-sql/test-schema.sql>
[INFO] Executing file: <https://builds.apache.org/job/torque4-test-project-hsqldb/ws/torque-test/target/generated-sql/types-schema.sql>
Jan 2, 2014 12:06:00 PM org.hsqldb.persist.Logger logInfoEvent
INFO: Database closed
[INFO] 121 of 121 SQL statements executed successfully
[INFO] [sql:execute {execution: execute-idtable-sql}]
[INFO] Executing file: <https://builds.apache.org/job/torque4-test-project-hsqldb/ws/torque-test/target/generated-sql/bookstore-schema-idtable-init.sql>
[INFO] Executing file: <https://builds.apache.org/job/torque4-test-project-hsqldb/ws/torque-test/target/generated-sql/databaseMapInit-schema-idtable-init.sql>
[INFO] Executing file: <https://builds.apache.org/job/torque4-test-project-hsqldb/ws/torque-test/target/generated-sql/default-value-schema-idtable-init.sql>
[INFO] Executing file: <https://builds.apache.org/job/torque4-test-project-hsqldb/ws/torque-test/target/generated-sql/ext-schema-idtable-init.sql>
[INFO] Executing file: <https://builds.apache.org/job/torque4-test-project-hsqldb/ws/torque-test/target/generated-sql/extext-schema-idtable-init.sql>
[INFO] Executing file: <https://builds.apache.org/job/torque4-test-project-hsqldb/ws/torque-test/target/generated-sql/foreign-key-schema-idtable-init.sql>
[INFO] Executing file: <https://builds.apache.org/job/torque4-test-project-hsqldb/ws/torque-test/target/generated-sql/pk-schema-idtable-init.sql>
[INFO] Executing file: <https://builds.apache.org/job/torque4-test-project-hsqldb/ws/torque-test/target/generated-sql/qualified-table-name-schema-idtable-init.sql>
[INFO] Executing file: <https://builds.apache.org/job/torque4-test-project-hsqldb/ws/torque-test/target/generated-sql/save-method-in-peer-schema-idtable-init.sql>
[INFO] Executing file: <https://builds.apache.org/job/torque4-test-project-hsqldb/ws/torque-test/target/generated-sql/test-schema-idtable-init.sql>
[INFO] Executing file: <https://builds.apache.org/job/torque4-test-project-hsqldb/ws/torque-test/target/generated-sql/types-schema-idtable-init.sql>
Jan 2, 2014 12:06:01 PM org.hsqldb.persist.Logger logInfoEvent
INFO: Database closed
[INFO] 75 of 75 SQL statements executed successfully
[INFO] [sql:execute {execution: shutdown-db-after-ddl}]
[INFO] Skip sql execution
[debug] execute contextualize
[INFO] [resources:testResources {execution: default-testResources}]
[INFO] Using 'ISO-8859-1' encoding to copy filtered resources.
[INFO] Copying 6 resources
[INFO] Copying 3 resources
[INFO] [compiler:testCompile {execution: default-testCompile}]
[INFO] Compiling 57 source files to <https://builds.apache.org/job/torque4-test-project-hsqldb/ws/torque-test/target/test-classes>
[INFO] -------------------------------------------------------------
[ERROR] COMPILATION ERROR : 
[INFO] -------------------------------------------------------------
[ERROR] <https://builds.apache.org/job/torque4-test-project-hsqldb/ws/torque-test/src/test/java/org/apache/torque/generated/peer/DoInsertTest.java>:[162,45]
cannot find symbol
symbol  : method doInsert(org.apache.torque.Column[],org.apache.torque.criteria.Criteria)
location: class org.apache.torque.test.peer.AuthorPeer

[ERROR] <https://builds.apache.org/job/torque4-test-project-hsqldb/ws/torque-test/src/test/java/org/apache/torque/generated/peer/DoInsertTest.java>:[195,45]
cannot find symbol
symbol  : method doInsert(org.apache.torque.Column[],org.apache.torque.criteria.Criteria)
location: class org.apache.torque.test.peer.AuthorPeer

[ERROR] <https://builds.apache.org/job/torque4-test-project-hsqldb/ws/torque-test/src/test/java/org/apache/torque/generated/peer/DoInsertTest.java>:[228,45]
cannot find symbol
symbol  : method doInsert(org.apache.torque.Column[],org.apache.torque.criteria.Criteria)
location: class org.apache.torque.test.peer.AuthorPeer

[INFO] 3 errors 
[INFO] -------------------------------------------------------------
[INFO] ------------------------------------------------------------------------
[ERROR] BUILD FAILURE
[INFO] ------------------------------------------------------------------------
[INFO] Compilation failure

<https://builds.apache.org/job/torque4-test-project-hsqldb/ws/torque-test/src/test/java/org/apache/torque/generated/peer/DoInsertTest.java>:[162,45]
cannot find symbol
symbol  : method doInsert(org.apache.torque.Column[],org.apache.torque.criteria.Criteria)
location: class org.apache.torque.test.peer.AuthorPeer

<https://builds.apache.org/job/torque4-test-project-hsqldb/ws/torque-test/src/test/java/org/apache/torque/generated/peer/DoInsertTest.java>:[195,45]
cannot find symbol
symbol  : method doInsert(org.apache.torque.Column[],org.apache.torque.criteria.Criteria)
location: class org.apache.torque.test.peer.AuthorPeer

<https://builds.apache.org/job/torque4-test-project-hsqldb/ws/torque-test/src/test/java/org/apache/torque/generated/peer/DoInsertTest.java>:[228,45]
cannot find symbol
symbol  : method doInsert(org.apache.torque.Column[],org.apache.torque.criteria.Criteria)
location: class org.apache.torque.test.peer.AuthorPeer


[INFO] ------------------------------------------------------------------------
[INFO] For more information, run Maven with the -e switch
[INFO] ------------------------------------------------------------------------
[INFO] Total time: 3 minutes 12 seconds
[INFO] Finished at: Thu Jan 02 12:06:05 UTC 2014
[INFO] Final Memory: 128M/528M
[INFO] ------------------------------------------------------------------------
[JENKINS] Archiving <https://builds.apache.org/job/torque4-test-project-hsqldb/ws/torque-ant-tasks/pom.xml>
to org.apache.torque/torque-ant-tasks/4.1-SNAPSHOT/torque-ant-tasks-4.1-SNAPSHOT.pom
[JENKINS] Archiving <https://builds.apache.org/job/torque4-test-project-hsqldb/ws/torque-ant-tasks/target/torque-ant-tasks-4.1-SNAPSHOT.jar>
to org.apache.torque/torque-ant-tasks/4.1-SNAPSHOT/torque-ant-tasks-4.1-SNAPSHOT.jar
[JENKINS] Archiving <https://builds.apache.org/job/torque4-test-project-hsqldb/ws/torque-ant-tasks/target/torque-ant-tasks-4.1-SNAPSHOT-sources.jar>
to org.apache.torque/torque-ant-tasks/4.1-SNAPSHOT/torque-ant-tasks-4.1-SNAPSHOT-sources.jar
[JENKINS] Archiving <https://builds.apache.org/job/torque4-test-project-hsqldb/ws/torque-test/pom.xml>
to org.apache.torque/torque-test/4.1-SNAPSHOT/torque-test-4.1-SNAPSHOT.pom
[JENKINS] Archiving <https://builds.apache.org/job/torque4-test-project-hsqldb/ws/pom.xml>
to org.apache.torque/torque/4.1-SNAPSHOT/torque-4.1-SNAPSHOT.pom
[JENKINS] Archiving <https://builds.apache.org/job/torque4-test-project-hsqldb/ws/torque-runtime/pom.xml>
to org.apache.torque/torque-runtime/4.1-SNAPSHOT/torque-runtime-4.1-SNAPSHOT.pom
[JENKINS] Archiving <https://builds.apache.org/job/torque4-test-project-hsqldb/ws/torque-runtime/target/torque-runtime-4.1-SNAPSHOT.jar>
to org.apache.torque/torque-runtime/4.1-SNAPSHOT/torque-runtime-4.1-SNAPSHOT.jar
[JENKINS] Archiving <https://builds.apache.org/job/torque4-test-project-hsqldb/ws/torque-runtime/target/torque-runtime-4.1-SNAPSHOT-sources.jar>
to org.apache.torque/torque-runtime/4.1-SNAPSHOT/torque-runtime-4.1-SNAPSHOT-sources.jar
[JENKINS] Archiving <https://builds.apache.org/job/torque4-test-project-hsqldb/ws/torque-generator/pom.xml>
to org.apache.torque/torque-generator/4.1-SNAPSHOT/torque-generator-4.1-SNAPSHOT.pom
[JENKINS] Archiving <https://builds.apache.org/job/torque4-test-project-hsqldb/ws/torque-generator/target/torque-generator-4.1-SNAPSHOT.jar>
to org.apache.torque/torque-generator/4.1-SNAPSHOT/torque-generator-4.1-SNAPSHOT.jar
[JENKINS] Archiving <https://builds.apache.org/job/torque4-test-project-hsqldb/ws/torque-generator/target/torque-generator-4.1-SNAPSHOT-sources.jar>
to org.apache.torque/torque-generator/4.1-SNAPSHOT/torque-generator-4.1-SNAPSHOT-sources.jar
[JENKINS] Archiving <https://builds.apache.org/job/torque4-test-project-hsqldb/ws/torque-templates/pom.xml>
to org.apache.torque/torque-templates/4.1-SNAPSHOT/torque-templates-4.1-SNAPSHOT.pom
[JENKINS] Archiving <https://builds.apache.org/job/torque4-test-project-hsqldb/ws/torque-templates/target/torque-templates-4.1-SNAPSHOT.jar>
to org.apache.torque/torque-templates/4.1-SNAPSHOT/torque-templates-4.1-SNAPSHOT.jar
[JENKINS] Archiving <https://builds.apache.org/job/torque4-test-project-hsqldb/ws/torque-templates/target/torque-templates-4.1-SNAPSHOT-sources.jar>
to org.apache.torque/torque-templates/4.1-SNAPSHOT/torque-templates-4.1-SNAPSHOT-sources.jar
[JENKINS] Archiving <https://builds.apache.org/job/torque4-test-project-hsqldb/ws/torque-site/pom.xml>
to org.apache.torque/torque-site/4.1-SNAPSHOT/torque-site-4.1-SNAPSHOT.pom
[JENKINS] Archiving <https://builds.apache.org/job/torque4-test-project-hsqldb/ws/torque-site/target/torque-site-4.1-SNAPSHOT-site.xml>
to org.apache.torque/torque-site/4.1-SNAPSHOT/torque-site-4.1-SNAPSHOT-site.xml
[JENKINS] Archiving <https://builds.apache.org/job/torque4-test-project-hsqldb/ws/torque-maven-plugin/pom.xml>
to org.apache.torque/torque-maven-plugin/4.1-SNAPSHOT/torque-maven-plugin-4.1-SNAPSHOT.pom
[JENKINS] Archiving <https://builds.apache.org/job/torque4-test-project-hsqldb/ws/torque-maven-plugin/target/torque-maven-plugin-4.1-SNAPSHOT.jar>
to org.apache.torque/torque-maven-plugin/4.1-SNAPSHOT/torque-maven-plugin-4.1-SNAPSHOT.jar
[JENKINS] Archiving <https://builds.apache.org/job/torque4-test-project-hsqldb/ws/torque-maven-plugin/target/torque-maven-plugin-4.1-SNAPSHOT-sources.jar>
to org.apache.torque/torque-maven-plugin/4.1-SNAPSHOT/torque-maven-plugin-4.1-SNAPSHOT-sources.jar
Sending e-mails to: torque-dev@db.apache.org
channel stopped

---------------------------------------------------------------------
To unsubscribe, e-mail: torque-dev-unsubscribe@db.apache.org
For additional commands, e-mail: torque-dev-help@db.apache.org


Mime
View raw message