db-torque-dev mailing list archives

Site index · List index
Message view « Date » · « Thread »
Top « Date » · « Thread »
From Apache Jenkins Server <jenk...@builds.apache.org>
Subject Build failed in Jenkins: torque4-test-project-derby #357
Date Tue, 27 Aug 2013 23:47:11 GMT
See <https://builds.apache.org/job/torque4-test-project-derby/357/changes>

Changes:

[tfischer] TORQUE-299 In the getRelatedObject... methods in the Data objects, fill the reference
to the current object
Also fix NPE when using getRelatedObject methods with initialized caches
add tests for both fixes

[tfischer] Move tests for RelatedObjectGetters to correct package
Use same naming pattern for similar tests

------------------------------------------
[...truncated 1762 lines...]
INFO  org.apache.torque.generator.control.Controller - Processing source <https://builds.apache.org/job/torque4-test-project-derby/ws/target/torque/test/schema/foreign-key-schema.xml>
INFO  org.apache.torque.generator.control.Controller - No start Elements found for path all-views/view
INFO  org.apache.torque.generator.control.Controller - Processing source <https://builds.apache.org/job/torque4-test-project-derby/ws/target/torque/test/schema/index.xml>
INFO  org.apache.torque.generator.control.Controller - No start Elements found for path all-views/view
INFO  org.apache.torque.generator.control.Controller - Processing source <https://builds.apache.org/job/torque4-test-project-derby/ws/target/torque/test/schema/pk-schema.xml>
INFO  org.apache.torque.generator.control.Controller - No start Elements found for path all-views/view
INFO  org.apache.torque.generator.control.Controller - Processing source <https://builds.apache.org/job/torque4-test-project-derby/ws/target/torque/test/schema/qualified-table-name-schema.xml>
INFO  org.apache.torque.generator.control.Controller - No start Elements found for path all-views/view
INFO  org.apache.torque.generator.control.Controller - Processing source <https://builds.apache.org/job/torque4-test-project-derby/ws/target/torque/test/schema/save-method-in-peer-schema.xml>
INFO  org.apache.torque.generator.control.Controller - No start Elements found for path all-views/view
INFO  org.apache.torque.generator.control.Controller - Processing source <https://builds.apache.org/job/torque4-test-project-derby/ws/target/torque/test/schema/test-schema.xml>
INFO  org.apache.torque.generator.control.Controller - No start Elements found for path all-views/view
INFO  org.apache.torque.generator.control.Controller - Processing source <https://builds.apache.org/job/torque4-test-project-derby/ws/target/torque/test/schema/types-schema.xml>
INFO  org.apache.torque.generator.control.Controller - No start Elements found for path all-views/view
[INFO] Generation successful
[INFO] [torque:generate {execution: generate-sql}]
INFO  org.apache.torque.generator.control.Controller - readConfiguration() : Starting to read
configuration files
INFO  org.apache.torque.generator.control.Controller - readConfiguration() : Configuration
read.
INFO  org.apache.torque.generator.control.Controller - Processing output torque.sql.ddl
INFO  org.apache.torque.generator.control.Controller - Processing source <https://builds.apache.org/job/torque4-test-project-derby/ws/target/torque/test/schema/bookstore-schema.xml>
INFO  org.apache.torque.generator.control.Controller - Start generation of File <https://builds.apache.org/job/torque4-test-project-derby/ws/target/generated-sql/bookstore-schema.sql>
INFO  org.apache.torque.generator.control.Controller - Processing source <https://builds.apache.org/job/torque4-test-project-derby/ws/target/torque/test/schema/databaseMapInit-schema.xml>
INFO  org.apache.torque.generator.control.Controller - Start generation of File <https://builds.apache.org/job/torque4-test-project-derby/ws/target/generated-sql/databaseMapInit-schema.sql>
INFO  org.apache.torque.generator.control.Controller - Processing source <https://builds.apache.org/job/torque4-test-project-derby/ws/target/torque/test/schema/default-value-schema.xml>
INFO  org.apache.torque.generator.control.Controller - Start generation of File <https://builds.apache.org/job/torque4-test-project-derby/ws/target/generated-sql/default-value-schema.sql>
INFO  org.apache.torque.generator.control.Controller - Processing source <https://builds.apache.org/job/torque4-test-project-derby/ws/target/torque/test/schema/foreign-key-schema.xml>
INFO  org.apache.torque.generator.control.Controller - Start generation of File <https://builds.apache.org/job/torque4-test-project-derby/ws/target/generated-sql/foreign-key-schema.sql>
INFO  org.apache.torque.generator.control.Controller - Processing source <https://builds.apache.org/job/torque4-test-project-derby/ws/target/torque/test/schema/id-table-schema.xml>
INFO  org.apache.torque.generator.control.Controller - Start generation of File <https://builds.apache.org/job/torque4-test-project-derby/ws/target/generated-sql/id-table-schema.sql>
INFO  org.apache.torque.generator.control.Controller - Processing source <https://builds.apache.org/job/torque4-test-project-derby/ws/target/torque/test/schema/index.xml>
INFO  org.apache.torque.generator.control.Controller - Start generation of File <https://builds.apache.org/job/torque4-test-project-derby/ws/target/generated-sql/index.sql>
INFO  org.apache.torque.generator.control.Controller - Processing source <https://builds.apache.org/job/torque4-test-project-derby/ws/target/torque/test/schema/pk-schema.xml>
INFO  org.apache.torque.generator.control.Controller - Start generation of File <https://builds.apache.org/job/torque4-test-project-derby/ws/target/generated-sql/pk-schema.sql>
INFO  org.apache.torque.generator.control.Controller - Processing source <https://builds.apache.org/job/torque4-test-project-derby/ws/target/torque/test/schema/qualified-table-name-schema.xml>
INFO  org.apache.torque.generator.control.Controller - Start generation of File <https://builds.apache.org/job/torque4-test-project-derby/ws/target/generated-sql/qualified-table-name-schema.sql>
INFO  org.apache.torque.generator.control.Controller - Processing source <https://builds.apache.org/job/torque4-test-project-derby/ws/target/torque/test/schema/save-method-in-peer-schema.xml>
INFO  org.apache.torque.generator.control.Controller - Start generation of File <https://builds.apache.org/job/torque4-test-project-derby/ws/target/generated-sql/save-method-in-peer-schema.sql>
INFO  org.apache.torque.generator.control.Controller - Processing source <https://builds.apache.org/job/torque4-test-project-derby/ws/target/torque/test/schema/test-schema.xml>
INFO  org.apache.torque.generator.control.Controller - Start generation of File <https://builds.apache.org/job/torque4-test-project-derby/ws/target/generated-sql/test-schema.sql>
INFO  org.apache.torque.generator.control.Controller - Processing source <https://builds.apache.org/job/torque4-test-project-derby/ws/target/torque/test/schema/types-schema.xml>
INFO  org.apache.torque.generator.control.Controller - Start generation of File <https://builds.apache.org/job/torque4-test-project-derby/ws/target/generated-sql/types-schema.sql>
[INFO] Generation successful
[INFO] [torque:generate {execution: generate-createdb-sql}]
INFO  org.apache.torque.generator.control.Controller - readConfiguration() : Starting to read
configuration files
INFO  org.apache.torque.generator.control.Controller - readConfiguration() : Configuration
read.
INFO  org.apache.torque.generator.control.Controller - Processing output torque.sql.createdb
INFO  org.apache.torque.generator.control.Controller - Processing source <https://builds.apache.org/job/torque4-test-project-derby/ws/target/torque/test/schema/bookstore-schema.xml>
INFO  org.apache.torque.generator.control.Controller - Start generation of File <https://builds.apache.org/job/torque4-test-project-derby/ws/target/generated-createdb-sql/bookstore-schema-create.sql>
INFO  org.apache.torque.generator.control.Controller - Processing source <https://builds.apache.org/job/torque4-test-project-derby/ws/target/torque/test/schema/databaseMapInit-schema.xml>
INFO  org.apache.torque.generator.control.Controller - Start generation of File <https://builds.apache.org/job/torque4-test-project-derby/ws/target/generated-createdb-sql/databaseMapInit-schema-create.sql>
INFO  org.apache.torque.generator.control.Controller - Processing source <https://builds.apache.org/job/torque4-test-project-derby/ws/target/torque/test/schema/default-value-schema.xml>
INFO  org.apache.torque.generator.control.Controller - Start generation of File <https://builds.apache.org/job/torque4-test-project-derby/ws/target/generated-createdb-sql/default-value-schema-create.sql>
INFO  org.apache.torque.generator.control.Controller - Processing source <https://builds.apache.org/job/torque4-test-project-derby/ws/target/torque/test/schema/foreign-key-schema.xml>
INFO  org.apache.torque.generator.control.Controller - Start generation of File <https://builds.apache.org/job/torque4-test-project-derby/ws/target/generated-createdb-sql/foreign-key-schema-create.sql>
INFO  org.apache.torque.generator.control.Controller - Processing source <https://builds.apache.org/job/torque4-test-project-derby/ws/target/torque/test/schema/index.xml>
INFO  org.apache.torque.generator.control.Controller - Start generation of File <https://builds.apache.org/job/torque4-test-project-derby/ws/target/generated-createdb-sql/index-create.sql>
INFO  org.apache.torque.generator.control.Controller - Processing source <https://builds.apache.org/job/torque4-test-project-derby/ws/target/torque/test/schema/pk-schema.xml>
INFO  org.apache.torque.generator.control.Controller - Start generation of File <https://builds.apache.org/job/torque4-test-project-derby/ws/target/generated-createdb-sql/pk-schema-create.sql>
INFO  org.apache.torque.generator.control.Controller - Processing source <https://builds.apache.org/job/torque4-test-project-derby/ws/target/torque/test/schema/qualified-table-name-schema.xml>
INFO  org.apache.torque.generator.control.Controller - Start generation of File <https://builds.apache.org/job/torque4-test-project-derby/ws/target/generated-createdb-sql/qualified-table-name-schema-create.sql>
INFO  org.apache.torque.generator.control.Controller - Processing source <https://builds.apache.org/job/torque4-test-project-derby/ws/target/torque/test/schema/save-method-in-peer-schema.xml>
INFO  org.apache.torque.generator.control.Controller - Start generation of File <https://builds.apache.org/job/torque4-test-project-derby/ws/target/generated-createdb-sql/save-method-in-peer-schema-create.sql>
INFO  org.apache.torque.generator.control.Controller - Processing source <https://builds.apache.org/job/torque4-test-project-derby/ws/target/torque/test/schema/test-schema.xml>
INFO  org.apache.torque.generator.control.Controller - Start generation of File <https://builds.apache.org/job/torque4-test-project-derby/ws/target/generated-createdb-sql/test-schema-create.sql>
INFO  org.apache.torque.generator.control.Controller - Processing source <https://builds.apache.org/job/torque4-test-project-derby/ws/target/torque/test/schema/types-schema.xml>
INFO  org.apache.torque.generator.control.Controller - Start generation of File <https://builds.apache.org/job/torque4-test-project-derby/ws/target/generated-createdb-sql/types-schema-create.sql>
[INFO] Generation successful
[INFO] [torque:generate {execution: generate-idtable-sql}]
INFO  org.apache.torque.generator.control.Controller - readConfiguration() : Starting to read
configuration files
INFO  org.apache.torque.generator.control.Controller - readConfiguration() : Configuration
read.
INFO  org.apache.torque.generator.control.Controller - Processing output torque.sql.idtable.idtable
INFO  org.apache.torque.generator.control.Controller - Processing source <https://builds.apache.org/job/torque4-test-project-derby/ws/target/torque/test/schema/./bookstore-schema.xml>
INFO  org.apache.torque.generator.control.Controller - Start generation of File <https://builds.apache.org/job/torque4-test-project-derby/ws/target/generated-sql/bookstore-schema-idtable-init.sql>
INFO  org.apache.torque.generator.control.Controller - Processing source <https://builds.apache.org/job/torque4-test-project-derby/ws/target/torque/test/schema/./databaseMapInit-schema.xml>
INFO  org.apache.torque.generator.control.Controller - Start generation of File <https://builds.apache.org/job/torque4-test-project-derby/ws/target/generated-sql/databaseMapInit-schema-idtable-init.sql>
INFO  org.apache.torque.generator.control.Controller - Processing source <https://builds.apache.org/job/torque4-test-project-derby/ws/target/torque/test/schema/./default-value-schema.xml>
INFO  org.apache.torque.generator.control.Controller - Start generation of File <https://builds.apache.org/job/torque4-test-project-derby/ws/target/generated-sql/default-value-schema-idtable-init.sql>
INFO  org.apache.torque.generator.control.Controller - Processing source <https://builds.apache.org/job/torque4-test-project-derby/ws/target/torque/test/schema/./ext-schema.xml>
INFO  org.apache.torque.generator.control.Controller - Start generation of File <https://builds.apache.org/job/torque4-test-project-derby/ws/target/generated-sql/ext-schema-idtable-init.sql>
INFO  org.apache.torque.generator.control.Controller - Processing source <https://builds.apache.org/job/torque4-test-project-derby/ws/target/torque/test/schema/./extext-schema.xml>
INFO  org.apache.torque.generator.control.Controller - Start generation of File <https://builds.apache.org/job/torque4-test-project-derby/ws/target/generated-sql/extext-schema-idtable-init.sql>
INFO  org.apache.torque.generator.control.Controller - Processing source <https://builds.apache.org/job/torque4-test-project-derby/ws/target/torque/test/schema/./foreign-key-schema.xml>
INFO  org.apache.torque.generator.control.Controller - Start generation of File <https://builds.apache.org/job/torque4-test-project-derby/ws/target/generated-sql/foreign-key-schema-idtable-init.sql>
INFO  org.apache.torque.generator.control.Controller - Processing source <https://builds.apache.org/job/torque4-test-project-derby/ws/target/torque/test/schema/./included-from-included-schema.xml>
INFO  org.apache.torque.generator.control.Controller - Start generation of File <https://builds.apache.org/job/torque4-test-project-derby/ws/target/generated-sql/included-from-included-schema-idtable-init.sql>
INFO  org.apache.torque.generator.control.Controller - Processing source <https://builds.apache.org/job/torque4-test-project-derby/ws/target/torque/test/schema/./included-schema.xml>
INFO  org.apache.torque.generator.control.Controller - Start generation of File <https://builds.apache.org/job/torque4-test-project-derby/ws/target/generated-sql/included-schema-idtable-init.sql>
INFO  org.apache.torque.generator.control.Controller - Processing source <https://builds.apache.org/job/torque4-test-project-derby/ws/target/torque/test/schema/./pk-schema.xml>
INFO  org.apache.torque.generator.control.Controller - Start generation of File <https://builds.apache.org/job/torque4-test-project-derby/ws/target/generated-sql/pk-schema-idtable-init.sql>
INFO  org.apache.torque.generator.control.Controller - Processing source <https://builds.apache.org/job/torque4-test-project-derby/ws/target/torque/test/schema/./qualified-table-name-schema.xml>
INFO  org.apache.torque.generator.control.Controller - Start generation of File <https://builds.apache.org/job/torque4-test-project-derby/ws/target/generated-sql/qualified-table-name-schema-idtable-init.sql>
INFO  org.apache.torque.generator.control.Controller - Processing source <https://builds.apache.org/job/torque4-test-project-derby/ws/target/torque/test/schema/./save-method-in-peer-schema.xml>
INFO  org.apache.torque.generator.control.Controller - Start generation of File <https://builds.apache.org/job/torque4-test-project-derby/ws/target/generated-sql/save-method-in-peer-schema-idtable-init.sql>
INFO  org.apache.torque.generator.control.Controller - Processing source <https://builds.apache.org/job/torque4-test-project-derby/ws/target/torque/test/schema/./test-schema.xml>
INFO  org.apache.torque.generator.control.Controller - Start generation of File <https://builds.apache.org/job/torque4-test-project-derby/ws/target/generated-sql/test-schema-idtable-init.sql>
INFO  org.apache.torque.generator.control.Controller - Processing source <https://builds.apache.org/job/torque4-test-project-derby/ws/target/torque/test/schema/./types-schema.xml>
INFO  org.apache.torque.generator.control.Controller - Start generation of File <https://builds.apache.org/job/torque4-test-project-derby/ws/target/generated-sql/types-schema-idtable-init.sql>
[INFO] Generation successful
[INFO] [torque:generate {execution: generate-html-doc}]
INFO  org.apache.torque.generator.control.Controller - readConfiguration() : Starting to read
configuration files
INFO  org.apache.torque.generator.control.Controller - readConfiguration() : Configuration
read.
INFO  org.apache.torque.generator.control.Controller - Processing output torque.doc.html.css
INFO  org.apache.torque.generator.control.Controller - Processing source <https://builds.apache.org/job/torque4-test-project-derby/ws/target/torque/test/schema/bookstore-schema.xml>
INFO  org.apache.torque.generator.control.Controller - Start generation of File <https://builds.apache.org/job/torque4-test-project-derby/ws/target/generated-docs/datamodel.css>
INFO  org.apache.torque.generator.control.Controller - Processing source <https://builds.apache.org/job/torque4-test-project-derby/ws/target/torque/test/schema/databaseMapInit-schema.xml>
INFO  org.apache.torque.generator.control.Controller - Start generation of File <https://builds.apache.org/job/torque4-test-project-derby/ws/target/generated-docs/datamodel.css>
INFO  org.apache.torque.generator.control.Controller - Processing source <https://builds.apache.org/job/torque4-test-project-derby/ws/target/torque/test/schema/default-value-schema.xml>
INFO  org.apache.torque.generator.control.Controller - Start generation of File <https://builds.apache.org/job/torque4-test-project-derby/ws/target/generated-docs/datamodel.css>
INFO  org.apache.torque.generator.control.Controller - Processing source <https://builds.apache.org/job/torque4-test-project-derby/ws/target/torque/test/schema/foreign-key-schema.xml>
INFO  org.apache.torque.generator.control.Controller - Start generation of File <https://builds.apache.org/job/torque4-test-project-derby/ws/target/generated-docs/datamodel.css>
INFO  org.apache.torque.generator.control.Controller - Processing source <https://builds.apache.org/job/torque4-test-project-derby/ws/target/torque/test/schema/index.xml>
INFO  org.apache.torque.generator.control.Controller - Start generation of File <https://builds.apache.org/job/torque4-test-project-derby/ws/target/generated-docs/datamodel.css>
INFO  org.apache.torque.generator.control.Controller - Processing source <https://builds.apache.org/job/torque4-test-project-derby/ws/target/torque/test/schema/pk-schema.xml>
INFO  org.apache.torque.generator.control.Controller - Start generation of File <https://builds.apache.org/job/torque4-test-project-derby/ws/target/generated-docs/datamodel.css>
INFO  org.apache.torque.generator.control.Controller - Processing source <https://builds.apache.org/job/torque4-test-project-derby/ws/target/torque/test/schema/qualified-table-name-schema.xml>
INFO  org.apache.torque.generator.control.Controller - Start generation of File <https://builds.apache.org/job/torque4-test-project-derby/ws/target/generated-docs/datamodel.css>
INFO  org.apache.torque.generator.control.Controller - Processing source <https://builds.apache.org/job/torque4-test-project-derby/ws/target/torque/test/schema/save-method-in-peer-schema.xml>
INFO  org.apache.torque.generator.control.Controller - Start generation of File <https://builds.apache.org/job/torque4-test-project-derby/ws/target/generated-docs/datamodel.css>
INFO  org.apache.torque.generator.control.Controller - Processing source <https://builds.apache.org/job/torque4-test-project-derby/ws/target/torque/test/schema/test-schema.xml>
INFO  org.apache.torque.generator.control.Controller - Start generation of File <https://builds.apache.org/job/torque4-test-project-derby/ws/target/generated-docs/datamodel.css>
INFO  org.apache.torque.generator.control.Controller - Processing source <https://builds.apache.org/job/torque4-test-project-derby/ws/target/torque/test/schema/types-schema.xml>
INFO  org.apache.torque.generator.control.Controller - Start generation of File <https://builds.apache.org/job/torque4-test-project-derby/ws/target/generated-docs/datamodel.css>
INFO  org.apache.torque.generator.control.Controller - Processing output torque.doc.html.html
INFO  org.apache.torque.generator.control.Controller - Processing source <https://builds.apache.org/job/torque4-test-project-derby/ws/target/torque/test/schema/bookstore-schema.xml>
INFO  org.apache.torque.generator.control.Controller - Start generation of File <https://builds.apache.org/job/torque4-test-project-derby/ws/target/generated-docs/bookstore-schema.html>
INFO  org.apache.torque.generator.control.Controller - Processing source <https://builds.apache.org/job/torque4-test-project-derby/ws/target/torque/test/schema/databaseMapInit-schema.xml>
INFO  org.apache.torque.generator.control.Controller - Start generation of File <https://builds.apache.org/job/torque4-test-project-derby/ws/target/generated-docs/databaseMapInit-schema.html>
INFO  org.apache.torque.generator.control.Controller - Processing source <https://builds.apache.org/job/torque4-test-project-derby/ws/target/torque/test/schema/default-value-schema.xml>
INFO  org.apache.torque.generator.control.Controller - Start generation of File <https://builds.apache.org/job/torque4-test-project-derby/ws/target/generated-docs/default-value-schema.html>
INFO  org.apache.torque.generator.control.Controller - Processing source <https://builds.apache.org/job/torque4-test-project-derby/ws/target/torque/test/schema/foreign-key-schema.xml>
INFO  org.apache.torque.generator.control.Controller - Start generation of File <https://builds.apache.org/job/torque4-test-project-derby/ws/target/generated-docs/foreign-key-schema.html>
INFO  org.apache.torque.generator.control.Controller - Processing source <https://builds.apache.org/job/torque4-test-project-derby/ws/target/torque/test/schema/index.xml>
INFO  org.apache.torque.generator.control.Controller - Start generation of File <https://builds.apache.org/job/torque4-test-project-derby/ws/target/generated-docs/index.html>
INFO  org.apache.torque.generator.control.Controller - Processing source <https://builds.apache.org/job/torque4-test-project-derby/ws/target/torque/test/schema/pk-schema.xml>
INFO  org.apache.torque.generator.control.Controller - Start generation of File <https://builds.apache.org/job/torque4-test-project-derby/ws/target/generated-docs/pk-schema.html>
INFO  org.apache.torque.generator.control.Controller - Processing source <https://builds.apache.org/job/torque4-test-project-derby/ws/target/torque/test/schema/qualified-table-name-schema.xml>
INFO  org.apache.torque.generator.control.Controller - Start generation of File <https://builds.apache.org/job/torque4-test-project-derby/ws/target/generated-docs/qualified-table-name-schema.html>
INFO  org.apache.torque.generator.control.Controller - Processing source <https://builds.apache.org/job/torque4-test-project-derby/ws/target/torque/test/schema/save-method-in-peer-schema.xml>
INFO  org.apache.torque.generator.control.Controller - Start generation of File <https://builds.apache.org/job/torque4-test-project-derby/ws/target/generated-docs/save-method-in-peer-schema.html>
INFO  org.apache.torque.generator.control.Controller - Processing source <https://builds.apache.org/job/torque4-test-project-derby/ws/target/torque/test/schema/test-schema.xml>
INFO  org.apache.torque.generator.control.Controller - Start generation of File <https://builds.apache.org/job/torque4-test-project-derby/ws/target/generated-docs/test-schema.html>
INFO  org.apache.torque.generator.control.Controller - Processing source <https://builds.apache.org/job/torque4-test-project-derby/ws/target/torque/test/schema/types-schema.xml>
INFO  org.apache.torque.generator.control.Controller - Start generation of File <https://builds.apache.org/job/torque4-test-project-derby/ws/target/generated-docs/types-schema.html>
[INFO] Generation successful
[WARNING] The parameter expression: 'project.build.resources' used in mojo: 'process' has
been deprecated. Use 'project.resources' instead.
[INFO] [remote-resources:process {execution: default}]
[debug] execute contextualize
[INFO] [resources:resources {execution: default-resources}]
[INFO] Using 'ISO-8859-1' encoding to copy filtered resources.
[INFO] skip non existing resourceDirectory <https://builds.apache.org/job/torque4-test-project-derby/ws/src/main/resources>
[INFO] Copying 3 resources
[INFO] [compiler:compile {execution: default-compile}]
[INFO] Compiling 670 source files to <https://builds.apache.org/job/torque4-test-project-derby/ws/target/classes>
[INFO] [sql:execute {execution: execute-ddl}]
[INFO] Executing file: <https://builds.apache.org/job/torque4-test-project-derby/ws/target/generated-sql/bookstore-schema.sql>
[INFO] Executing file: <https://builds.apache.org/job/torque4-test-project-derby/ws/target/generated-sql/databaseMapInit-schema.sql>
[INFO] Executing file: <https://builds.apache.org/job/torque4-test-project-derby/ws/target/generated-sql/default-value-schema.sql>
[INFO] Executing file: <https://builds.apache.org/job/torque4-test-project-derby/ws/target/generated-sql/foreign-key-schema.sql>
[INFO] Executing file: <https://builds.apache.org/job/torque4-test-project-derby/ws/target/generated-sql/id-table-schema.sql>
[INFO] Executing file: <https://builds.apache.org/job/torque4-test-project-derby/ws/target/generated-sql/index.sql>
[INFO] Executing file: <https://builds.apache.org/job/torque4-test-project-derby/ws/target/generated-sql/pk-schema.sql>
[INFO] Executing file: <https://builds.apache.org/job/torque4-test-project-derby/ws/target/generated-sql/qualified-table-name-schema.sql>
[INFO] Executing file: <https://builds.apache.org/job/torque4-test-project-derby/ws/target/generated-sql/save-method-in-peer-schema.sql>
[INFO] Executing file: <https://builds.apache.org/job/torque4-test-project-derby/ws/target/generated-sql/test-schema.sql>
[INFO] Executing file: <https://builds.apache.org/job/torque4-test-project-derby/ws/target/generated-sql/types-schema.sql>
[INFO] 120 of 120 SQL statements executed successfully
[INFO] [sql:execute {execution: execute-idtable-sql}]
[INFO] Executing file: <https://builds.apache.org/job/torque4-test-project-derby/ws/target/generated-sql/bookstore-schema-idtable-init.sql>
[INFO] Executing file: <https://builds.apache.org/job/torque4-test-project-derby/ws/target/generated-sql/databaseMapInit-schema-idtable-init.sql>
[INFO] Executing file: <https://builds.apache.org/job/torque4-test-project-derby/ws/target/generated-sql/default-value-schema-idtable-init.sql>
[INFO] Executing file: <https://builds.apache.org/job/torque4-test-project-derby/ws/target/generated-sql/ext-schema-idtable-init.sql>
[INFO] Executing file: <https://builds.apache.org/job/torque4-test-project-derby/ws/target/generated-sql/extext-schema-idtable-init.sql>
[INFO] Executing file: <https://builds.apache.org/job/torque4-test-project-derby/ws/target/generated-sql/foreign-key-schema-idtable-init.sql>
[INFO] Executing file: <https://builds.apache.org/job/torque4-test-project-derby/ws/target/generated-sql/pk-schema-idtable-init.sql>
[INFO] Executing file: <https://builds.apache.org/job/torque4-test-project-derby/ws/target/generated-sql/qualified-table-name-schema-idtable-init.sql>
[INFO] Executing file: <https://builds.apache.org/job/torque4-test-project-derby/ws/target/generated-sql/save-method-in-peer-schema-idtable-init.sql>
[INFO] Executing file: <https://builds.apache.org/job/torque4-test-project-derby/ws/target/generated-sql/test-schema-idtable-init.sql>
[INFO] Executing file: <https://builds.apache.org/job/torque4-test-project-derby/ws/target/generated-sql/types-schema-idtable-init.sql>
[INFO] 75 of 75 SQL statements executed successfully
[INFO] [sql:execute {execution: shutdown-db-after-ddl}]
[debug] execute contextualize
[INFO] [resources:testResources {execution: default-testResources}]
[INFO] Using 'ISO-8859-1' encoding to copy filtered resources.
[INFO] Copying 6 resources
[INFO] Copying 3 resources
[INFO] [compiler:testCompile {execution: default-testCompile}]
[INFO] Compiling 55 source files to <https://builds.apache.org/job/torque4-test-project-derby/ws/target/test-classes>
[INFO] -------------------------------------------------------------
[ERROR] COMPILATION ERROR : 
[INFO] -------------------------------------------------------------
[ERROR] <https://builds.apache.org/job/torque4-test-project-derby/ws/src/test/java/org/apache/torque/generated/dataobject/GetRelatedObjectsJoinTest.java>:[99,24]
cannot find symbol
symbol  : method getMultiRefsJoinPIntegerPk(org.apache.torque.criteria.Criteria)
location: class org.apache.torque.test.dbobject.OIntegerPk

[ERROR] <https://builds.apache.org/job/torque4-test-project-derby/ws/src/test/java/org/apache/torque/generated/dataobject/GetRelatedObjectsJoinTest.java>:[148,24]
cannot find symbol
symbol  : method getMultiRefsJoinPIntegerPk(org.apache.torque.criteria.Criteria)
location: class org.apache.torque.test.dbobject.OIntegerPk

[ERROR] <https://builds.apache.org/job/torque4-test-project-derby/ws/src/test/java/org/apache/torque/generated/dataobject/GetRelatedObjectsJoinTest.java>:[196,18]
cannot find symbol
symbol  : method getMultiRefsJoinPIntegerPk(org.apache.torque.criteria.Criteria)
location: class org.apache.torque.test.dbobject.OIntegerPk

[ERROR] <https://builds.apache.org/job/torque4-test-project-derby/ws/src/test/java/org/apache/torque/generated/dataobject/GetRelatedObjectsJoinTest.java>:[199,24]
cannot find symbol
symbol  : method getMultiRefsJoinPIntegerPk(org.apache.torque.criteria.Criteria)
location: class org.apache.torque.test.dbobject.OIntegerPk

[ERROR] <https://builds.apache.org/job/torque4-test-project-derby/ws/src/test/java/org/apache/torque/generated/dataobject/GetRelatedObjectsJoinTest.java>:[243,24]
cannot find symbol
symbol  : method getMultiRefSameTableRelatedByReference1sJoinOIntegerPkRelatedByReference2(org.apache.torque.criteria.Criteria)
location: class org.apache.torque.test.dbobject.OIntegerPk

[INFO] 5 errors 
[INFO] -------------------------------------------------------------
[JENKINS] Archiving <https://builds.apache.org/job/torque4-test-project-derby/ws/pom.xml>
to /home/hudson/hudson/jobs/torque4-test-project-derby/modules/org.apache.torque$torque-test/builds/2013-08-27_23-45-31/archive/org.apache.torque/torque-test/4.1-SNAPSHOT/torque-test-4.1-SNAPSHOT.pom
[INFO] ------------------------------------------------------------------------
[ERROR] BUILD FAILURE
[INFO] ------------------------------------------------------------------------
[INFO] Compilation failure

<https://builds.apache.org/job/torque4-test-project-derby/ws/src/test/java/org/apache/torque/generated/dataobject/GetRelatedObjectsJoinTest.java>:[99,24]
cannot find symbol
symbol  : method getMultiRefsJoinPIntegerPk(org.apache.torque.criteria.Criteria)
location: class org.apache.torque.test.dbobject.OIntegerPk

<https://builds.apache.org/job/torque4-test-project-derby/ws/src/test/java/org/apache/torque/generated/dataobject/GetRelatedObjectsJoinTest.java>:[148,24]
cannot find symbol
symbol  : method getMultiRefsJoinPIntegerPk(org.apache.torque.criteria.Criteria)
location: class org.apache.torque.test.dbobject.OIntegerPk

<https://builds.apache.org/job/torque4-test-project-derby/ws/src/test/java/org/apache/torque/generated/dataobject/GetRelatedObjectsJoinTest.java>:[196,18]
cannot find symbol
symbol  : method getMultiRefsJoinPIntegerPk(org.apache.torque.criteria.Criteria)
location: class org.apache.torque.test.dbobject.OIntegerPk

<https://builds.apache.org/job/torque4-test-project-derby/ws/src/test/java/org/apache/torque/generated/dataobject/GetRelatedObjectsJoinTest.java>:[199,24]
cannot find symbol
symbol  : method getMultiRefsJoinPIntegerPk(org.apache.torque.criteria.Criteria)
location: class org.apache.torque.test.dbobject.OIntegerPk

<https://builds.apache.org/job/torque4-test-project-derby/ws/src/test/java/org/apache/torque/generated/dataobject/GetRelatedObjectsJoinTest.java>:[243,24]
cannot find symbol
symbol  : method getMultiRefSameTableRelatedByReference1sJoinOIntegerPkRelatedByReference2(org.apache.torque.criteria.Criteria)
location: class org.apache.torque.test.dbobject.OIntegerPk


[INFO] ------------------------------------------------------------------------
[INFO] For more information, run Maven with the -e switch
[INFO] ------------------------------------------------------------------------
[INFO] Total time: 1 minute 14 seconds
[INFO] Finished at: Tue Aug 27 23:47:09 UTC 2013
[INFO] Final Memory: 52M/236M
[INFO] ------------------------------------------------------------------------
Waiting for Jenkins to finish collecting data
Sending e-mails to: torque-dev@db.apache.org
channel stopped

---------------------------------------------------------------------
To unsubscribe, e-mail: torque-dev-unsubscribe@db.apache.org
For additional commands, e-mail: torque-dev-help@db.apache.org


Mime
View raw message