db-torque-dev mailing list archives

Site index · List index
Message view « Date » · « Thread »
Top « Date » · « Thread »
From Apache Jenkins Server <jenk...@builds.apache.org>
Subject Build failed in Jenkins: torque4-test-project-hsqldb » Torque Test Project #268
Date Wed, 17 Jul 2013 22:16:10 GMT
See <https://builds.apache.org/job/torque4-test-project-hsqldb/org.apache.torque$torque-test/268/>

------------------------------------------
[INFO] ------------------------------------------------------------------------
[INFO] Building Torque Test Project
[INFO]    task-segment: [clean, package]
[INFO] ------------------------------------------------------------------------
[INFO] [clean:clean {execution: default-clean}]
[INFO] [antrun:run {execution: clean-generated-sources}]
[INFO] Executing tasks

main:
     [echo] Deleting directory src/main/generated-java
     [echo] Deleting directory target/torque
[INFO] Executed tasks
[INFO] [antrun:run {execution: filter-schema}]
[INFO] Executing tasks

main:
     [copy] Copying 15 files to <https://builds.apache.org/job/torque4-test-project-hsqldb/org.apache.torque$torque-test/ws/target/torque/test/schema>
     [copy] Copying 2 files to <https://builds.apache.org/job/torque4-test-project-hsqldb/org.apache.torque$torque-test/ws/target/torque/test/sql>
[INFO] Executed tasks
[INFO] [antrun:run {execution: test-database-filled}]
[INFO] Executing tasks

main:
      [sql] Executing commands
      [sql] Failed to execute:  select count(*) from book
[INFO] An Ant BuildException has occured: java.sql.SQLSyntaxErrorException: user lacks privilege
or object not found: BOOK
around Ant part ...<sql errorproperty="cannot.access.book.table" userid="sa" driver="org.hsqldb.jdbcDriver"
password="" url="jdbc:hsqldb:torque-test/target/sqltest;shutdown=true">select count(*)
from book;</sql>... @ 4:163 in <https://builds.apache.org/job/torque4-test-project-hsqldb/org.apache.torque$torque-test/ws/target/antrun/build-main.xml>
<https://builds.apache.org/job/torque4-test-project-hsqldb/org.apache.torque$torque-test/ws/target/antrun/build-main.xml>:4:
java.sql.SQLSyntaxErrorException: user lacks privilege or object not found: BOOK
	at org.apache.tools.ant.taskdefs.SQLExec.execute(SQLExec.java:672)
	at org.apache.tools.ant.UnknownElement.execute(UnknownElement.java:291)
	at sun.reflect.NativeMethodAccessorImpl.invoke0(Native Method)
	at sun.reflect.NativeMethodAccessorImpl.invoke(NativeMethodAccessorImpl.java:39)
	at sun.reflect.DelegatingMethodAccessorImpl.invoke(DelegatingMethodAccessorImpl.java:25)
	at java.lang.reflect.Method.invoke(Method.java:597)
	at org.apache.tools.ant.dispatch.DispatchUtils.execute(DispatchUtils.java:106)
	at org.apache.tools.ant.Task.perform(Task.java:348)
	at org.apache.tools.ant.Target.execute(Target.java:390)
	at org.apache.tools.ant.Target.performTasks(Target.java:411)
	at org.apache.tools.ant.Project.executeSortedTargets(Project.java:1399)
	at org.apache.tools.ant.Project.executeTarget(Project.java:1368)
	at org.apache.maven.plugin.antrun.AntRunMojo.execute(AntRunMojo.java:327)
	at org.apache.maven.plugin.DefaultPluginManager.executeMojo(DefaultPluginManager.java:490)
	at hudson.maven.agent.PluginManagerInterceptor.executeMojo(PluginManagerInterceptor.java:182)
	at org.apache.maven.lifecycle.DefaultLifecycleExecutor.executeGoals(DefaultLifecycleExecutor.java:694)
	at org.apache.maven.lifecycle.DefaultLifecycleExecutor.executeGoalWithLifecycle(DefaultLifecycleExecutor.java:556)
	at org.apache.maven.lifecycle.DefaultLifecycleExecutor.executeGoal(DefaultLifecycleExecutor.java:535)
	at org.apache.maven.lifecycle.DefaultLifecycleExecutor.executeGoalAndHandleFailures(DefaultLifecycleExecutor.java:387)
	at org.apache.maven.lifecycle.DefaultLifecycleExecutor.executeTaskSegments(DefaultLifecycleExecutor.java:348)
	at org.apache.maven.lifecycle.DefaultLifecycleExecutor.execute(DefaultLifecycleExecutor.java:180)
	at org.apache.maven.lifecycle.LifecycleExecutorInterceptor.execute(LifecycleExecutorInterceptor.java:65)
	at org.apache.maven.DefaultMaven.doExecute(DefaultMaven.java:328)
	at org.apache.maven.DefaultMaven.execute(DefaultMaven.java:138)
	at org.apache.maven.cli.MavenCli.main(MavenCli.java:362)
	at sun.reflect.NativeMethodAccessorImpl.invoke0(Native Method)
	at sun.reflect.NativeMethodAccessorImpl.invoke(NativeMethodAccessorImpl.java:39)
	at sun.reflect.DelegatingMethodAccessorImpl.invoke(DelegatingMethodAccessorImpl.java:25)
	at java.lang.reflect.Method.invoke(Method.java:597)
	at org.codehaus.classworlds.Launcher.launchEnhanced(Launcher.java:315)
	at org.codehaus.classworlds.Launcher.launch(Launcher.java:255)
	at hudson.maven.agent.Main.launch(Main.java:185)
	at hudson.maven.MavenBuilder.call(MavenBuilder.java:154)
	at hudson.maven.Maven2Builder.call(Maven2Builder.java:79)
	at hudson.maven.Maven2Builder.call(Maven2Builder.java:55)
	at hudson.remoting.UserRequest.perform(UserRequest.java:118)
	at hudson.remoting.UserRequest.perform(UserRequest.java:48)
	at hudson.remoting.Request$2.run(Request.java:326)
	at hudson.remoting.InterceptingExecutorService$1.call(InterceptingExecutorService.java:72)
	at java.util.concurrent.FutureTask$Sync.innerRun(FutureTask.java:303)
	at java.util.concurrent.FutureTask.run(FutureTask.java:138)
	at java.util.concurrent.ThreadPoolExecutor$Worker.runTask(ThreadPoolExecutor.java:895)
	at java.util.concurrent.ThreadPoolExecutor$Worker.run(ThreadPoolExecutor.java:918)
	at java.lang.Thread.run(Thread.java:662)
Caused by: java.sql.SQLSyntaxErrorException: user lacks privilege or object not found: BOOK
	at org.hsqldb.jdbc.Util.sqlException(Unknown Source)
	at org.hsqldb.jdbc.Util.sqlException(Unknown Source)
	at org.hsqldb.jdbc.JDBCStatement.fetchResult(Unknown Source)
	at org.hsqldb.jdbc.JDBCStatement.execute(Unknown Source)
	at org.apache.tools.ant.taskdefs.SQLExec.execSQL(SQLExec.java:775)
	at org.apache.tools.ant.taskdefs.SQLExec.runStatements(SQLExec.java:745)
	at org.apache.tools.ant.taskdefs.SQLExec$Transaction.runTransaction(SQLExec.java:1043)
	at org.apache.tools.ant.taskdefs.SQLExec$Transaction.access$000(SQLExec.java:985)
	at org.apache.tools.ant.taskdefs.SQLExec.execute(SQLExec.java:653)
	... 43 more
Caused by: org.hsqldb.HsqlException: user lacks privilege or object not found: BOOK
	at org.hsqldb.error.Error.error(Unknown Source)
	at org.hsqldb.error.Error.error(Unknown Source)
	at org.hsqldb.SchemaManager.getTable(Unknown Source)
	at org.hsqldb.ParserDQL.readTableName(Unknown Source)
	at org.hsqldb.ParserDQL.readTableOrSubquery(Unknown Source)
	at org.hsqldb.ParserDQL.XreadTableReference(Unknown Source)
	at org.hsqldb.ParserDQL.XreadFromClause(Unknown Source)
	at org.hsqldb.ParserDQL.XreadTableExpression(Unknown Source)
	at org.hsqldb.ParserDQL.XreadQuerySpecification(Unknown Source)
	at org.hsqldb.ParserDQL.XreadSimpleTable(Unknown Source)
	at org.hsqldb.ParserDQL.XreadQueryPrimary(Unknown Source)
	at org.hsqldb.ParserDQL.XreadQueryTerm(Unknown Source)
	at org.hsqldb.ParserDQL.XreadQueryExpressionBody(Unknown Source)
	at org.hsqldb.ParserDQL.XreadQueryExpression(Unknown Source)
	at org.hsqldb.ParserDQL.compileCursorSpecification(Unknown Source)
	at org.hsqldb.ParserCommand.compilePart(Unknown Source)
	at org.hsqldb.ParserCommand.compileStatements(Unknown Source)
	at org.hsqldb.Session.executeDirectStatement(Unknown Source)
	at org.hsqldb.Session.execute(Unknown Source)
	... 50 more
[INFO] [antrun:run {execution: shutdown-db-after-test-database}]
[INFO] Skipping Antrun execution
[INFO] [torque:generate {execution: generate-sources}]
INFO  org.apache.torque.generator.control.Controller - readConfiguration() : Starting to read
configuration files
[ERROR] 
org.apache.torque.generator.configuration.ConfigurationException: Trying to add the outlet
classJavadoc and class org.apache.torque.generator.template.velocity.VelocityOutlet : A outlet
with the same name  already exists, it has the class org.apache.torque.generator.template.velocity.VelocityOutlet
	at org.apache.torque.generator.configuration.outlet.OutletConfiguration.addOutlet(OutletConfiguration.java:209)
	at org.apache.torque.generator.configuration.outlet.OutletConfiguration.<init>(OutletConfiguration.java:88)
	at org.apache.torque.generator.configuration.outlet.OutletConfigurationXmlParser.readOutletConfiguration(OutletConfigurationXmlParser.java:198)
	at org.apache.torque.generator.configuration.UnitConfigurationReader.read(UnitConfigurationReader.java:113)
	at org.apache.torque.generator.configuration.UnitConfigurationReader.read(UnitConfigurationReader.java:136)
	at org.apache.torque.generator.configuration.Configuration.read(Configuration.java:130)
	at org.apache.torque.generator.control.Controller.readConfiguration(Controller.java:155)
	at org.apache.torque.generator.control.Controller.run(Controller.java:104)
	at org.apache.torque.generator.maven.TorqueGeneratorMojo.execute(TorqueGeneratorMojo.java:678)
	at org.apache.maven.plugin.DefaultPluginManager.executeMojo(DefaultPluginManager.java:490)
	at hudson.maven.agent.PluginManagerInterceptor.executeMojo(PluginManagerInterceptor.java:182)
	at org.apache.maven.lifecycle.DefaultLifecycleExecutor.executeGoals(DefaultLifecycleExecutor.java:694)
	at org.apache.maven.lifecycle.DefaultLifecycleExecutor.executeGoalWithLifecycle(DefaultLifecycleExecutor.java:556)
	at org.apache.maven.lifecycle.DefaultLifecycleExecutor.executeGoal(DefaultLifecycleExecutor.java:535)
	at org.apache.maven.lifecycle.DefaultLifecycleExecutor.executeGoalAndHandleFailures(DefaultLifecycleExecutor.java:387)
	at org.apache.maven.lifecycle.DefaultLifecycleExecutor.executeTaskSegments(DefaultLifecycleExecutor.java:348)
	at org.apache.maven.lifecycle.DefaultLifecycleExecutor.execute(DefaultLifecycleExecutor.java:180)
	at org.apache.maven.lifecycle.LifecycleExecutorInterceptor.execute(LifecycleExecutorInterceptor.java:65)
	at org.apache.maven.DefaultMaven.doExecute(DefaultMaven.java:328)
	at org.apache.maven.DefaultMaven.execute(DefaultMaven.java:138)
	at org.apache.maven.cli.MavenCli.main(MavenCli.java:362)
	at sun.reflect.NativeMethodAccessorImpl.invoke0(Native Method)
	at sun.reflect.NativeMethodAccessorImpl.invoke(NativeMethodAccessorImpl.java:39)
	at sun.reflect.DelegatingMethodAccessorImpl.invoke(DelegatingMethodAccessorImpl.java:25)
	at java.lang.reflect.Method.invoke(Method.java:597)
	at org.codehaus.classworlds.Launcher.launchEnhanced(Launcher.java:315)
	at org.codehaus.classworlds.Launcher.launch(Launcher.java:255)
	at hudson.maven.agent.Main.launch(Main.java:185)
	at hudson.maven.MavenBuilder.call(MavenBuilder.java:154)
	at hudson.maven.Maven2Builder.call(Maven2Builder.java:79)
	at hudson.maven.Maven2Builder.call(Maven2Builder.java:55)
	at hudson.remoting.UserRequest.perform(UserRequest.java:118)
	at hudson.remoting.UserRequest.perform(UserRequest.java:48)
	at hudson.remoting.Request$2.run(Request.java:326)
	at hudson.remoting.InterceptingExecutorService$1.call(InterceptingExecutorService.java:72)
	at java.util.concurrent.FutureTask$Sync.innerRun(FutureTask.java:303)
	at java.util.concurrent.FutureTask.run(FutureTask.java:138)
	at java.util.concurrent.ThreadPoolExecutor$Worker.runTask(ThreadPoolExecutor.java:895)
	at java.util.concurrent.ThreadPoolExecutor$Worker.run(ThreadPoolExecutor.java:918)
	at java.lang.Thread.run(Thread.java:662)
[JENKINS] Archiving <https://builds.apache.org/job/torque4-test-project-hsqldb/org.apache.torque$torque-test/ws/pom.xml>
to /home/hudson/hudson/jobs/torque4-test-project-hsqldb/modules/org.apache.torque$torque-test/builds/2013-07-17_22-13-13/archive/org.apache.torque/torque-test/4.1-SNAPSHOT/torque-test-4.1-SNAPSHOT.pom
[INFO] ------------------------------------------------------------------------
[ERROR] BUILD ERROR
[INFO] ------------------------------------------------------------------------
[INFO] Trying to add the outlet classJavadoc and class org.apache.torque.generator.template.velocity.VelocityOutlet
: A outlet with the same name  already exists, it has the class org.apache.torque.generator.template.velocity.VelocityOutlet
[INFO] ------------------------------------------------------------------------
[INFO] For more information, run Maven with the -e switch
[INFO] ------------------------------------------------------------------------
[INFO] Total time: 2 minutes 22 seconds
[INFO] Finished at: Wed Jul 17 22:16:09 UTC 2013
[INFO] Final Memory: 114M/427M
[INFO] ------------------------------------------------------------------------

---------------------------------------------------------------------
To unsubscribe, e-mail: torque-dev-unsubscribe@db.apache.org
For additional commands, e-mail: torque-dev-help@db.apache.org


Mime
View raw message