db-torque-dev mailing list archives

Site index · List index
Message view « Date » · « Thread »
Top « Date » · « Thread »
From Apache Jenkins Server <jenk...@builds.apache.org>
Subject Build failed in Jenkins: torque4-test-project-derby » Torque Test Project #343
Date Mon, 20 May 2013 01:38:38 GMT
See <https://builds.apache.org/job/torque4-test-project-derby/org.apache.torque$torque-test/343/>

------------------------------------------
[...truncated 1697 lines...]
INFO  org.apache.torque.generator.control.Controller - Start generation of File <https://builds.apache.org/job/torque4-test-project-derby/org.apache.torque$torque-test/ws/target/generated-sources/org/apache/torque/test/manager/base/BaseAutoincrementNativeManager.java>
INFO  org.apache.torque.generator.control.Controller - Start generation of File <https://builds.apache.org/job/torque4-test-project-derby/org.apache.torque$torque-test/ws/target/generated-sources/org/apache/torque/test/manager/base/BaseAutoincrementNoneManager.java>
INFO  org.apache.torque.generator.control.Controller - Start generation of File <https://builds.apache.org/job/torque4-test-project-derby/org.apache.torque$torque-test/ws/target/generated-sources/org/apache/torque/test/manager/base/BaseAutoincrementIdbrokerManager.java>
INFO  org.apache.torque.generator.control.Controller - Start generation of File <https://builds.apache.org/job/torque4-test-project-derby/org.apache.torque$torque-test/ws/target/generated-sources/org/apache/torque/test/manager/base/BaseInheritanceTestManager.java>
INFO  org.apache.torque.generator.control.Controller - Start generation of File <https://builds.apache.org/job/torque4-test-project-derby/org.apache.torque$torque-test/ws/target/generated-sources/org/apache/torque/test/manager/base/BaseInheritanceClassnameTestManager.java>
INFO  org.apache.torque.generator.control.Controller - Start generation of File <https://builds.apache.org/job/torque4-test-project-derby/org.apache.torque$torque-test/ws/target/generated-sources/org/apache/torque/test/manager/base/BaseSummarize1Manager.java>
INFO  org.apache.torque.generator.control.Controller - Start generation of File <https://builds.apache.org/job/torque4-test-project-derby/org.apache.torque$torque-test/ws/target/generated-sources/org/apache/torque/test/manager/base/BaseSkipSqlManager.java>
INFO  org.apache.torque.generator.control.Controller - Start generation of File <https://builds.apache.org/job/torque4-test-project-derby/org.apache.torque$torque-test/ws/target/generated-sources/org/apache/torque/test/manager/base/BaseAbstractManager.java>
INFO  org.apache.torque.generator.control.Controller - Start generation of File <https://builds.apache.org/job/torque4-test-project-derby/org.apache.torque$torque-test/ws/target/generated-sources/org/apache/torque/test/manager/base/BaseTestInterfaceManager.java>
INFO  org.apache.torque.generator.control.Controller - Start generation of File <https://builds.apache.org/job/torque4-test-project-derby/org.apache.torque$torque-test/ws/target/generated-sources/org/apache/torque/test/manager/base/BaseLocalTestInterfaceManager.java>
INFO  org.apache.torque.generator.control.Controller - Start generation of File <https://builds.apache.org/job/torque4-test-project-derby/org.apache.torque$torque-test/ws/target/generated-sources/org/apache/torque/test/manager/base/BaseOptimisticLockingManager.java>
INFO  org.apache.torque.generator.control.Controller - Start generation of File <https://builds.apache.org/job/torque4-test-project-derby/org.apache.torque$torque-test/ws/target/generated-sources/org/apache/torque/test/manager/base/BaseOptimisticLockingSimpleManager.java>
INFO  org.apache.torque.generator.control.Controller - Start generation of File <https://builds.apache.org/job/torque4-test-project-derby/org.apache.torque$torque-test/ws/target/generated-sources/org/apache/torque/test/manager/base/BaseIncludedManager.java>
INFO  org.apache.torque.generator.control.Controller - Start generation of File <https://builds.apache.org/job/torque4-test-project-derby/org.apache.torque$torque-test/ws/target/generated-sources/org/apache/torque/test/manager/base/BaseIncludedFromIncludedManager.java>
INFO  org.apache.torque.generator.control.Controller - Processing source <https://builds.apache.org/job/torque4-test-project-derby/org.apache.torque$torque-test/ws/target/torque/test/schema/types-schema.xml>
INFO  org.apache.torque.generator.control.Controller - Start generation of File <https://builds.apache.org/job/torque4-test-project-derby/org.apache.torque$torque-test/ws/target/generated-sources/org/apache/torque/test/manager/base/BaseTypesObjectManager.java>
INFO  org.apache.torque.generator.control.Controller - Start generation of File <https://builds.apache.org/job/torque4-test-project-derby/org.apache.torque$torque-test/ws/target/generated-sources/org/apache/torque/test/manager/base/BaseTypesPrimitiveManager.java>
INFO  org.apache.torque.generator.control.Controller - Start generation of File <https://builds.apache.org/job/torque4-test-project-derby/org.apache.torque$torque-test/ws/target/generated-sources/org/apache/torque/test/manager/base/BaseBitTypeManager.java>
INFO  org.apache.torque.generator.control.Controller - Start generation of File <https://builds.apache.org/job/torque4-test-project-derby/org.apache.torque$torque-test/ws/target/generated-sources/org/apache/torque/test/manager/base/BaseBlobTypeManager.java>
INFO  org.apache.torque.generator.control.Controller - Start generation of File <https://builds.apache.org/job/torque4-test-project-derby/org.apache.torque$torque-test/ws/target/generated-sources/org/apache/torque/test/manager/base/BaseClobTypeManager.java>
INFO  org.apache.torque.generator.control.Controller - Start generation of File <https://builds.apache.org/job/torque4-test-project-derby/org.apache.torque$torque-test/ws/target/generated-sources/org/apache/torque/test/manager/base/BaseBinaryTypeManager.java>
INFO  org.apache.torque.generator.control.Controller - Start generation of File <https://builds.apache.org/job/torque4-test-project-derby/org.apache.torque$torque-test/ws/target/generated-sources/org/apache/torque/test/manager/base/BaseVarbinaryTypeManager.java>
INFO  org.apache.torque.generator.control.Controller - Start generation of File <https://builds.apache.org/job/torque4-test-project-derby/org.apache.torque$torque-test/ws/target/generated-sources/org/apache/torque/test/manager/base/BaseLongvarbinaryTypeManager.java>
INFO  org.apache.torque.generator.control.Controller - Start generation of File <https://builds.apache.org/job/torque4-test-project-derby/org.apache.torque$torque-test/ws/target/generated-sources/org/apache/torque/test/manager/base/BaseBintBcharTypeManager.java>
INFO  org.apache.torque.generator.control.Controller - Start generation of File <https://builds.apache.org/job/torque4-test-project-derby/org.apache.torque$torque-test/ws/target/generated-sources/org/apache/torque/test/manager/base/BaseDateTimeTimestampTypeManager.java>
INFO  org.apache.torque.generator.control.Controller - Start generation of File <https://builds.apache.org/job/torque4-test-project-derby/org.apache.torque$torque-test/ws/target/generated-sources/org/apache/torque/test/manager/base/BaseIntegerTypeManager.java>
INFO  org.apache.torque.generator.control.Controller - Start generation of File <https://builds.apache.org/job/torque4-test-project-derby/org.apache.torque$torque-test/ws/target/generated-sources/org/apache/torque/test/manager/base/BaseBigintTypeManager.java>
INFO  org.apache.torque.generator.control.Controller - Start generation of File <https://builds.apache.org/job/torque4-test-project-derby/org.apache.torque$torque-test/ws/target/generated-sources/org/apache/torque/test/manager/base/BaseVarcharTypeManager.java>
INFO  org.apache.torque.generator.control.Controller - Processing output torque.om.baseManagerForView
INFO  org.apache.torque.generator.control.Controller - Processing source <https://builds.apache.org/job/torque4-test-project-derby/org.apache.torque$torque-test/ws/target/torque/test/schema/bookstore-schema.xml>
INFO  org.apache.torque.generator.control.Controller - Start generation of File <https://builds.apache.org/job/torque4-test-project-derby/org.apache.torque$torque-test/ws/target/generated-sources/org/apache/torque/test/manager/base/BaseBookAuthorsManager.java>
INFO  org.apache.torque.generator.control.Controller - Processing source <https://builds.apache.org/job/torque4-test-project-derby/org.apache.torque$torque-test/ws/target/torque/test/schema/databaseMapInit-schema.xml>
INFO  org.apache.torque.generator.control.Controller - No start Elements found for path all-views/view
INFO  org.apache.torque.generator.control.Controller - Processing source <https://builds.apache.org/job/torque4-test-project-derby/org.apache.torque$torque-test/ws/target/torque/test/schema/default-value-schema.xml>
INFO  org.apache.torque.generator.control.Controller - No start Elements found for path all-views/view
INFO  org.apache.torque.generator.control.Controller - Processing source <https://builds.apache.org/job/torque4-test-project-derby/org.apache.torque$torque-test/ws/target/torque/test/schema/foreign-key-schema.xml>
INFO  org.apache.torque.generator.control.Controller - No start Elements found for path all-views/view
INFO  org.apache.torque.generator.control.Controller - Processing source <https://builds.apache.org/job/torque4-test-project-derby/org.apache.torque$torque-test/ws/target/torque/test/schema/index.xml>
INFO  org.apache.torque.generator.control.Controller - No start Elements found for path all-views/view
INFO  org.apache.torque.generator.control.Controller - Processing source <https://builds.apache.org/job/torque4-test-project-derby/org.apache.torque$torque-test/ws/target/torque/test/schema/pk-schema.xml>
INFO  org.apache.torque.generator.control.Controller - No start Elements found for path all-views/view
INFO  org.apache.torque.generator.control.Controller - Processing source <https://builds.apache.org/job/torque4-test-project-derby/org.apache.torque$torque-test/ws/target/torque/test/schema/qualified-table-name-schema.xml>
INFO  org.apache.torque.generator.control.Controller - No start Elements found for path all-views/view
INFO  org.apache.torque.generator.control.Controller - Processing source <https://builds.apache.org/job/torque4-test-project-derby/org.apache.torque$torque-test/ws/target/torque/test/schema/save-method-in-peer-schema.xml>
INFO  org.apache.torque.generator.control.Controller - No start Elements found for path all-views/view
INFO  org.apache.torque.generator.control.Controller - Processing source <https://builds.apache.org/job/torque4-test-project-derby/org.apache.torque$torque-test/ws/target/torque/test/schema/test-schema.xml>
INFO  org.apache.torque.generator.control.Controller - No start Elements found for path all-views/view
INFO  org.apache.torque.generator.control.Controller - Processing source <https://builds.apache.org/job/torque4-test-project-derby/org.apache.torque$torque-test/ws/target/torque/test/schema/types-schema.xml>
INFO  org.apache.torque.generator.control.Controller - No start Elements found for path all-views/view
[INFO] Generation successful
[INFO] [torque:generate {execution: generate-sql}]
INFO  org.apache.torque.generator.control.Controller - readConfiguration() : Starting to read
configuration files
May 20, 2013 1:37:44 AM org.codehaus.groovy.runtime.m12n.SimpleExtensionModule getMetaMethods
WARNING: Module [groovy-all] - Unable to load extension class [class org.codehaus.groovy.jsr223.ScriptExtensions]
due to [javax/script/ScriptEngine]. Maybe this module is not supported by your JVM version.
May 20, 2013 1:37:44 AM org.codehaus.groovy.runtime.m12n.SimpleExtensionModule getMetaMethods
WARNING: Module [groovy-all] - Unable to load extension class [class org.codehaus.groovy.jsr223.ScriptStaticExtensions]
due to [javax/script/ScriptEngineManager]. Maybe this module is not supported by your JVM
version.
INFO  org.apache.torque.generator.control.Controller - readConfiguration() : Configuration
read.
INFO  org.apache.torque.generator.control.Controller - Processing output torque.sql.ddl
INFO  org.apache.torque.generator.control.Controller - Processing source <https://builds.apache.org/job/torque4-test-project-derby/org.apache.torque$torque-test/ws/target/torque/test/schema/bookstore-schema.xml>
INFO  org.apache.torque.generator.control.Controller - Start generation of File <https://builds.apache.org/job/torque4-test-project-derby/org.apache.torque$torque-test/ws/target/generated-sql/bookstore-schema.sql>
INFO  org.apache.torque.generator.control.Controller - Processing source <https://builds.apache.org/job/torque4-test-project-derby/org.apache.torque$torque-test/ws/target/torque/test/schema/databaseMapInit-schema.xml>
INFO  org.apache.torque.generator.control.Controller - Start generation of File <https://builds.apache.org/job/torque4-test-project-derby/org.apache.torque$torque-test/ws/target/generated-sql/databaseMapInit-schema.sql>
INFO  org.apache.torque.generator.control.Controller - Processing source <https://builds.apache.org/job/torque4-test-project-derby/org.apache.torque$torque-test/ws/target/torque/test/schema/default-value-schema.xml>
INFO  org.apache.torque.generator.control.Controller - Start generation of File <https://builds.apache.org/job/torque4-test-project-derby/org.apache.torque$torque-test/ws/target/generated-sql/default-value-schema.sql>
INFO  org.apache.torque.generator.control.Controller - Processing source <https://builds.apache.org/job/torque4-test-project-derby/org.apache.torque$torque-test/ws/target/torque/test/schema/foreign-key-schema.xml>
INFO  org.apache.torque.generator.control.Controller - Start generation of File <https://builds.apache.org/job/torque4-test-project-derby/org.apache.torque$torque-test/ws/target/generated-sql/foreign-key-schema.sql>
INFO  org.apache.torque.generator.control.Controller - Processing source <https://builds.apache.org/job/torque4-test-project-derby/org.apache.torque$torque-test/ws/target/torque/test/schema/id-table-schema.xml>
INFO  org.apache.torque.generator.control.Controller - Start generation of File <https://builds.apache.org/job/torque4-test-project-derby/org.apache.torque$torque-test/ws/target/generated-sql/id-table-schema.sql>
INFO  org.apache.torque.generator.control.Controller - Processing source <https://builds.apache.org/job/torque4-test-project-derby/org.apache.torque$torque-test/ws/target/torque/test/schema/index.xml>
INFO  org.apache.torque.generator.control.Controller - Start generation of File <https://builds.apache.org/job/torque4-test-project-derby/org.apache.torque$torque-test/ws/target/generated-sql/index.sql>
INFO  org.apache.torque.generator.control.Controller - Processing source <https://builds.apache.org/job/torque4-test-project-derby/org.apache.torque$torque-test/ws/target/torque/test/schema/pk-schema.xml>
INFO  org.apache.torque.generator.control.Controller - Start generation of File <https://builds.apache.org/job/torque4-test-project-derby/org.apache.torque$torque-test/ws/target/generated-sql/pk-schema.sql>
INFO  org.apache.torque.generator.control.Controller - Processing source <https://builds.apache.org/job/torque4-test-project-derby/org.apache.torque$torque-test/ws/target/torque/test/schema/qualified-table-name-schema.xml>
INFO  org.apache.torque.generator.control.Controller - Start generation of File <https://builds.apache.org/job/torque4-test-project-derby/org.apache.torque$torque-test/ws/target/generated-sql/qualified-table-name-schema.sql>
INFO  org.apache.torque.generator.control.Controller - Processing source <https://builds.apache.org/job/torque4-test-project-derby/org.apache.torque$torque-test/ws/target/torque/test/schema/save-method-in-peer-schema.xml>
INFO  org.apache.torque.generator.control.Controller - Start generation of File <https://builds.apache.org/job/torque4-test-project-derby/org.apache.torque$torque-test/ws/target/generated-sql/save-method-in-peer-schema.sql>
INFO  org.apache.torque.generator.control.Controller - Processing source <https://builds.apache.org/job/torque4-test-project-derby/org.apache.torque$torque-test/ws/target/torque/test/schema/test-schema.xml>
INFO  org.apache.torque.generator.control.Controller - Start generation of File <https://builds.apache.org/job/torque4-test-project-derby/org.apache.torque$torque-test/ws/target/generated-sql/test-schema.sql>
INFO  org.apache.torque.generator.control.Controller - Processing source <https://builds.apache.org/job/torque4-test-project-derby/org.apache.torque$torque-test/ws/target/torque/test/schema/types-schema.xml>
INFO  org.apache.torque.generator.control.Controller - Start generation of File <https://builds.apache.org/job/torque4-test-project-derby/org.apache.torque$torque-test/ws/target/generated-sql/types-schema.sql>
[INFO] Generation successful
[INFO] [torque:generate {execution: generate-createdb-sql}]
INFO  org.apache.torque.generator.control.Controller - readConfiguration() : Starting to read
configuration files
INFO  org.apache.torque.generator.control.Controller - readConfiguration() : Configuration
read.
INFO  org.apache.torque.generator.control.Controller - Processing output torque.sql.createdb
INFO  org.apache.torque.generator.control.Controller - Processing source <https://builds.apache.org/job/torque4-test-project-derby/org.apache.torque$torque-test/ws/target/torque/test/schema/bookstore-schema.xml>
INFO  org.apache.torque.generator.control.Controller - Start generation of File <https://builds.apache.org/job/torque4-test-project-derby/org.apache.torque$torque-test/ws/target/generated-createdb-sql/bookstore-schema-create.sql>
INFO  org.apache.torque.generator.control.Controller - Processing source <https://builds.apache.org/job/torque4-test-project-derby/org.apache.torque$torque-test/ws/target/torque/test/schema/databaseMapInit-schema.xml>
INFO  org.apache.torque.generator.control.Controller - Start generation of File <https://builds.apache.org/job/torque4-test-project-derby/org.apache.torque$torque-test/ws/target/generated-createdb-sql/databaseMapInit-schema-create.sql>
INFO  org.apache.torque.generator.control.Controller - Processing source <https://builds.apache.org/job/torque4-test-project-derby/org.apache.torque$torque-test/ws/target/torque/test/schema/default-value-schema.xml>
INFO  org.apache.torque.generator.control.Controller - Start generation of File <https://builds.apache.org/job/torque4-test-project-derby/org.apache.torque$torque-test/ws/target/generated-createdb-sql/default-value-schema-create.sql>
INFO  org.apache.torque.generator.control.Controller - Processing source <https://builds.apache.org/job/torque4-test-project-derby/org.apache.torque$torque-test/ws/target/torque/test/schema/foreign-key-schema.xml>
INFO  org.apache.torque.generator.control.Controller - Start generation of File <https://builds.apache.org/job/torque4-test-project-derby/org.apache.torque$torque-test/ws/target/generated-createdb-sql/foreign-key-schema-create.sql>
INFO  org.apache.torque.generator.control.Controller - Processing source <https://builds.apache.org/job/torque4-test-project-derby/org.apache.torque$torque-test/ws/target/torque/test/schema/index.xml>
INFO  org.apache.torque.generator.control.Controller - Start generation of File <https://builds.apache.org/job/torque4-test-project-derby/org.apache.torque$torque-test/ws/target/generated-createdb-sql/index-create.sql>
INFO  org.apache.torque.generator.control.Controller - Processing source <https://builds.apache.org/job/torque4-test-project-derby/org.apache.torque$torque-test/ws/target/torque/test/schema/pk-schema.xml>
INFO  org.apache.torque.generator.control.Controller - Start generation of File <https://builds.apache.org/job/torque4-test-project-derby/org.apache.torque$torque-test/ws/target/generated-createdb-sql/pk-schema-create.sql>
INFO  org.apache.torque.generator.control.Controller - Processing source <https://builds.apache.org/job/torque4-test-project-derby/org.apache.torque$torque-test/ws/target/torque/test/schema/qualified-table-name-schema.xml>
INFO  org.apache.torque.generator.control.Controller - Start generation of File <https://builds.apache.org/job/torque4-test-project-derby/org.apache.torque$torque-test/ws/target/generated-createdb-sql/qualified-table-name-schema-create.sql>
INFO  org.apache.torque.generator.control.Controller - Processing source <https://builds.apache.org/job/torque4-test-project-derby/org.apache.torque$torque-test/ws/target/torque/test/schema/save-method-in-peer-schema.xml>
INFO  org.apache.torque.generator.control.Controller - Start generation of File <https://builds.apache.org/job/torque4-test-project-derby/org.apache.torque$torque-test/ws/target/generated-createdb-sql/save-method-in-peer-schema-create.sql>
INFO  org.apache.torque.generator.control.Controller - Processing source <https://builds.apache.org/job/torque4-test-project-derby/org.apache.torque$torque-test/ws/target/torque/test/schema/test-schema.xml>
INFO  org.apache.torque.generator.control.Controller - Start generation of File <https://builds.apache.org/job/torque4-test-project-derby/org.apache.torque$torque-test/ws/target/generated-createdb-sql/test-schema-create.sql>
INFO  org.apache.torque.generator.control.Controller - Processing source <https://builds.apache.org/job/torque4-test-project-derby/org.apache.torque$torque-test/ws/target/torque/test/schema/types-schema.xml>
INFO  org.apache.torque.generator.control.Controller - Start generation of File <https://builds.apache.org/job/torque4-test-project-derby/org.apache.torque$torque-test/ws/target/generated-createdb-sql/types-schema-create.sql>
[INFO] Generation successful
[INFO] [torque:generate {execution: generate-idtable-sql}]
INFO  org.apache.torque.generator.control.Controller - readConfiguration() : Starting to read
configuration files
INFO  org.apache.torque.generator.control.Controller - readConfiguration() : Configuration
read.
INFO  org.apache.torque.generator.control.Controller - Processing output torque.sql.idtable.idtable
INFO  org.apache.torque.generator.control.Controller - Processing source <https://builds.apache.org/job/torque4-test-project-derby/org.apache.torque$torque-test/ws/target/torque/test/schema/./bookstore-schema.xml>
INFO  org.apache.torque.generator.control.Controller - Start generation of File <https://builds.apache.org/job/torque4-test-project-derby/org.apache.torque$torque-test/ws/target/generated-sql/bookstore-schema-idtable-init.sql>
INFO  org.apache.torque.generator.control.Controller - Processing source <https://builds.apache.org/job/torque4-test-project-derby/org.apache.torque$torque-test/ws/target/torque/test/schema/./databaseMapInit-schema.xml>
INFO  org.apache.torque.generator.control.Controller - Start generation of File <https://builds.apache.org/job/torque4-test-project-derby/org.apache.torque$torque-test/ws/target/generated-sql/databaseMapInit-schema-idtable-init.sql>
INFO  org.apache.torque.generator.control.Controller - Processing source <https://builds.apache.org/job/torque4-test-project-derby/org.apache.torque$torque-test/ws/target/torque/test/schema/./default-value-schema.xml>
INFO  org.apache.torque.generator.control.Controller - Start generation of File <https://builds.apache.org/job/torque4-test-project-derby/org.apache.torque$torque-test/ws/target/generated-sql/default-value-schema-idtable-init.sql>
INFO  org.apache.torque.generator.control.Controller - Processing source <https://builds.apache.org/job/torque4-test-project-derby/org.apache.torque$torque-test/ws/target/torque/test/schema/./ext-schema.xml>
INFO  org.apache.torque.generator.control.Controller - Start generation of File <https://builds.apache.org/job/torque4-test-project-derby/org.apache.torque$torque-test/ws/target/generated-sql/ext-schema-idtable-init.sql>
INFO  org.apache.torque.generator.control.Controller - Processing source <https://builds.apache.org/job/torque4-test-project-derby/org.apache.torque$torque-test/ws/target/torque/test/schema/./extext-schema.xml>
INFO  org.apache.torque.generator.control.Controller - Start generation of File <https://builds.apache.org/job/torque4-test-project-derby/org.apache.torque$torque-test/ws/target/generated-sql/extext-schema-idtable-init.sql>
INFO  org.apache.torque.generator.control.Controller - Processing source <https://builds.apache.org/job/torque4-test-project-derby/org.apache.torque$torque-test/ws/target/torque/test/schema/./foreign-key-schema.xml>
INFO  org.apache.torque.generator.control.Controller - Start generation of File <https://builds.apache.org/job/torque4-test-project-derby/org.apache.torque$torque-test/ws/target/generated-sql/foreign-key-schema-idtable-init.sql>
INFO  org.apache.torque.generator.control.Controller - Processing source <https://builds.apache.org/job/torque4-test-project-derby/org.apache.torque$torque-test/ws/target/torque/test/schema/./included-from-included-schema.xml>
INFO  org.apache.torque.generator.control.Controller - Start generation of File <https://builds.apache.org/job/torque4-test-project-derby/org.apache.torque$torque-test/ws/target/generated-sql/included-from-included-schema-idtable-init.sql>
INFO  org.apache.torque.generator.control.Controller - Processing source <https://builds.apache.org/job/torque4-test-project-derby/org.apache.torque$torque-test/ws/target/torque/test/schema/./included-schema.xml>
INFO  org.apache.torque.generator.control.Controller - Start generation of File <https://builds.apache.org/job/torque4-test-project-derby/org.apache.torque$torque-test/ws/target/generated-sql/included-schema-idtable-init.sql>
INFO  org.apache.torque.generator.control.Controller - Processing source <https://builds.apache.org/job/torque4-test-project-derby/org.apache.torque$torque-test/ws/target/torque/test/schema/./pk-schema.xml>
INFO  org.apache.torque.generator.control.Controller - Start generation of File <https://builds.apache.org/job/torque4-test-project-derby/org.apache.torque$torque-test/ws/target/generated-sql/pk-schema-idtable-init.sql>
INFO  org.apache.torque.generator.control.Controller - Processing source <https://builds.apache.org/job/torque4-test-project-derby/org.apache.torque$torque-test/ws/target/torque/test/schema/./qualified-table-name-schema.xml>
INFO  org.apache.torque.generator.control.Controller - Start generation of File <https://builds.apache.org/job/torque4-test-project-derby/org.apache.torque$torque-test/ws/target/generated-sql/qualified-table-name-schema-idtable-init.sql>
INFO  org.apache.torque.generator.control.Controller - Processing source <https://builds.apache.org/job/torque4-test-project-derby/org.apache.torque$torque-test/ws/target/torque/test/schema/./save-method-in-peer-schema.xml>
INFO  org.apache.torque.generator.control.Controller - Start generation of File <https://builds.apache.org/job/torque4-test-project-derby/org.apache.torque$torque-test/ws/target/generated-sql/save-method-in-peer-schema-idtable-init.sql>
INFO  org.apache.torque.generator.control.Controller - Processing source <https://builds.apache.org/job/torque4-test-project-derby/org.apache.torque$torque-test/ws/target/torque/test/schema/./test-schema.xml>
INFO  org.apache.torque.generator.control.Controller - Start generation of File <https://builds.apache.org/job/torque4-test-project-derby/org.apache.torque$torque-test/ws/target/generated-sql/test-schema-idtable-init.sql>
INFO  org.apache.torque.generator.control.Controller - Processing source <https://builds.apache.org/job/torque4-test-project-derby/org.apache.torque$torque-test/ws/target/torque/test/schema/./types-schema.xml>
INFO  org.apache.torque.generator.control.Controller - Start generation of File <https://builds.apache.org/job/torque4-test-project-derby/org.apache.torque$torque-test/ws/target/generated-sql/types-schema-idtable-init.sql>
[INFO] Generation successful
[INFO] [torque:generate {execution: generate-html-doc}]
INFO  org.apache.torque.generator.control.Controller - readConfiguration() : Starting to read
configuration files
INFO  org.apache.torque.generator.control.Controller - readConfiguration() : Configuration
read.
INFO  org.apache.torque.generator.control.Controller - Processing output torque.doc.html.css
INFO  org.apache.torque.generator.control.Controller - Processing source <https://builds.apache.org/job/torque4-test-project-derby/org.apache.torque$torque-test/ws/target/torque/test/schema/bookstore-schema.xml>
INFO  org.apache.torque.generator.control.Controller - Start generation of File <https://builds.apache.org/job/torque4-test-project-derby/org.apache.torque$torque-test/ws/target/generated-docs/datamodel.css>
INFO  org.apache.torque.generator.control.Controller - Processing source <https://builds.apache.org/job/torque4-test-project-derby/org.apache.torque$torque-test/ws/target/torque/test/schema/databaseMapInit-schema.xml>
INFO  org.apache.torque.generator.control.Controller - Start generation of File <https://builds.apache.org/job/torque4-test-project-derby/org.apache.torque$torque-test/ws/target/generated-docs/datamodel.css>
INFO  org.apache.torque.generator.control.Controller - Processing source <https://builds.apache.org/job/torque4-test-project-derby/org.apache.torque$torque-test/ws/target/torque/test/schema/default-value-schema.xml>
INFO  org.apache.torque.generator.control.Controller - Start generation of File <https://builds.apache.org/job/torque4-test-project-derby/org.apache.torque$torque-test/ws/target/generated-docs/datamodel.css>
INFO  org.apache.torque.generator.control.Controller - Processing source <https://builds.apache.org/job/torque4-test-project-derby/org.apache.torque$torque-test/ws/target/torque/test/schema/foreign-key-schema.xml>
INFO  org.apache.torque.generator.control.Controller - Start generation of File <https://builds.apache.org/job/torque4-test-project-derby/org.apache.torque$torque-test/ws/target/generated-docs/datamodel.css>
INFO  org.apache.torque.generator.control.Controller - Processing source <https://builds.apache.org/job/torque4-test-project-derby/org.apache.torque$torque-test/ws/target/torque/test/schema/index.xml>
INFO  org.apache.torque.generator.control.Controller - Start generation of File <https://builds.apache.org/job/torque4-test-project-derby/org.apache.torque$torque-test/ws/target/generated-docs/datamodel.css>
INFO  org.apache.torque.generator.control.Controller - Processing source <https://builds.apache.org/job/torque4-test-project-derby/org.apache.torque$torque-test/ws/target/torque/test/schema/pk-schema.xml>
INFO  org.apache.torque.generator.control.Controller - Start generation of File <https://builds.apache.org/job/torque4-test-project-derby/org.apache.torque$torque-test/ws/target/generated-docs/datamodel.css>
INFO  org.apache.torque.generator.control.Controller - Processing source <https://builds.apache.org/job/torque4-test-project-derby/org.apache.torque$torque-test/ws/target/torque/test/schema/qualified-table-name-schema.xml>
INFO  org.apache.torque.generator.control.Controller - Start generation of File <https://builds.apache.org/job/torque4-test-project-derby/org.apache.torque$torque-test/ws/target/generated-docs/datamodel.css>
INFO  org.apache.torque.generator.control.Controller - Processing source <https://builds.apache.org/job/torque4-test-project-derby/org.apache.torque$torque-test/ws/target/torque/test/schema/save-method-in-peer-schema.xml>
INFO  org.apache.torque.generator.control.Controller - Start generation of File <https://builds.apache.org/job/torque4-test-project-derby/org.apache.torque$torque-test/ws/target/generated-docs/datamodel.css>
INFO  org.apache.torque.generator.control.Controller - Processing source <https://builds.apache.org/job/torque4-test-project-derby/org.apache.torque$torque-test/ws/target/torque/test/schema/test-schema.xml>
INFO  org.apache.torque.generator.control.Controller - Start generation of File <https://builds.apache.org/job/torque4-test-project-derby/org.apache.torque$torque-test/ws/target/generated-docs/datamodel.css>
INFO  org.apache.torque.generator.control.Controller - Processing source <https://builds.apache.org/job/torque4-test-project-derby/org.apache.torque$torque-test/ws/target/torque/test/schema/types-schema.xml>
INFO  org.apache.torque.generator.control.Controller - Start generation of File <https://builds.apache.org/job/torque4-test-project-derby/org.apache.torque$torque-test/ws/target/generated-docs/datamodel.css>
INFO  org.apache.torque.generator.control.Controller - Processing output torque.doc.html.html
INFO  org.apache.torque.generator.control.Controller - Processing source <https://builds.apache.org/job/torque4-test-project-derby/org.apache.torque$torque-test/ws/target/torque/test/schema/bookstore-schema.xml>
INFO  org.apache.torque.generator.control.Controller - Start generation of File <https://builds.apache.org/job/torque4-test-project-derby/org.apache.torque$torque-test/ws/target/generated-docs/bookstore-schema.html>
INFO  org.apache.torque.generator.control.Controller - Processing source <https://builds.apache.org/job/torque4-test-project-derby/org.apache.torque$torque-test/ws/target/torque/test/schema/databaseMapInit-schema.xml>
INFO  org.apache.torque.generator.control.Controller - Start generation of File <https://builds.apache.org/job/torque4-test-project-derby/org.apache.torque$torque-test/ws/target/generated-docs/databaseMapInit-schema.html>
INFO  org.apache.torque.generator.control.Controller - Processing source <https://builds.apache.org/job/torque4-test-project-derby/org.apache.torque$torque-test/ws/target/torque/test/schema/default-value-schema.xml>
INFO  org.apache.torque.generator.control.Controller - Start generation of File <https://builds.apache.org/job/torque4-test-project-derby/org.apache.torque$torque-test/ws/target/generated-docs/default-value-schema.html>
INFO  org.apache.torque.generator.control.Controller - Processing source <https://builds.apache.org/job/torque4-test-project-derby/org.apache.torque$torque-test/ws/target/torque/test/schema/foreign-key-schema.xml>
INFO  org.apache.torque.generator.control.Controller - Start generation of File <https://builds.apache.org/job/torque4-test-project-derby/org.apache.torque$torque-test/ws/target/generated-docs/foreign-key-schema.html>
INFO  org.apache.torque.generator.control.Controller - Processing source <https://builds.apache.org/job/torque4-test-project-derby/org.apache.torque$torque-test/ws/target/torque/test/schema/index.xml>
INFO  org.apache.torque.generator.control.Controller - Start generation of File <https://builds.apache.org/job/torque4-test-project-derby/org.apache.torque$torque-test/ws/target/generated-docs/index.html>
INFO  org.apache.torque.generator.control.Controller - Processing source <https://builds.apache.org/job/torque4-test-project-derby/org.apache.torque$torque-test/ws/target/torque/test/schema/pk-schema.xml>
INFO  org.apache.torque.generator.control.Controller - Start generation of File <https://builds.apache.org/job/torque4-test-project-derby/org.apache.torque$torque-test/ws/target/generated-docs/pk-schema.html>
INFO  org.apache.torque.generator.control.Controller - Processing source <https://builds.apache.org/job/torque4-test-project-derby/org.apache.torque$torque-test/ws/target/torque/test/schema/qualified-table-name-schema.xml>
INFO  org.apache.torque.generator.control.Controller - Start generation of File <https://builds.apache.org/job/torque4-test-project-derby/org.apache.torque$torque-test/ws/target/generated-docs/qualified-table-name-schema.html>
INFO  org.apache.torque.generator.control.Controller - Processing source <https://builds.apache.org/job/torque4-test-project-derby/org.apache.torque$torque-test/ws/target/torque/test/schema/save-method-in-peer-schema.xml>
INFO  org.apache.torque.generator.control.Controller - Start generation of File <https://builds.apache.org/job/torque4-test-project-derby/org.apache.torque$torque-test/ws/target/generated-docs/save-method-in-peer-schema.html>
INFO  org.apache.torque.generator.control.Controller - Processing source <https://builds.apache.org/job/torque4-test-project-derby/org.apache.torque$torque-test/ws/target/torque/test/schema/test-schema.xml>
INFO  org.apache.torque.generator.control.Controller - Start generation of File <https://builds.apache.org/job/torque4-test-project-derby/org.apache.torque$torque-test/ws/target/generated-docs/test-schema.html>
INFO  org.apache.torque.generator.control.Controller - Processing source <https://builds.apache.org/job/torque4-test-project-derby/org.apache.torque$torque-test/ws/target/torque/test/schema/types-schema.xml>
INFO  org.apache.torque.generator.control.Controller - Start generation of File <https://builds.apache.org/job/torque4-test-project-derby/org.apache.torque$torque-test/ws/target/generated-docs/types-schema.html>
[INFO] Generation successful
[WARNING] The parameter expression: 'project.build.resources' used in mojo: 'process' has
been deprecated. Use 'project.resources' instead.
[INFO] [remote-resources:process {execution: default}]
[debug] execute contextualize
[INFO] [resources:resources {execution: default-resources}]
[INFO] Using 'ISO-8859-1' encoding to copy filtered resources.
[INFO] skip non existing resourceDirectory <https://builds.apache.org/job/torque4-test-project-derby/org.apache.torque$torque-test/ws/src/main/resources>
[INFO] Copying 3 resources
[INFO] [compiler:compile {execution: default-compile}]
[INFO] Compiling 670 source files to <https://builds.apache.org/job/torque4-test-project-derby/org.apache.torque$torque-test/ws/target/classes>
[INFO] [sql:execute {execution: execute-ddl}]
[INFO] Executing file: <https://builds.apache.org/job/torque4-test-project-derby/org.apache.torque$torque-test/ws/target/generated-sql/bookstore-schema.sql>
[INFO] Executing file: <https://builds.apache.org/job/torque4-test-project-derby/org.apache.torque$torque-test/ws/target/generated-sql/databaseMapInit-schema.sql>
[INFO] Executing file: <https://builds.apache.org/job/torque4-test-project-derby/org.apache.torque$torque-test/ws/target/generated-sql/default-value-schema.sql>
[INFO] Executing file: <https://builds.apache.org/job/torque4-test-project-derby/org.apache.torque$torque-test/ws/target/generated-sql/foreign-key-schema.sql>
[INFO] Executing file: <https://builds.apache.org/job/torque4-test-project-derby/org.apache.torque$torque-test/ws/target/generated-sql/id-table-schema.sql>
[INFO] Executing file: <https://builds.apache.org/job/torque4-test-project-derby/org.apache.torque$torque-test/ws/target/generated-sql/index.sql>
[INFO] Executing file: <https://builds.apache.org/job/torque4-test-project-derby/org.apache.torque$torque-test/ws/target/generated-sql/pk-schema.sql>
[INFO] Executing file: <https://builds.apache.org/job/torque4-test-project-derby/org.apache.torque$torque-test/ws/target/generated-sql/qualified-table-name-schema.sql>
[INFO] Executing file: <https://builds.apache.org/job/torque4-test-project-derby/org.apache.torque$torque-test/ws/target/generated-sql/save-method-in-peer-schema.sql>
[INFO] Executing file: <https://builds.apache.org/job/torque4-test-project-derby/org.apache.torque$torque-test/ws/target/generated-sql/test-schema.sql>
[INFO] Executing file: <https://builds.apache.org/job/torque4-test-project-derby/org.apache.torque$torque-test/ws/target/generated-sql/types-schema.sql>
[INFO] 120 of 120 SQL statements executed successfully
[INFO] [sql:execute {execution: execute-idtable-sql}]
[INFO] Executing file: <https://builds.apache.org/job/torque4-test-project-derby/org.apache.torque$torque-test/ws/target/generated-sql/bookstore-schema-idtable-init.sql>
[INFO] Executing file: <https://builds.apache.org/job/torque4-test-project-derby/org.apache.torque$torque-test/ws/target/generated-sql/databaseMapInit-schema-idtable-init.sql>
[INFO] Executing file: <https://builds.apache.org/job/torque4-test-project-derby/org.apache.torque$torque-test/ws/target/generated-sql/default-value-schema-idtable-init.sql>
[INFO] Executing file: <https://builds.apache.org/job/torque4-test-project-derby/org.apache.torque$torque-test/ws/target/generated-sql/ext-schema-idtable-init.sql>
[INFO] Executing file: <https://builds.apache.org/job/torque4-test-project-derby/org.apache.torque$torque-test/ws/target/generated-sql/extext-schema-idtable-init.sql>
[INFO] Executing file: <https://builds.apache.org/job/torque4-test-project-derby/org.apache.torque$torque-test/ws/target/generated-sql/foreign-key-schema-idtable-init.sql>
[INFO] Executing file: <https://builds.apache.org/job/torque4-test-project-derby/org.apache.torque$torque-test/ws/target/generated-sql/pk-schema-idtable-init.sql>
[INFO] Executing file: <https://builds.apache.org/job/torque4-test-project-derby/org.apache.torque$torque-test/ws/target/generated-sql/qualified-table-name-schema-idtable-init.sql>
[INFO] Executing file: <https://builds.apache.org/job/torque4-test-project-derby/org.apache.torque$torque-test/ws/target/generated-sql/save-method-in-peer-schema-idtable-init.sql>
[INFO] Executing file: <https://builds.apache.org/job/torque4-test-project-derby/org.apache.torque$torque-test/ws/target/generated-sql/test-schema-idtable-init.sql>
[INFO] Executing file: <https://builds.apache.org/job/torque4-test-project-derby/org.apache.torque$torque-test/ws/target/generated-sql/types-schema-idtable-init.sql>
[INFO] 75 of 75 SQL statements executed successfully
[INFO] [sql:execute {execution: shutdown-db-after-ddl}]
[debug] execute contextualize
[INFO] [resources:testResources {execution: default-testResources}]
[INFO] Using 'ISO-8859-1' encoding to copy filtered resources.
[INFO] Copying 6 resources
[INFO] Copying 3 resources
[INFO] [compiler:testCompile {execution: default-testCompile}]
[INFO] Compiling 52 source files to <https://builds.apache.org/job/torque4-test-project-derby/org.apache.torque$torque-test/ws/target/test-classes>
[INFO] -------------------------------------------------------------
[ERROR] COMPILATION ERROR : 
[INFO] -------------------------------------------------------------
[ERROR] <https://builds.apache.org/job/torque4-test-project-derby/org.apache.torque$torque-test/ws/src/test/java/org/apache/torque/DataTest.java>:[1388,11]
org.apache.torque.DataTest.DoNothingMapper is not abstract and does not override abstract
method processRow(java.sql.ResultSet,int,org.apache.torque.criteria.CriteriaInterface<?>)
in org.apache.torque.om.mapper.RecordMapper

[INFO] 1error
[INFO] -------------------------------------------------------------
[JENKINS] Archiving <https://builds.apache.org/job/torque4-test-project-derby/org.apache.torque$torque-test/ws/pom.xml>
to /home/hudson/hudson/jobs/torque4-test-project-derby/modules/org.apache.torque$torque-test/builds/2013-05-20_01-36-41/archive/org.apache.torque/torque-test/4.1-SNAPSHOT/torque-test-4.1-SNAPSHOT.pom
[INFO] ------------------------------------------------------------------------
[ERROR] BUILD FAILURE
[INFO] ------------------------------------------------------------------------
[INFO] Compilation failure
<https://builds.apache.org/job/torque4-test-project-derby/org.apache.torque$torque-test/ws/src/test/java/org/apache/torque/DataTest.java>:[1388,11]
org.apache.torque.DataTest.DoNothingMapper is not abstract and does not override abstract
method processRow(java.sql.ResultSet,int,org.apache.torque.criteria.CriteriaInterface<?>)
in org.apache.torque.om.mapper.RecordMapper


[INFO] ------------------------------------------------------------------------
[INFO] For more information, run Maven with the -e switch
[INFO] ------------------------------------------------------------------------
[INFO] Total time: 1 minute 31 seconds
[INFO] Finished at: Mon May 20 01:38:37 UTC 2013
[INFO] Final Memory: 52M/320M
[INFO] ------------------------------------------------------------------------
Waiting for Jenkins to finish collecting data

---------------------------------------------------------------------
To unsubscribe, e-mail: torque-dev-unsubscribe@db.apache.org
For additional commands, e-mail: torque-dev-help@db.apache.org


Mime
View raw message