db-torque-dev mailing list archives

Site index · List index
Message view « Date » · « Thread »
Top « Date » · « Thread »
From Apache Jenkins Server <jenk...@builds.apache.org>
Subject Build failed in Jenkins: Torque4-trunk #405
Date Thu, 04 Apr 2013 00:53:19 GMT
See <https://builds.apache.org/job/Torque4-trunk/405/>

------------------------------------------
[...truncated 2102 lines...]
[DEBUG] Using the following container type : yaafi
[DEBUG] YAAFI Service Framework is starting up
[DEBUG] Setting applicationRootDir to <https://builds.apache.org/job/Torque4-trunk/ws/torque4-trunk/torque-runtime>
[DEBUG] Setting tempRootDir to /tmp
[DEBUG] Looking for src/test/resources/TestRoleConfig.xml in the root directory
[DEBUG] Found src/test/resources/TestRoleConfig.xml as <https://builds.apache.org/job/Torque4-trunk/ws/torque4-trunk/torque-runtime/src/test/resources/TestRoleConfig.xml>
[DEBUG] Looking for src/test/resources/TestComponentConfig.xml in the root directory
[DEBUG] Found src/test/resources/TestComponentConfig.xml as <https://builds.apache.org/job/Torque4-trunk/ws/torque4-trunk/torque-runtime/src/test/resources/TestComponentConfig.xml>
[DEBUG] Looking for /componentConfiguration.properties in the root directory
[DEBUG] Looking for /componentConfiguration.properties as absolute file location
[DEBUG] Looking for /componentConfiguration.properties using the class loader
[WARNING] Unable to find any resource with the name '/componentConfiguration.properties'
[DEBUG] Unable to load the following optional file :/componentConfiguration.properties
[DEBUG] Using the following componentConfigurationProperties: {java.runtime.name=Java(TM)
2 Runtime Environment, Standard Edition, urn:avalon:temp=/tmp, sun.boot.library.path=/home/jenkins/tools/java/jdk1.5.0_22-32/jre/lib/i386,
java.vm.version=1.5.0_22-b03, urn:avalon:home=<https://builds.apache.org/job/Torque4-trunk/ws/torque4-trunk/torque-runtime,>
java.vm.vendor=Sun Microsystems Inc., java.vendor.url=http://java.sun.com/, path.separator=:,
java.vm.name=Java HotSpot(TM) Server VM, file.encoding.pkg=sun.io, user.country=US, sun.java.launcher=SUN_STANDARD,
sun.os.patch.level=unknown, urn:avalon:name=fulcrum-yaafi, java.vm.specification.name=Java
Virtual Machine Specification, user.dir=<https://builds.apache.org/job/Torque4-trunk/ws/torque4-trunk/torque-runtime,>
urn:avalon:partition=root, java.runtime.version=1.5.0_22-b03, java.awt.graphicsenv=sun.awt.X11GraphicsEnvironment,
basedir=<https://builds.apache.org/job/Torque4-trunk/ws/torque4-trunk/torque-runtime,>
java.endorsed.dirs=/home/jenkins/tools/java/jdk1.5.0_22-32/jre/lib/endorsed, os.arch=i386,
java.io.tmpdir=/tmp, line.separator=
, java.vm.specification.vendor=Sun Microsystems Inc., os.name=Linux, sun.jnu.encoding=ANSI_X3.4-1968,
java.library.path=/home/jenkins/tools/java/jdk1.5.0_22-32/jre/lib/i386/server:/home/jenkins/tools/java/jdk1.5.0_22-32/jre/lib/i386:/home/jenkins/tools/java/jdk1.5.0_22-32/jre/../lib/i386:/usr/lib/jvm/java-6-openjdk-amd64/jre/lib/amd64/server:/usr/lib/jvm/java-6-openjdk-amd64/jre/lib/amd64:/usr/lib/jvm/java-6-openjdk-amd64/jre/../lib/amd64,
java.specification.name=Java Platform API Specification, java.class.version=49.0, sun.management.compiler=HotSpot
Server Compiler, os.version=3.2.0-38-generic, user.home=/home/jenkins, user.timezone=, java.awt.printerjob=sun.print.PSPrinterJob,
file.encoding=ANSI_X3.4-1968, java.specification.version=1.5, user.name=jenkins, java.class.path=/tmp/surefirebooter6954534482569632541.jar,
java.vm.specification.version=1.0, sun.arch.data.model=32, java.home=/home/jenkins/tools/java/jdk1.5.0_22-32/jre,
java.specification.vendor=Sun Microsystems Inc., user.language=en, java.vm.info=mixed mode,
java.version=1.5.0_22, java.ext.dirs=/home/jenkins/tools/java/jdk1.5.0_22-32/jre/lib/ext,
sun.boot.class.path=/home/jenkins/tools/java/jdk1.5.0_22-32/jre/lib/rt.jar:/home/jenkins/tools/java/jdk1.5.0_22-32/jre/lib/i18n.jar:/home/jenkins/tools/java/jdk1.5.0_22-32/jre/lib/sunrsasign.jar:/home/jenkins/tools/java/jdk1.5.0_22-32/jre/lib/jsse.jar:/home/jenkins/tools/java/jdk1.5.0_22-32/jre/lib/jce.jar:/home/jenkins/tools/java/jdk1.5.0_22-32/jre/lib/charsets.jar:/home/jenkins/tools/java/jdk1.5.0_22-32/jre/classes,
java.vendor=Sun Microsystems Inc., localRepository=/home/jenkins/jenkins-slave/maven-repositories/0,
file.separator=/, derby.stream.error.file=target/derby.log, java.vendor.url.bug=http://java.sun.com/cgi-bin/bugreport.cgi,
sun.cpu.endian=little, sun.io.unicode.encoding=UnicodeLittle, sun.cpu.isalist=}
[DEBUG] Looking for /parameters.properties in the root directory
[DEBUG] Looking for /parameters.properties as absolute file location
[DEBUG] Looking for /parameters.properties using the class loader
[WARNING] Unable to find any resource with the name '/parameters.properties'
[DEBUG] Configuring the service component TorqueComponent
[DEBUG] Incarnating the service TorqueComponent
[DEBUG] Instantiating the implementation class for TorqueComponent
[DEBUG] Incarnating the service TorqueComponent
[DEBUG] LogEnabled.enableLogging() for TorqueComponent
[DEBUG] Contextualizable.contextualize() for TorqueComponent
[DEBUG] Configurable.configure() for TorqueComponent
[DEBUG] configure(TorqueComponent::<no value>:@null:20:22)
[DEBUG] Config File changes to src/test/resources/Torque.properties
[DEBUG] Config File is <https://builds.apache.org/job/Torque4-trunk/ws/torque4-trunk/torque-runtime/src/test/resources/Torque.properties>
[DEBUG] Initializable.initialize() for TorqueComponent
[DEBUG] initialize()
[DEBUG] YAAFI Avalon Service Container is up and running
[INFO] YaffiContainer ready.
[DEBUG] Located the service 'org.apache.torque.avalon.Torque' in the local container
[DEBUG] Disposing of container...
[DEBUG] Disposing all services
[DEBUG] Decommision the service TorqueComponent
[DEBUG] Decommisioning the service TorqueComponent
[DEBUG] Disposable.dispose() for TorqueComponent
[DEBUG] dispose()
[DEBUG] Disposing the service TorqueComponent
[DEBUG] All services are disposed
[INFO] YaffiContainer has been disposed.
[DEBUG] Starting container...
[DEBUG] Loading the service container class org.apache.fulcrum.yaafi.framework.container.ServiceContainerImpl
[DEBUG] Instantiating the service container class org.apache.fulcrum.yaafi.framework.container.ServiceContainerImpl
[DEBUG] Using the following configuration : <?xml version="1.0" encoding="UTF-8"?><fulcrum-yaafi><containerFlavour>yaafi</containerFlavour><containerClazzName>org.apache.fulcrum.yaafi.framework.container.ServiceContainerImpl</containerClazzName><componentRoles><location>src/test/resources/TestRoleConfig.xml</location><isEncrypted>false</isEncrypted></componentRoles><componentConfiguration><location>src/test/resources/TestComponentConfig.xml</location><isEncrypted>false</isEncrypted></componentConfiguration><parameters><location/><isEncrypted>false</isEncrypted></parameters></fulcrum-yaafi>
[DEBUG] Using the following container type : yaafi
[DEBUG] YAAFI Service Framework is starting up
[DEBUG] Setting applicationRootDir to <https://builds.apache.org/job/Torque4-trunk/ws/torque4-trunk/torque-runtime>
[DEBUG] Setting tempRootDir to /tmp
[DEBUG] Looking for src/test/resources/TestRoleConfig.xml in the root directory
[DEBUG] Found src/test/resources/TestRoleConfig.xml as <https://builds.apache.org/job/Torque4-trunk/ws/torque4-trunk/torque-runtime/src/test/resources/TestRoleConfig.xml>
[DEBUG] Looking for src/test/resources/TestComponentConfig.xml in the root directory
[DEBUG] Found src/test/resources/TestComponentConfig.xml as <https://builds.apache.org/job/Torque4-trunk/ws/torque4-trunk/torque-runtime/src/test/resources/TestComponentConfig.xml>
[DEBUG] Looking for /componentConfiguration.properties in the root directory
[DEBUG] Looking for /componentConfiguration.properties as absolute file location
[DEBUG] Looking for /componentConfiguration.properties using the class loader
[WARNING] Unable to find any resource with the name '/componentConfiguration.properties'
[DEBUG] Unable to load the following optional file :/componentConfiguration.properties
[DEBUG] Using the following componentConfigurationProperties: {java.runtime.name=Java(TM)
2 Runtime Environment, Standard Edition, urn:avalon:temp=/tmp, sun.boot.library.path=/home/jenkins/tools/java/jdk1.5.0_22-32/jre/lib/i386,
java.vm.version=1.5.0_22-b03, urn:avalon:home=<https://builds.apache.org/job/Torque4-trunk/ws/torque4-trunk/torque-runtime,>
java.vm.vendor=Sun Microsystems Inc., java.vendor.url=http://java.sun.com/, path.separator=:,
java.vm.name=Java HotSpot(TM) Server VM, file.encoding.pkg=sun.io, user.country=US, sun.java.launcher=SUN_STANDARD,
sun.os.patch.level=unknown, urn:avalon:name=fulcrum-yaafi, java.vm.specification.name=Java
Virtual Machine Specification, user.dir=<https://builds.apache.org/job/Torque4-trunk/ws/torque4-trunk/torque-runtime,>
urn:avalon:partition=root, java.runtime.version=1.5.0_22-b03, java.awt.graphicsenv=sun.awt.X11GraphicsEnvironment,
basedir=<https://builds.apache.org/job/Torque4-trunk/ws/torque4-trunk/torque-runtime,>
java.endorsed.dirs=/home/jenkins/tools/java/jdk1.5.0_22-32/jre/lib/endorsed, os.arch=i386,
java.io.tmpdir=/tmp, line.separator=
, java.vm.specification.vendor=Sun Microsystems Inc., os.name=Linux, sun.jnu.encoding=ANSI_X3.4-1968,
java.library.path=/home/jenkins/tools/java/jdk1.5.0_22-32/jre/lib/i386/server:/home/jenkins/tools/java/jdk1.5.0_22-32/jre/lib/i386:/home/jenkins/tools/java/jdk1.5.0_22-32/jre/../lib/i386:/usr/lib/jvm/java-6-openjdk-amd64/jre/lib/amd64/server:/usr/lib/jvm/java-6-openjdk-amd64/jre/lib/amd64:/usr/lib/jvm/java-6-openjdk-amd64/jre/../lib/amd64,
java.specification.name=Java Platform API Specification, java.class.version=49.0, sun.management.compiler=HotSpot
Server Compiler, os.version=3.2.0-38-generic, user.home=/home/jenkins, user.timezone=, java.awt.printerjob=sun.print.PSPrinterJob,
file.encoding=ANSI_X3.4-1968, java.specification.version=1.5, user.name=jenkins, java.class.path=/tmp/surefirebooter6954534482569632541.jar,
java.vm.specification.version=1.0, sun.arch.data.model=32, java.home=/home/jenkins/tools/java/jdk1.5.0_22-32/jre,
java.specification.vendor=Sun Microsystems Inc., user.language=en, java.vm.info=mixed mode,
java.version=1.5.0_22, java.ext.dirs=/home/jenkins/tools/java/jdk1.5.0_22-32/jre/lib/ext,
sun.boot.class.path=/home/jenkins/tools/java/jdk1.5.0_22-32/jre/lib/rt.jar:/home/jenkins/tools/java/jdk1.5.0_22-32/jre/lib/i18n.jar:/home/jenkins/tools/java/jdk1.5.0_22-32/jre/lib/sunrsasign.jar:/home/jenkins/tools/java/jdk1.5.0_22-32/jre/lib/jsse.jar:/home/jenkins/tools/java/jdk1.5.0_22-32/jre/lib/jce.jar:/home/jenkins/tools/java/jdk1.5.0_22-32/jre/lib/charsets.jar:/home/jenkins/tools/java/jdk1.5.0_22-32/jre/classes,
java.vendor=Sun Microsystems Inc., localRepository=/home/jenkins/jenkins-slave/maven-repositories/0,
file.separator=/, derby.stream.error.file=target/derby.log, java.vendor.url.bug=http://java.sun.com/cgi-bin/bugreport.cgi,
sun.cpu.endian=little, sun.io.unicode.encoding=UnicodeLittle, sun.cpu.isalist=}
[DEBUG] Looking for /parameters.properties in the root directory
[DEBUG] Looking for /parameters.properties as absolute file location
[DEBUG] Looking for /parameters.properties using the class loader
[WARNING] Unable to find any resource with the name '/parameters.properties'
[DEBUG] Configuring the service component TorqueComponent
[DEBUG] Incarnating the service TorqueComponent
[DEBUG] Instantiating the implementation class for TorqueComponent
[DEBUG] Incarnating the service TorqueComponent
[DEBUG] LogEnabled.enableLogging() for TorqueComponent
[DEBUG] Contextualizable.contextualize() for TorqueComponent
[DEBUG] Configurable.configure() for TorqueComponent
[DEBUG] configure(TorqueComponent::<no value>:@null:20:22)
[DEBUG] Config File changes to src/test/resources/Torque.properties
[DEBUG] Config File is <https://builds.apache.org/job/Torque4-trunk/ws/torque4-trunk/torque-runtime/src/test/resources/Torque.properties>
[DEBUG] Initializable.initialize() for TorqueComponent
[DEBUG] initialize()
[DEBUG] YAAFI Avalon Service Container is up and running
[INFO] YaffiContainer ready.
[DEBUG] Located the service 'org.apache.torque.avalon.Torque' in the local container
[DEBUG] Disposing of container...
[DEBUG] Disposing all services
[DEBUG] Decommision the service TorqueComponent
[DEBUG] Decommisioning the service TorqueComponent
[DEBUG] Disposable.dispose() for TorqueComponent
[DEBUG] dispose()
[DEBUG] Disposing the service TorqueComponent
[DEBUG] All services are disposed
[INFO] YaffiContainer has been disposed.
Tests run: 2, Failures: 0, Errors: 0, Skipped: 0, Time elapsed: 0.284 sec
Cobertura: Loaded information on 116 classes.
Cobertura: Saved information on 116 classes.
Running org.apache.torque.om.NumberKeyTest
Tests run: 23, Failures: 0, Errors: 0, Skipped: 0, Time elapsed: 0.051 sec
Cobertura: Loaded information on 116 classes.
Cobertura: Saved information on 116 classes.
Running org.apache.torque.om.mapper.IntegerMapperTest
Tests run: 3, Failures: 0, Errors: 0, Skipped: 0, Time elapsed: 0.468 sec
Cobertura: Loaded information on 116 classes.
Cobertura: Saved information on 116 classes.
Running org.apache.torque.criteria.JoinTest
Tests run: 2, Failures: 0, Errors: 0, Skipped: 0, Time elapsed: 0.202 sec
Cobertura: Loaded information on 116 classes.
Cobertura: Saved information on 116 classes.
Running org.apache.torque.om.mapper.LongMapperTest
Tests run: 3, Failures: 0, Errors: 0, Skipped: 0, Time elapsed: 0.462 sec
Cobertura: Loaded information on 116 classes.
Cobertura: Saved information on 116 classes.
Running org.apache.torque.om.mapper.DateMapperTest
Tests run: 3, Failures: 0, Errors: 0, Skipped: 0, Time elapsed: 0.46 sec
Cobertura: Loaded information on 116 classes.
Cobertura: Saved information on 116 classes.
Running org.apache.torque.criteria.CriteriaTest
Tests run: 33, Failures: 0, Errors: 0, Skipped: 0, Time elapsed: 0.429 sec
Cobertura: Loaded information on 116 classes.
Cobertura: Saved information on 116 classes.
Running org.apache.torque.util.UniqueListTest
Tests run: 2, Failures: 0, Errors: 0, Skipped: 0, Time elapsed: 0.032 sec
Cobertura: Loaded information on 116 classes.
Cobertura: Saved information on 116 classes.
Running org.apache.torque.TorqueRuntimeExceptionTest
Tests run: 1, Failures: 0, Errors: 0, Skipped: 0, Time elapsed: 0.173 sec

Results :

Tests run: 425, Failures: 0, Errors: 0, Skipped: 0

Cobertura: Loaded information on 116 classes.
Cobertura: Saved information on 116 classes.
[JENKINS] Recording test results
[INFO] [cobertura:cobertura {execution: default-cli}]
[INFO] Cobertura 1.9.2 - GNU GPL License (NO WARRANTY) - See COPYRIGHT file
Cobertura: Loaded information on 116 classes.
Report time: 2677ms

[INFO] Cobertura Report generation was successful.
[INFO] Cobertura 1.9.2 - GNU GPL License (NO WARRANTY) - See COPYRIGHT file
Cobertura: Loaded information on 116 classes.
Report time: 1964ms

[INFO] Cobertura Report generation was successful.
[INFO] [findbugs:findbugs {execution: default-cli}]
[INFO] Fork Value is true
     [java] Warnings generated: 3
[INFO] Done FindBugs Analysis....
[FINDBUGS] Finding all files that match the pattern findbugsXml.xml
[FINDBUGS] Parsing 1 files in <https://builds.apache.org/job/Torque4-trunk/ws/torque4-trunk/torque-runtime/target>
[FINDBUGS] Successfully parsed file <https://builds.apache.org/job/Torque4-trunk/ws/torque4-trunk/torque-runtime/target/findbugsXml.xml>
of module Torque Runtime with 3 warnings.
[FINDBUGS] Computing warning deltas based on reference build #402
[INFO] [checkstyle:checkstyle {execution: default-cli}]
[INFO] 
[WARNING] Unable to locate Source XRef to link to - DISABLED
[CHECKSTYLE] Finding all files that match the pattern checkstyle-result.xml
[CHECKSTYLE] Parsing 1 files in <https://builds.apache.org/job/Torque4-trunk/ws/torque4-trunk/torque-runtime/target>
[CHECKSTYLE] Successfully parsed file <https://builds.apache.org/job/Torque4-trunk/ws/torque4-trunk/torque-runtime/target/checkstyle-result.xml>
of module Torque Runtime with 27 warnings.
[CHECKSTYLE] Computing warning deltas based on reference build #402
[INFO] [pmd:pmd {execution: default-cli}]
[WARNING] Unable to locate Source XRef to link to - DISABLED
[PMD] Finding all files that match the pattern pmd.xml
[PMD] Parsing 1 files in <https://builds.apache.org/job/Torque4-trunk/ws/torque4-trunk/torque-runtime/target>
[PMD] Successfully parsed file <https://builds.apache.org/job/Torque4-trunk/ws/torque4-trunk/torque-runtime/target/pmd.xml>
of module Torque Runtime with 9 warnings.
[PMD] Computing warning deltas based on reference build #402
[INFO] [pmd:cpd {execution: default-cli}]
[WARNING] Unable to locate Source XRef to link to - DISABLED
[DRY] Finding all files that match the pattern cpd.xml
[DRY] Parsing 1 files in <https://builds.apache.org/job/Torque4-trunk/ws/torque4-trunk/torque-runtime/target>
[DRY] Successfully parsed file <https://builds.apache.org/job/Torque4-trunk/ws/torque4-trunk/torque-runtime/target/cpd.xml>
of module Torque Runtime with 24 warnings.
[DRY] Computing warning deltas based on reference build #402
[INFO] ------------------------------------------------------------------------
[INFO] Building Torque Generator
[INFO]    task-segment: [clean, install, cobertura:cobertura, findbugs:findbugs, checkstyle:checkstyle,
pmd:pmd, pmd:cpd]
[INFO] ------------------------------------------------------------------------
[INFO] [clean:clean {execution: default-clean}]
[WARNING] The parameter expression: 'project.build.resources' used in mojo: 'process' has
been deprecated. Use 'project.resources' instead.
[INFO] [remote-resources:process {execution: default}]
[debug] execute contextualize
[INFO] [resources:resources {execution: default-resources}]
[INFO] Using 'ISO-8859-1' encoding to copy filtered resources.
[INFO] Copying 3 resources
[INFO] Copying 3 resources
[INFO] [compiler:compile {execution: default-compile}]
[INFO] Compiling 198 source files to <https://builds.apache.org/job/Torque4-trunk/ws/torque4-trunk/torque-generator/target/classes>
[INFO] -------------------------------------------------------------
[ERROR] COMPILATION ERROR : 
[INFO] -------------------------------------------------------------
[ERROR] <https://builds.apache.org/job/Torque4-trunk/ws/torque4-trunk/torque-generator/src/main/java/org/apache/torque/generator/template/groovy/GroovyOutlet.java>:[22,19]
package groovy.lang does not exist

[ERROR] <https://builds.apache.org/job/Torque4-trunk/ws/torque4-trunk/torque-generator/src/main/java/org/apache/torque/generator/template/groovy/GroovyOutlet.java>:[23,19]
package groovy.text does not exist

[ERROR] <https://builds.apache.org/job/Torque4-trunk/ws/torque4-trunk/torque-generator/src/main/java/org/apache/torque/generator/template/groovy/GroovyOutlet.java>:[24,19]
package groovy.text does not exist

[ERROR] <https://builds.apache.org/job/Torque4-trunk/ws/torque4-trunk/torque-generator/src/main/java/org/apache/torque/generator/template/groovy/GroovyOutlet.java>:[149,12]
cannot find symbol
symbol  : class GStringTemplateEngine
location: class org.apache.torque.generator.template.groovy.GroovyOutlet

[ERROR] <https://builds.apache.org/job/Torque4-trunk/ws/torque4-trunk/torque-generator/src/main/java/org/apache/torque/generator/template/groovy/GroovyOutlet.java>:[149,55]
cannot find symbol
symbol  : class GStringTemplateEngine
location: class org.apache.torque.generator.template.groovy.GroovyOutlet

[ERROR] <https://builds.apache.org/job/Torque4-trunk/ws/torque4-trunk/torque-generator/src/main/java/org/apache/torque/generator/template/groovy/GroovyOutlet.java>:[150,12]
cannot find symbol
symbol  : class Template
location: class org.apache.torque.generator.template.groovy.GroovyOutlet

[ERROR] <https://builds.apache.org/job/Torque4-trunk/ws/torque4-trunk/torque-generator/src/main/java/org/apache/torque/generator/template/groovy/GroovyOutlet.java>:[152,12]
cannot find symbol
symbol  : class Writable
location: class org.apache.torque.generator.template.groovy.GroovyOutlet

[INFO] 7 errors 
[INFO] -------------------------------------------------------------
[JENKINS] Archiving <https://builds.apache.org/job/Torque4-trunk/ws/torque4-trunk/torque-generator/pom.xml>
to /home/hudson/hudson/jobs/Torque4-trunk/modules/org.apache.torque$torque-generator/builds/2013-04-04_00-47-43/archive/org.apache.torque/torque-generator/4.1-SNAPSHOT/torque-generator-4.1-SNAPSHOT.pom
[INFO] ------------------------------------------------------------------------
[ERROR] BUILD FAILURE
[INFO] ------------------------------------------------------------------------
[INFO] Compilation failure

<https://builds.apache.org/job/Torque4-trunk/ws/torque4-trunk/torque-generator/src/main/java/org/apache/torque/generator/template/groovy/GroovyOutlet.java>:[22,19]
package groovy.lang does not exist

<https://builds.apache.org/job/Torque4-trunk/ws/torque4-trunk/torque-generator/src/main/java/org/apache/torque/generator/template/groovy/GroovyOutlet.java>:[23,19]
package groovy.text does not exist

<https://builds.apache.org/job/Torque4-trunk/ws/torque4-trunk/torque-generator/src/main/java/org/apache/torque/generator/template/groovy/GroovyOutlet.java>:[24,19]
package groovy.text does not exist

<https://builds.apache.org/job/Torque4-trunk/ws/torque4-trunk/torque-generator/src/main/java/org/apache/torque/generator/template/groovy/GroovyOutlet.java>:[149,12]
cannot find symbol
symbol  : class GStringTemplateEngine
location: class org.apache.torque.generator.template.groovy.GroovyOutlet

<https://builds.apache.org/job/Torque4-trunk/ws/torque4-trunk/torque-generator/src/main/java/org/apache/torque/generator/template/groovy/GroovyOutlet.java>:[149,55]
cannot find symbol
symbol  : class GStringTemplateEngine
location: class org.apache.torque.generator.template.groovy.GroovyOutlet

<https://builds.apache.org/job/Torque4-trunk/ws/torque4-trunk/torque-generator/src/main/java/org/apache/torque/generator/template/groovy/GroovyOutlet.java>:[150,12]
cannot find symbol
symbol  : class Template
location: class org.apache.torque.generator.template.groovy.GroovyOutlet

<https://builds.apache.org/job/Torque4-trunk/ws/torque4-trunk/torque-generator/src/main/java/org/apache/torque/generator/template/groovy/GroovyOutlet.java>:[152,12]
cannot find symbol
symbol  : class Writable
location: class org.apache.torque.generator.template.groovy.GroovyOutlet


[INFO] ------------------------------------------------------------------------
[INFO] For more information, run Maven with the -e switch
[INFO] ------------------------------------------------------------------------
[INFO] Total time: 4 minutes 50 seconds
[INFO] Finished at: Thu Apr 04 00:53:12 UTC 2013
[INFO] Final Memory: 92M/331M
[INFO] ------------------------------------------------------------------------
Sending e-mails to: torque-dev@db.apache.org
channel stopped
Skipping Cobertura coverage report as build was not UNSTABLE or better ...

---------------------------------------------------------------------
To unsubscribe, e-mail: torque-dev-unsubscribe@db.apache.org
For additional commands, e-mail: torque-dev-help@db.apache.org


Mime
View raw message