db-torque-dev mailing list archives

Site index · List index
Message view « Date » · « Thread »
Top « Date » · « Thread »
From Apache Jenkins Server <jenk...@builds.apache.org>
Subject Build failed in Jenkins: torque4-test-project-derby #317
Date Mon, 28 Jan 2013 21:57:46 GMT
See <https://builds.apache.org/job/torque4-test-project-derby/317/changes>

Changes:

[tfischer] mssql cannot insert predefined primary keys, skip test

[tfischer] - mssql does not have CURRENT_DATE and CURRENT_TIME columns
- use new jdts version

[tfischer] obey unique constraint on integerColumn in test

------------------------------------------
[...truncated 2055 lines...]
[ERROR] Failed to execute:  drop table included
[ERROR] java.sql.SQLException: 'DROP TABLE' cannot be performed on 'INCLUDED' because it does
not exist.
[ERROR] Failed to execute:  drop table included_from_included
[ERROR] java.sql.SQLException: 'DROP TABLE' cannot be performed on 'INCLUDED_FROM_INCLUDED'
because it does not exist.
[INFO] Executing file: <https://builds.apache.org/job/torque4-test-project-derby/ws/target/generated-sql/types-schema.sql>
[ERROR] Failed to execute:  
 
 drop table types_object
[ERROR] java.sql.SQLException: 'DROP TABLE' cannot be performed on 'TYPES_OBJECT' because
it does not exist.
[ERROR] Failed to execute:  drop table types_primitive
[ERROR] java.sql.SQLException: 'DROP TABLE' cannot be performed on 'TYPES_PRIMITIVE' because
it does not exist.
[ERROR] Failed to execute:  drop table BIT_TYPE
[ERROR] java.sql.SQLException: 'DROP TABLE' cannot be performed on 'BIT_TYPE' because it does
not exist.
[ERROR] Failed to execute:  drop table BLOB_TYPE
[ERROR] java.sql.SQLException: 'DROP TABLE' cannot be performed on 'BLOB_TYPE' because it
does not exist.
[ERROR] Failed to execute:  drop table CLOB_TYPE
[ERROR] java.sql.SQLException: 'DROP TABLE' cannot be performed on 'CLOB_TYPE' because it
does not exist.
[ERROR] Failed to execute:  drop table BINARY_TYPE
[ERROR] java.sql.SQLException: 'DROP TABLE' cannot be performed on 'BINARY_TYPE' because it
does not exist.
[ERROR] Failed to execute:  drop table VARBINARY_TYPE
[ERROR] java.sql.SQLException: 'DROP TABLE' cannot be performed on 'VARBINARY_TYPE' because
it does not exist.
[ERROR] Failed to execute:  drop table LONGVARBINARY_TYPE
[ERROR] java.sql.SQLException: 'DROP TABLE' cannot be performed on 'LONGVARBINARY_TYPE' because
it does not exist.
[ERROR] Failed to execute:  drop table BINT_BCHAR_TYPE
[ERROR] java.sql.SQLException: 'DROP TABLE' cannot be performed on 'BINT_BCHAR_TYPE' because
it does not exist.
[ERROR] Failed to execute:  drop table DATE_TIME_TIMESTAMP_TYPE
[ERROR] java.sql.SQLException: 'DROP TABLE' cannot be performed on 'DATE_TIME_TIMESTAMP_TYPE'
because it does not exist.
[ERROR] Failed to execute:  drop table INTEGER_TYPE
[ERROR] java.sql.SQLException: 'DROP TABLE' cannot be performed on 'INTEGER_TYPE' because
it does not exist.
[ERROR] Failed to execute:  drop table BIGINT_TYPE
[ERROR] java.sql.SQLException: 'DROP TABLE' cannot be performed on 'BIGINT_TYPE' because it
does not exist.
[ERROR] Failed to execute:  drop table VARCHAR_TYPE
[ERROR] java.sql.SQLException: 'DROP TABLE' cannot be performed on 'VARCHAR_TYPE' because
it does not exist.
[INFO] 118 of 232 SQL statements executed successfully
[INFO] [sql:execute {execution: execute-idtable-sql}]
[INFO] Executing file: <https://builds.apache.org/job/torque4-test-project-derby/ws/target/generated-sql/bookstore-schema-idtable-init.sql>
[INFO] Executing file: <https://builds.apache.org/job/torque4-test-project-derby/ws/target/generated-sql/databaseMapInit-schema-idtable-init.sql>
[INFO] Executing file: <https://builds.apache.org/job/torque4-test-project-derby/ws/target/generated-sql/default-value-schema-idtable-init.sql>
[INFO] Executing file: <https://builds.apache.org/job/torque4-test-project-derby/ws/target/generated-sql/ext-schema-idtable-init.sql>
[INFO] Executing file: <https://builds.apache.org/job/torque4-test-project-derby/ws/target/generated-sql/extext-schema-idtable-init.sql>
[INFO] Executing file: <https://builds.apache.org/job/torque4-test-project-derby/ws/target/generated-sql/foreign-key-schema-idtable-init.sql>
[INFO] Executing file: <https://builds.apache.org/job/torque4-test-project-derby/ws/target/generated-sql/pk-schema-idtable-init.sql>
[INFO] Executing file: <https://builds.apache.org/job/torque4-test-project-derby/ws/target/generated-sql/qualified-table-name-schema-idtable-init.sql>
[INFO] Executing file: <https://builds.apache.org/job/torque4-test-project-derby/ws/target/generated-sql/save-method-in-peer-schema-idtable-init.sql>
[INFO] Executing file: <https://builds.apache.org/job/torque4-test-project-derby/ws/target/generated-sql/test-schema-idtable-init.sql>
[INFO] Executing file: <https://builds.apache.org/job/torque4-test-project-derby/ws/target/generated-sql/types-schema-idtable-init.sql>
[INFO] 73 of 73 SQL statements executed successfully
[INFO] [sql:execute {execution: shutdown-db-after-ddl}]
[debug] execute contextualize
[INFO] [resources:testResources {execution: default-testResources}]
[INFO] Using 'ISO-8859-1' encoding to copy filtered resources.
[INFO] Copying 6 resources
[INFO] Copying 3 resources
[INFO] [compiler:testCompile {execution: default-testCompile}]
[INFO] Compiling 49 source files to <https://builds.apache.org/job/torque4-test-project-derby/ws/target/test-classes>
[WARNING] DEPRECATED [systemProperties]: Use systemPropertyVariables instead.
[INFO] [surefire:test {execution: default-test}]
[INFO] Surefire report directory: <https://builds.apache.org/job/torque4-test-project-derby/ws/target/surefire-reports>

-------------------------------------------------------
 T E S T S
-------------------------------------------------------
Running org.apache.torque.oid.IDBrokerTest
Tests run: 4, Failures: 0, Errors: 0, Skipped: 0, Time elapsed: 3.165 sec
Running org.apache.torque.datatypes.BlobTest
Tests run: 3, Failures: 0, Errors: 0, Skipped: 0, Time elapsed: 3.671 sec
Running org.apache.torque.DocsTest
Tests run: 5, Failures: 0, Errors: 0, Skipped: 0, Time elapsed: 3.552 sec
Running org.apache.torque.generated.peer.WhereClauseSubselectTest
Tests run: 5, Failures: 0, Errors: 0, Skipped: 0, Time elapsed: 3.297 sec
Running org.apache.torque.util.LargeSelectTest
Tests run: 9, Failures: 0, Errors: 0, Skipped: 0, Time elapsed: 16.519 sec
Running org.apache.torque.generated.dataobject.SaveTest
Tests run: 8, Failures: 0, Errors: 0, Skipped: 0, Time elapsed: 10.568 sec
Running org.apache.torque.generated.peer.ImplInitialisationTest
Tests run: 1, Failures: 0, Errors: 0, Skipped: 0, Time elapsed: 2.341 sec
Running org.apache.torque.util.ExceptionMapperTest
Tests run: 5, Failures: 0, Errors: 0, Skipped: 0, Time elapsed: 24.905 sec
Running org.apache.torque.DataTest
Tests run: 24, Failures: 0, Errors: 0, Skipped: 0, Time elapsed: 6.08 sec
Running org.apache.torque.datatypes.BitTest
Tests run: 6, Failures: 0, Errors: 0, Skipped: 0, Time elapsed: 0.504 sec
Running org.apache.torque.map.DatabaseMapTest
Tests run: 10, Failures: 0, Errors: 0, Skipped: 0, Time elapsed: 3.199 sec
Running org.apache.torque.generated.peer.DefaultValuesFromDatabaseTest
Tests run: 8, Failures: 0, Errors: 0, Skipped: 0, Time elapsed: 2.095 sec
Running org.apache.torque.generated.dataobject.ForeignKeyGetterTest
Tests run: 12, Failures: 0, Errors: 0, Skipped: 0, Time elapsed: 0.578 sec
Running org.apache.torque.datatypes.LongvarbinaryTest
Tests run: 3, Failures: 0, Errors: 0, Skipped: 0, Time elapsed: 2.358 sec
Running org.apache.torque.JndiConfigurationTest
Tests run: 3, Failures: 0, Errors: 0, Skipped: 0, Time elapsed: 2.069 sec
Running org.apache.torque.generated.peer.DateTest
Tests run: 14, Failures: 0, Errors: 0, Skipped: 0, Time elapsed: 2.439 sec
Running org.apache.torque.generated.peer.DefaultValuesFromJavaTest
Tests run: 9, Failures: 0, Errors: 0, Skipped: 0, Time elapsed: 2.023 sec
Running org.apache.torque.adapter.AdapterTest
Tests run: 1, Failures: 0, Errors: 0, Skipped: 0, Time elapsed: 3.068 sec
Running org.apache.torque.generated.peer.SelectFunctionTest
Tests run: 8, Failures: 0, Errors: 0, Skipped: 0, Time elapsed: 2.849 sec
Running org.apache.torque.datatypes.BooleanIntCharTest
Tests run: 30, Failures: 0, Errors: 0, Skipped: 0, Time elapsed: 3.841 sec
Running org.apache.torque.generated.peer.FillerTest
Tests run: 19, Failures: 0, Errors: 0, Skipped: 0, Time elapsed: 122.707 sec
Running org.apache.torque.generated.peer.SelectInTest
Tests run: 6, Failures: 0, Errors: 0, Skipped: 0, Time elapsed: 16.529 sec
Running org.apache.torque.generated.dataobject.ForeignKeyAdderTest
Tests run: 10, Failures: 0, Errors: 0, Skipped: 0, Time elapsed: 0.582 sec
Running org.apache.torque.generated.peer.SetAndSaveTest
Tests run: 7, Failures: 0, Errors: 0, Skipped: 0, Time elapsed: 7.307 sec
Running org.apache.torque.generated.peer.RetrieveByPkTest
Tests run: 4, Failures: 0, Errors: 0, Skipped: 0, Time elapsed: 9.815 sec
Running org.apache.torque.datatypes.VarbinaryTest
Tests run: 3, Failures: 0, Errors: 0, Skipped: 0, Time elapsed: 3.409 sec
Running org.apache.torque.generated.peer.QualifiedTableNameTest
Tests run: 6, Failures: 0, Errors: 0, Skipped: 0, Time elapsed: 2.732 sec
Running org.apache.torque.datatypes.ClobTest
Tests run: 2, Failures: 0, Errors: 0, Skipped: 0, Time elapsed: 2.746 sec
Running org.apache.torque.om.OMByNameMethodsTest
Tests run: 7, Failures: 0, Errors: 0, Skipped: 0, Time elapsed: 0.98 sec
Running org.apache.torque.generated.peer.SaveMethodsInPeerTest
Tests run: 2, Failures: 0, Errors: 0, Skipped: 0, Time elapsed: 2.124 sec
Running org.apache.torque.InitShutdownTest
Tests run: 2, Failures: 0, Errors: 0, Skipped: 0, Time elapsed: 3.508 sec
Running org.apache.torque.util.SummaryHelperTest
Tests run: 2, Failures: 0, Errors: 0, Skipped: 0, Time elapsed: 6.57 sec
Running org.apache.torque.datatypes.BinaryTest
Tests run: 3, Failures: 0, Errors: 0, Skipped: 0, Time elapsed: 2.596 sec
Running org.apache.torque.generated.peer.SelectTest
Tests run: 17, Failures: 0, Errors: 0, Skipped: 0, Time elapsed: 40.712 sec
Running org.apache.torque.generated.dataobject.ValueEqualsTest
Tests run: 6, Failures: 0, Errors: 0, Skipped: 0, Time elapsed: 3.289 sec
Running org.apache.torque.generated.peer.GetRelatedObjectsTest
Tests run: 5, Failures: 0, Errors: 0, Skipped: 0, Time elapsed: 8.093 sec
Running org.apache.torque.generated.dataobject.ViewTest
Tests run: 1, Failures: 0, Errors: 0, Skipped: 0, Time elapsed: 4.395 sec
Running org.apache.torque.util.BasePeerTest
Tests run: 2, Failures: 0, Errors: 0, Skipped: 0, Time elapsed: 5.122 sec
Running org.apache.torque.sql.SkipSqlTest
Tests run: 1, Failures: 0, Errors: 0, Skipped: 0, Time elapsed: 2.175 sec
Running org.apache.torque.avalon.AvalonMapBuildersTest
[DEBUG] Starting container...
[DEBUG] Loading the service container class org.apache.fulcrum.yaafi.framework.container.ServiceContainerImpl
[DEBUG] Instantiating the service container class org.apache.fulcrum.yaafi.framework.container.ServiceContainerImpl
[DEBUG] Setting applicationRootDir to <https://builds.apache.org/job/torque4-test-project-derby/ws/>
[DEBUG] Service Framework is starting up
[DEBUG] Using the following applicationRootDir : <https://builds.apache.org/job/torque4-test-project-derby/ws/>
[DEBUG] Using the following tempRootDir : /tmp
[DEBUG] Looking for src/test/resources/TestComponentConfig.xml in the application directory
[DEBUG] Successfully located src/test/resources/TestComponentConfig.xml
[DEBUG] Looking for src/test/resources/TestRoleConfig.xml in the application directory
[DEBUG] Successfully located src/test/resources/TestRoleConfig.xml
[DEBUG] Looking for /parameters.properties as absolute file location
[DEBUG] Looking for /parameters.properties using the class loader
[WARNING] Unable to locate /parameters.properties
[DEBUG] Loading the implementation class for TorqueComponent
[DEBUG] Instantiating the implementation class for TorqueComponent
[DEBUG] Incarnating the service TorqueComponent
[DEBUG] LogEnabled.enableLogging() for TorqueComponent
[DEBUG] Contextualizable.contextualize() for TorqueComponent
[DEBUG] Configurable.configure() for TorqueComponent
[DEBUG] configure(TorqueComponent::<no value>:@null:20:22)
[DEBUG] Config File changes to src/test/resources/TurbineResources.properties
[DEBUG] Config File is <https://builds.apache.org/job/torque4-test-project-derby/ws/src/test/resources/TurbineResources.properties>
[DEBUG] Initializable.initialize() for TorqueComponent
[DEBUG] initialize()
[DEBUG] Service Framework is up and running
[INFO] YaffiContainer ready.
[DEBUG] Disposing of container...
[INFO] Disposing all services
[DEBUG] Decommisioning the service TorqueComponent
[DEBUG] Disposable.dispose() for TorqueComponent
[DEBUG] dispose()
[DEBUG] All services are disposed
[INFO] YaffiContainer has been disposed.
Tests run: 1, Failures: 0, Errors: 0, Skipped: 0, Time elapsed: 1.141 sec
Running org.apache.torque.generated.peer.DeleteTest
Tests run: 14, Failures: 0, Errors: 0, Skipped: 0, Time elapsed: 6.326 sec
Running org.apache.torque.generated.peer.JoinTest
Tests run: 12, Failures: 0, Errors: 0, Skipped: 0, Time elapsed: 6.466 sec

Results :

Tests run: 300, Failures: 0, Errors: 0, Skipped: 0

Jan 28, 2013 9:57:44 PM hudson.remoting.SynchronousCommandTransport$ReaderThread run
SEVERE: I/O error in channel channel
java.io.StreamCorruptedException
	at java.io.ObjectInputStream.readObject0(ObjectInputStream.java:1332)
	at java.io.ObjectInputStream.readObject(ObjectInputStream.java:348)
	at hudson.remoting.Command.readFrom(Command.java:92)
	at hudson.remoting.ClassicCommandTransport.read(ClassicCommandTransport.java:59)
	at hudson.remoting.SynchronousCommandTransport$ReaderThread.run(SynchronousCommandTransport.java:48)
channel stopped
[INFO] ------------------------------------------------------------------------
[ERROR] FATAL ERROR
[INFO] ------------------------------------------------------------------------
[INFO] null
[INFO] ------------------------------------------------------------------------
[INFO] Trace
java.lang.reflect.UndeclaredThrowableException
	at $Proxy1.fetch2(Unknown Source)
	at hudson.remoting.RemoteClassLoader.findClass(RemoteClassLoader.java:127)
	at java.lang.ClassLoader.loadClass(ClassLoader.java:307)
	at java.lang.ClassLoader.loadClass(ClassLoader.java:252)
	at java.lang.ClassLoader.loadClassInternal(ClassLoader.java:320)
	at hudson.maven.reporters.MavenArtifactArchiver.postBuild(MavenArtifactArchiver.java:101)
	at hudson.maven.Maven2Builder.postModule(Maven2Builder.java:129)
	at hudson.maven.MavenBuilder$Adapter.fireLeaveModule(MavenBuilder.java:340)
	at hudson.maven.MavenBuilder$Adapter.postBuild(MavenBuilder.java:296)
	at org.apache.maven.lifecycle.LifecycleExecutorInterceptor.execute(LifecycleExecutorInterceptor.java:68)
	at org.apache.maven.DefaultMaven.doExecute(DefaultMaven.java:328)
	at org.apache.maven.DefaultMaven.execute(DefaultMaven.java:138)
	at org.apache.maven.cli.MavenCli.main(MavenCli.java:362)
	at sun.reflect.NativeMethodAccessorImpl.invoke0(Native Method)
	at sun.reflect.NativeMethodAccessorImpl.invoke(NativeMethodAccessorImpl.java:39)
	at sun.reflect.DelegatingMethodAccessorImpl.invoke(DelegatingMethodAccessorImpl.java:25)
	at java.lang.reflect.Method.invoke(Method.java:592)
	at org.codehaus.classworlds.Launcher.launchEnhanced(Launcher.java:315)
	at org.codehaus.classworlds.Launcher.launch(Launcher.java:255)
	at hudson.maven.agent.Main.launch(Main.java:185)
	at hudson.maven.MavenBuilder.call(MavenBuilder.java:153)
	at hudson.maven.Maven2Builder.call(Maven2Builder.java:79)
	at hudson.maven.Maven2Builder.call(Maven2Builder.java:55)
	at hudson.remoting.UserRequest.perform(UserRequest.java:118)
	at hudson.remoting.UserRequest.perform(UserRequest.java:48)
	at hudson.remoting.Request$2.run(Request.java:326)
	at hudson.remoting.InterceptingExecutorService$1.call(InterceptingExecutorService.java:72)
	at java.util.concurrent.FutureTask$Sync.innerRun(FutureTask.java:269)
	at java.util.concurrent.FutureTask.run(FutureTask.java:123)
	at java.util.concurrent.ThreadPoolExecutor$Worker.runTask(ThreadPoolExecutor.java:651)
	at java.util.concurrent.ThreadPoolExecutor$Worker.run(ThreadPoolExecutor.java:676)
	at java.lang.Thread.run(Thread.java:595)
Caused by: hudson.remoting.ChannelClosedException: channel is already closed
	at hudson.remoting.Channel.send(Channel.java:494)
	at hudson.remoting.Request.call(Request.java:129)
	at hudson.remoting.RemoteInvocationHandler.invoke(RemoteInvocationHandler.java:160)
	... 32 more
Caused by: java.io.StreamCorruptedException
	at java.io.ObjectInputStream.readObject0(ObjectInputStream.java:1332)
	at java.io.ObjectInputStream.readObject(ObjectInputStream.java:348)
	at hudson.remoting.Command.readFrom(Command.java:92)
	at hudson.remoting.ClassicCommandTransport.read(ClassicCommandTransport.java:59)
	at hudson.remoting.SynchronousCommandTransport$ReaderThread.run(SynchronousCommandTransport.java:48)
[INFO] ------------------------------------------------------------------------
[INFO] Total time: 7 minutes 22 seconds
[INFO] Finished at: Mon Jan 28 21:57:44 UTC 2013
ERROR: Maven JVM terminated unexpectedly with exit code 0


---------------------------------------------------------------------
To unsubscribe, e-mail: torque-dev-unsubscribe@db.apache.org
For additional commands, e-mail: torque-dev-help@db.apache.org


Mime
View raw message