db-torque-dev mailing list archives

Site index · List index
Message view « Date » · « Thread »
Top « Date » · « Thread »
From Apache Jenkins Server <jenk...@builds.apache.org>
Subject Build failed in Jenkins: torque4-test-project-derby #296
Date Thu, 13 Dec 2012 08:35:18 GMT
See <https://builds.apache.org/job/torque4-test-project-derby/296/>

------------------------------------------
[...truncated 2333 lines...]
[ERROR] java.sql.SQLException: 'DROP TABLE' cannot be performed on 'BASE' because it does
not exist.
[ERROR] Failed to execute:  drop table NATIVE_TEST
[ERROR] java.sql.SQLException: 'DROP TABLE' cannot be performed on 'NATIVE_TEST' because it
does not exist.
[ERROR] Failed to execute:  drop table NATIVE_REF_TEST
[ERROR] java.sql.SQLException: 'DROP TABLE' cannot be performed on 'NATIVE_REF_TEST' because
it does not exist.
[ERROR] Failed to execute:  drop table payment_invoice_map
[ERROR] java.sql.SQLException: 'DROP TABLE' cannot be performed on 'PAYMENT_INVOICE_MAP' because
it does not exist.
[ERROR] Failed to execute:  drop table AUTOINCREMENT_NATIVE
[ERROR] java.sql.SQLException: 'DROP TABLE' cannot be performed on 'AUTOINCREMENT_NATIVE'
because it does not exist.
[ERROR] Failed to execute:  drop table AUTOINCREMENT_NONE
[ERROR] java.sql.SQLException: 'DROP TABLE' cannot be performed on 'AUTOINCREMENT_NONE' because
it does not exist.
[ERROR] Failed to execute:  drop table AUTOINCREMENT_IDBROKER
[ERROR] java.sql.SQLException: 'DROP TABLE' cannot be performed on 'AUTOINCREMENT_IDBROKER'
because it does not exist.
[ERROR] Failed to execute:  drop table LEAGUES_OBJECT
[ERROR] java.sql.SQLException: 'DROP TABLE' cannot be performed on 'LEAGUES_OBJECT' because
it does not exist.
[ERROR] Failed to execute:  drop table LEAGUES_PRIMITIVE
[ERROR] java.sql.SQLException: 'DROP TABLE' cannot be performed on 'LEAGUES_PRIMITIVE' because
it does not exist.
[ERROR] Failed to execute:  drop table multi_pk_foreign_key
[ERROR] java.sql.SQLException: 'DROP TABLE' cannot be performed on 'MULTI_PK_FOREIGN_KEY'
because it does not exist.
[ERROR] Failed to execute:  drop table integer_pk
[ERROR] java.sql.SQLException: 'DROP TABLE' cannot be performed on 'INTEGER_PK' because it
does not exist.
[ERROR] Failed to execute:  drop table integer_object_pk
[ERROR] java.sql.SQLException: 'DROP TABLE' cannot be performed on 'INTEGER_OBJECT_PK' because
it does not exist.
[ERROR] Failed to execute:  drop table INHERITANCE_TEST
[ERROR] java.sql.SQLException: 'DROP TABLE' cannot be performed on 'INHERITANCE_TEST' because
it does not exist.
[ERROR] Failed to execute:  drop table INHERITANCE_CLASSNAME_TEST
[ERROR] java.sql.SQLException: 'DROP TABLE' cannot be performed on 'INHERITANCE_CLASSNAME_TEST'
because it does not exist.
[ERROR] Failed to execute:  drop table SCALE_TEST
[ERROR] java.sql.SQLException: 'DROP TABLE' cannot be performed on 'SCALE_TEST' because it
does not exist.
[ERROR] Failed to execute:  drop table CIRCULAR_REFERENCE_A
[ERROR] java.sql.SQLException: 'DROP TABLE' cannot be performed on 'CIRCULAR_REFERENCE_A'
because it does not exist.
[ERROR] Failed to execute:  drop table CIRCULAR_REFERENCE_B
[ERROR] java.sql.SQLException: 'DROP TABLE' cannot be performed on 'CIRCULAR_REFERENCE_B'
because it does not exist.
[ERROR] Failed to execute:  drop table referenced
[ERROR] java.sql.SQLException: 'DROP TABLE' cannot be performed on 'REFERENCED' because it
does not exist.
[ERROR] Failed to execute:  drop table multi_ref_same_table
[ERROR] java.sql.SQLException: 'DROP TABLE' cannot be performed on 'MULTI_REF_SAME_TABLE'
because it does not exist.
[ERROR] Failed to execute:  drop table types_object
[ERROR] java.sql.SQLException: 'DROP TABLE' cannot be performed on 'TYPES_OBJECT' because
it does not exist.
[ERROR] Failed to execute:  drop table types_primitive
[ERROR] java.sql.SQLException: 'DROP TABLE' cannot be performed on 'TYPES_PRIMITIVE' because
it does not exist.
[ERROR] Failed to execute:  drop table SUMMARIZE1
[ERROR] java.sql.SQLException: 'DROP TABLE' cannot be performed on 'SUMMARIZE1' because it
does not exist.
[ERROR] Failed to execute:  drop table ABSTRACT
[ERROR] java.sql.SQLException: 'DROP TABLE' cannot be performed on 'ABSTRACT' because it does
not exist.
[ERROR] Failed to execute:  
 
 
 
 ALTER TABLE course_number
 ADD CONSTRAINT course_number_FK_1
 FOREIGN KEY (course_id)
 REFERENCES course (id)
 ON UPDATE cascade
 ON DELETE cascade
[ERROR] java.sql.SQLException: Syntax error: Encountered "cascade" at line 9, column 12.
[ERROR] Failed to execute:  ALTER TABLE reference_to_included
 ADD CONSTRAINT reference_to_included_FK_1
 FOREIGN KEY (included_id)
 REFERENCES included (id)
[ERROR] java.sql.SQLException: Constraint 'REFERENCE_TO_INCLUDED_FK_1' is invalid: referenced
table INCLUDED does not exist.
[ERROR] Failed to execute:  ALTER TABLE reference_to_included
 ADD CONSTRAINT reference_to_included_FK_2
 FOREIGN KEY (included_from_included_id)
 REFERENCES included_from_included (id)
[ERROR] java.sql.SQLException: Constraint 'REFERENCE_TO_INCLUDED_FK_2' is invalid: referenced
table INCLUDED_FROM_INCLUDED does not exist.
[ERROR] Failed to execute:  ALTER TABLE ext_schema
 ADD CONSTRAINT ext_schema_FK_1
 FOREIGN KEY (ext_id)
 REFERENCES ext (ext_id)
[ERROR] java.sql.SQLException: Constraint 'EXT_SCHEMA_FK_1' is invalid: referenced table EXT
does not exist.
[ERROR] Failed to execute:  ALTER TABLE extext_schema
 ADD CONSTRAINT extext_schema_FK_1
 FOREIGN KEY (extext_id)
 REFERENCES extext (extext_id)
[ERROR] java.sql.SQLException: Constraint 'EXTEXT_SCHEMA_FK_1' is invalid: referenced table
EXTEXT does not exist.
[INFO] Executing file: <https://builds.apache.org/job/torque4-test-project-derby/ws/target/generated-sql/types-schema.sql>
[ERROR] Failed to execute:  
 
 drop table bit_value
[ERROR] java.sql.SQLException: 'DROP TABLE' cannot be performed on 'BIT_VALUE' because it
does not exist.
[ERROR] Failed to execute:  drop table blob_test
[ERROR] java.sql.SQLException: 'DROP TABLE' cannot be performed on 'BLOB_TEST' because it
does not exist.
[ERROR] Failed to execute:  drop table clob_test
[ERROR] java.sql.SQLException: 'DROP TABLE' cannot be performed on 'CLOB_TEST' because it
does not exist.
[ERROR] Failed to execute:  drop table bint_bchar_value
[ERROR] java.sql.SQLException: 'DROP TABLE' cannot be performed on 'BINT_BCHAR_VALUE' because
it does not exist.
[ERROR] Failed to execute:  drop table DATE_TIME_TIMESTAMP
[ERROR] java.sql.SQLException: 'DROP TABLE' cannot be performed on 'DATE_TIME_TIMESTAMP' because
it does not exist.
[INFO] 127 of 267 SQL statements executed successfully
[INFO] [sql:execute {execution: execute-idtable-sql}]
[INFO] Executing file: <https://builds.apache.org/job/torque4-test-project-derby/ws/target/generated-sql/bookstore-schema-idtable-init.sql>
[INFO] Executing file: <https://builds.apache.org/job/torque4-test-project-derby/ws/target/generated-sql/databaseMapInit-schema-idtable-init.sql>
[INFO] Executing file: <https://builds.apache.org/job/torque4-test-project-derby/ws/target/generated-sql/default-value-schema-idtable-init.sql>
[INFO] Executing file: <https://builds.apache.org/job/torque4-test-project-derby/ws/target/generated-sql/ext-schema-idtable-init.sql>
[INFO] Executing file: <https://builds.apache.org/job/torque4-test-project-derby/ws/target/generated-sql/extext-schema-idtable-init.sql>
[INFO] Executing file: <https://builds.apache.org/job/torque4-test-project-derby/ws/target/generated-sql/foreign-key-schema-idtable-init.sql>
[INFO] Executing file: <https://builds.apache.org/job/torque4-test-project-derby/ws/target/generated-sql/included-from-included-schema-idtable-init.sql>
[INFO] Executing file: <https://builds.apache.org/job/torque4-test-project-derby/ws/target/generated-sql/included-schema-idtable-init.sql>
[INFO] Executing file: <https://builds.apache.org/job/torque4-test-project-derby/ws/target/generated-sql/pk-schema-idtable-init.sql>
[ERROR] Failed to execute:  insert into ID_TABLE (id_table_id, table_name, next_id, quantity)
VALUES (146, 'VARCHAR_PK', 1000, 10)
[ERROR] java.sql.SQLException: The statement was aborted because it would have caused a duplicate
key value in a unique or primary key constraint or unique index identified by 'ID_TABLE_UQ_1'
defined on 'ID_TABLE'.
[INFO] Executing file: <https://builds.apache.org/job/torque4-test-project-derby/ws/target/generated-sql/qualified-table-name-schema-idtable-init.sql>
[INFO] Executing file: <https://builds.apache.org/job/torque4-test-project-derby/ws/target/generated-sql/save-method-in-peer-schema-idtable-init.sql>
[INFO] Executing file: <https://builds.apache.org/job/torque4-test-project-derby/ws/target/generated-sql/test-schema-idtable-init.sql>
[INFO] Executing file: <https://builds.apache.org/job/torque4-test-project-derby/ws/target/generated-sql/types-schema-idtable-init.sql>
[INFO] 90 of 91 SQL statements executed successfully
[INFO] [sql:execute {execution: shutdown-db-after-ddl}]
[debug] execute contextualize
[INFO] [resources:testResources {execution: default-testResources}]
[INFO] Using 'ISO-8859-1' encoding to copy filtered resources.
[INFO] Copying 6 resources
[INFO] Copying 3 resources
[INFO] [compiler:testCompile {execution: default-testCompile}]
[INFO] Compiling 43 source files to <https://builds.apache.org/job/torque4-test-project-derby/ws/target/test-classes>
[WARNING] DEPRECATED [systemProperties]: Use systemPropertyVariables instead.
[INFO] [surefire:test {execution: default-test}]
[INFO] Surefire report directory: <https://builds.apache.org/job/torque4-test-project-derby/ws/target/surefire-reports>

-------------------------------------------------------
 T E S T S
-------------------------------------------------------
Running org.apache.torque.oid.IDBrokerTest
Tests run: 4, Failures: 0, Errors: 0, Skipped: 0, Time elapsed: 3.447 sec
Running org.apache.torque.DocsTest
Tests run: 5, Failures: 0, Errors: 0, Skipped: 0, Time elapsed: 2.867 sec
Running org.apache.torque.generated.peer.WhereClauseSubselectTest
Tests run: 5, Failures: 0, Errors: 0, Skipped: 0, Time elapsed: 2.905 sec
Running org.apache.torque.util.LargeSelectTest
Tests run: 9, Failures: 0, Errors: 0, Skipped: 0, Time elapsed: 13.174 sec
Running org.apache.torque.generated.dataobject.SaveTest
Tests run: 8, Failures: 0, Errors: 0, Skipped: 0, Time elapsed: 6.617 sec
Running org.apache.torque.util.ExceptionMapperTest
Tests run: 5, Failures: 0, Errors: 0, Skipped: 0, Time elapsed: 25.189 sec
Running org.apache.torque.generated.peer.ImplInitialisationTest
Tests run: 1, Failures: 0, Errors: 0, Skipped: 0, Time elapsed: 3.074 sec
Running org.apache.torque.DataTest
Tests run: 26, Failures: 0, Errors: 0, Skipped: 0, Time elapsed: 6.814 sec
Running org.apache.torque.map.DatabaseMapTest
Tests run: 10, Failures: 0, Errors: 0, Skipped: 0, Time elapsed: 2.898 sec
Running org.apache.torque.datatypes.BitTest
Tests run: 6, Failures: 0, Errors: 0, Skipped: 0, Time elapsed: 0.495 sec
Running org.apache.torque.generated.peer.DefaultValuesFromDatabaseTest
Tests run: 8, Failures: 0, Errors: 0, Skipped: 0, Time elapsed: 2.899 sec
Running org.apache.torque.generated.dataobject.ForeignKeyGetterTest
Tests run: 12, Failures: 0, Errors: 0, Skipped: 0, Time elapsed: 0.678 sec
Running org.apache.torque.JndiConfigurationTest
Tests run: 3, Failures: 0, Errors: 0, Skipped: 0, Time elapsed: 2.269 sec
Running org.apache.torque.generated.peer.DateTest
Tests run: 14, Failures: 0, Errors: 0, Skipped: 0, Time elapsed: 2.914 sec
Running org.apache.torque.generated.peer.DefaultValuesFromJavaTest
Tests run: 9, Failures: 0, Errors: 0, Skipped: 0, Time elapsed: 2.138 sec
Running org.apache.torque.adapter.AdapterTest
Tests run: 1, Failures: 0, Errors: 0, Skipped: 0, Time elapsed: 3.394 sec
Running org.apache.torque.generated.peer.SelectFunctionTest
Tests run: 8, Failures: 0, Errors: 0, Skipped: 0, Time elapsed: 2.716 sec
Running org.apache.torque.datatypes.BooleanIntCharTest
Tests run: 30, Failures: 0, Errors: 0, Skipped: 0, Time elapsed: 4.066 sec
Running org.apache.torque.generated.peer.FillerTest
Tests run: 19, Failures: 0, Errors: 0, Skipped: 0, Time elapsed: 87.116 sec
Running org.apache.torque.generated.peer.SelectInTest
Tests run: 6, Failures: 0, Errors: 0, Skipped: 0, Time elapsed: 11.086 sec
Running org.apache.torque.generated.dataobject.ForeignKeyAdderTest
Tests run: 10, Failures: 0, Errors: 0, Skipped: 0, Time elapsed: 0.699 sec
Running org.apache.torque.generated.peer.SetAndSaveTest
Tests run: 7, Failures: 0, Errors: 0, Skipped: 0, Time elapsed: 6.271 sec
Running org.apache.torque.generated.peer.RetrieveByPkTest
Tests run: 4, Failures: 0, Errors: 0, Skipped: 0, Time elapsed: 9.029 sec
Running org.apache.torque.generated.peer.QualifiedTableNameTest
Tests run: 6, Failures: 0, Errors: 0, Skipped: 0, Time elapsed: 2.965 sec
Running org.apache.torque.om.OMByNameMethodsTest
Tests run: 7, Failures: 0, Errors: 0, Skipped: 0, Time elapsed: 1.115 sec
Running org.apache.torque.generated.peer.SaveMethodsInPeerTest
Tests run: 2, Failures: 0, Errors: 0, Skipped: 0, Time elapsed: 2.469 sec
Running org.apache.torque.InitShutdownTest
Tests run: 2, Failures: 0, Errors: 0, Skipped: 0, Time elapsed: 2.937 sec
Running org.apache.torque.util.SummaryHelperTest
Tests run: 2, Failures: 0, Errors: 0, Skipped: 0, Time elapsed: 4.793 sec
Running org.apache.torque.generated.peer.SelectTest
Tests run: 17, Failures: 0, Errors: 0, Skipped: 0, Time elapsed: 46.479 sec
Running org.apache.torque.generated.dataobject.ValueEqualsTest
Tests run: 6, Failures: 0, Errors: 0, Skipped: 0, Time elapsed: 3.679 sec
Running org.apache.torque.generated.peer.GetRelatedObjectsTest
Tests run: 5, Failures: 0, Errors: 0, Skipped: 0, Time elapsed: 18.123 sec
Running org.apache.torque.generated.dataobject.ViewTest
Tests run: 1, Failures: 0, Errors: 0, Skipped: 0, Time elapsed: 5.537 sec
Running org.apache.torque.util.BasePeerTest
Tests run: 2, Failures: 0, Errors: 0, Skipped: 0, Time elapsed: 7.209 sec
Running org.apache.torque.sql.SkipSqlTest
Tests run: 1, Failures: 0, Errors: 0, Skipped: 0, Time elapsed: 2.25 sec
Running org.apache.torque.avalon.AvalonMapBuildersTest
[DEBUG] Starting container...
[DEBUG] Loading the service container class org.apache.fulcrum.yaafi.framework.container.ServiceContainerImpl
[DEBUG] Instantiating the service container class org.apache.fulcrum.yaafi.framework.container.ServiceContainerImpl
[DEBUG] Setting applicationRootDir to <https://builds.apache.org/job/torque4-test-project-derby/ws/>
[DEBUG] Service Framework is starting up
[DEBUG] Using the following applicationRootDir : <https://builds.apache.org/job/torque4-test-project-derby/ws/>
[DEBUG] Using the following tempRootDir : /tmp
[DEBUG] Looking for src/test/resources/TestComponentConfig.xml in the application directory
[DEBUG] Successfully located src/test/resources/TestComponentConfig.xml
[DEBUG] Looking for src/test/resources/TestRoleConfig.xml in the application directory
[DEBUG] Successfully located src/test/resources/TestRoleConfig.xml
[DEBUG] Looking for /parameters.properties as absolute file location
[DEBUG] Looking for /parameters.properties using the class loader
[WARNING] Unable to locate /parameters.properties
[DEBUG] Loading the implementation class for TorqueComponent
[DEBUG] Instantiating the implementation class for TorqueComponent
[DEBUG] Incarnating the service TorqueComponent
[DEBUG] LogEnabled.enableLogging() for TorqueComponent
[DEBUG] Contextualizable.contextualize() for TorqueComponent
[DEBUG] Configurable.configure() for TorqueComponent
[DEBUG] configure(TorqueComponent::<no value>:@null:20:22)
[DEBUG] Config File changes to src/test/resources/TurbineResources.properties
[DEBUG] Config File is <https://builds.apache.org/job/torque4-test-project-derby/ws/src/test/resources/TurbineResources.properties>
[DEBUG] Initializable.initialize() for TorqueComponent
[DEBUG] initialize()
[DEBUG] Service Framework is up and running
[INFO] YaffiContainer ready.
[DEBUG] Disposing of container...
[INFO] Disposing all services
[DEBUG] Decommisioning the service TorqueComponent
[DEBUG] Disposable.dispose() for TorqueComponent
[DEBUG] dispose()
[DEBUG] All services are disposed
[INFO] YaffiContainer has been disposed.
Tests run: 1, Failures: 0, Errors: 0, Skipped: 0, Time elapsed: 1.215 sec
Running org.apache.torque.generated.peer.DeleteTest
Tests run: 14, Failures: 0, Errors: 0, Skipped: 0, Time elapsed: 16.878 sec
Running org.apache.torque.generated.peer.JoinTest
Tests run: 12, Failures: 0, Errors: 0, Skipped: 0, Time elapsed: 6.924 sec

Results :

Tests run: 288, Failures: 0, Errors: 0, Skipped: 0

Dec 13, 2012 8:35:17 AM hudson.remoting.SynchronousCommandTransport$ReaderThread run
SEVERE: I/O error in channel channel
java.io.StreamCorruptedException
	at java.io.ObjectInputStream.readObject0(ObjectInputStream.java:1332)
	at java.io.ObjectInputStream.readObject(ObjectInputStream.java:348)
	at hudson.remoting.Command.readFrom(Command.java:90)
	at hudson.remoting.ClassicCommandTransport.read(ClassicCommandTransport.java:59)
	at hudson.remoting.SynchronousCommandTransport$ReaderThread.run(SynchronousCommandTransport.java:48)
channel stopped
[INFO] ------------------------------------------------------------------------
[ERROR] FATAL ERROR
[INFO] ------------------------------------------------------------------------
ERROR: Maven JVM terminated unexpectedly with exit code 0


---------------------------------------------------------------------
To unsubscribe, e-mail: torque-dev-unsubscribe@db.apache.org
For additional commands, e-mail: torque-dev-help@db.apache.org


Mime
View raw message