db-torque-dev mailing list archives

Site index · List index
Message view « Date » · « Thread »
Top « Date » · « Thread »
From Apache Jenkins Server <jenk...@builds.apache.org>
Subject Build failed in Jenkins: Torque4-trunk #335
Date Wed, 24 Oct 2012 12:25:00 GMT
See <https://builds.apache.org/job/Torque4-trunk/335/>

------------------------------------------
[...truncated 11128 lines...]
DEBUG org.apache.velocity.runtime.log.Log4JLogChute - Starting Apache Velocity v1.7 (compiled:
2010-11-19 12:14:37)
DEBUG org.apache.velocity.runtime.log.Log4JLogChute - Default Properties File: org/apache/velocity/runtime/defaults/velocity.properties
DEBUG org.apache.velocity.runtime.log.Log4JLogChute - Trying to use logger class org.apache.velocity.runtime.log.Log4JLogChute
DEBUG org.apache.velocity.runtime.log.Log4JLogChute - Using logger class org.apache.velocity.runtime.log.Log4JLogChute
DEBUG org.apache.velocity.runtime.log.Log4JLogChute - ResourceLoader instantiated: org.apache.velocity.runtime.resource.loader.FileResourceLoader
DEBUG org.apache.velocity.runtime.log.Log4JLogChute - Do unicode file recognition:  false
DEBUG org.apache.velocity.runtime.log.Log4JLogChute - FileResourceLoader : adding path '.'
DEBUG org.apache.velocity.runtime.log.Log4JLogChute - ResourceCache: initialized (class org.apache.velocity.runtime.resource.ResourceCacheImpl)
with class java.util.Collections$SynchronizedMap cache map.
DEBUG org.apache.velocity.runtime.log.Log4JLogChute - Loaded System Directive: org.apache.velocity.runtime.directive.Stop
DEBUG org.apache.velocity.runtime.log.Log4JLogChute - Loaded System Directive: org.apache.velocity.runtime.directive.Define
DEBUG org.apache.velocity.runtime.log.Log4JLogChute - Loaded System Directive: org.apache.velocity.runtime.directive.Break
DEBUG org.apache.velocity.runtime.log.Log4JLogChute - Loaded System Directive: org.apache.velocity.runtime.directive.Evaluate
DEBUG org.apache.velocity.runtime.log.Log4JLogChute - Loaded System Directive: org.apache.velocity.runtime.directive.Literal
DEBUG org.apache.velocity.runtime.log.Log4JLogChute - Loaded System Directive: org.apache.velocity.runtime.directive.Macro
DEBUG org.apache.velocity.runtime.log.Log4JLogChute - Loaded System Directive: org.apache.velocity.runtime.directive.Parse
DEBUG org.apache.velocity.runtime.log.Log4JLogChute - Loaded System Directive: org.apache.velocity.runtime.directive.Include
DEBUG org.apache.velocity.runtime.log.Log4JLogChute - Loaded System Directive: org.apache.velocity.runtime.directive.Foreach
DEBUG org.apache.velocity.runtime.log.Log4JLogChute - Created '20' parsers.
DEBUG org.apache.velocity.runtime.log.Log4JLogChute - Velocimacro : "velocimacro.library"
is not set.  Trying default library: VM_global_library.vm
DEBUG org.apache.velocity.runtime.log.Log4JLogChute - Velocimacro : Default library not found.
DEBUG org.apache.velocity.runtime.log.Log4JLogChute - Velocimacro : allowInline = true : VMs
can be defined inline in templates
DEBUG org.apache.velocity.runtime.log.Log4JLogChute - Velocimacro : allowInlineToOverride
= false : VMs defined inline may NOT replace previous VM definitions
DEBUG org.apache.velocity.runtime.log.Log4JLogChute - Velocimacro : allowInlineLocal = false
: VMs defined inline will be global in scope if allowed.
DEBUG org.apache.velocity.runtime.log.Log4JLogChute - Velocimacro : autoload off : VM system
will not automatically reload global library macros
DEBUG org.apache.torque.generator.template.velocity.VelocityOutlet - Put options in context
[]
DEBUG org.apache.torque.generator.template.velocity.VelocityOutlet - Put attributes in context
[]
DEBUG org.apache.torque.generator.template.velocity.VelocityOutlet - Put variables in context
[]
DEBUG org.apache.torque.generator.configuration.DirectoryConfigurationProvider - Reading template
file: '<https://builds.apache.org/job/Torque4-trunk/ws/torque4-trunk/torque-ant-tasks/src/test/torqueGeneratorTaskTest/src/main/torque-gen/templates/classFrame.vm'>
DEBUG org.apache.torque.generator.outlet.OutletImpl - mergepoint() : Start for mergepoint
constants
DEBUG org.apache.torque.generator.outlet.OutletImpl - mergepoint() : Executing action (TraverseAllAction:
element = entry, outlet = constant, acceptEmpty = true)
DEBUG org.apache.torque.generator.outlet.OutletImpl - Executing outlet constant on element
properties/entry
DEBUG org.apache.torque.generator.template.velocity.VelocityOutlet - Start executing VelocityOutlet
constant
DEBUG org.apache.torque.generator.template.velocity.VelocityOutlet - Put options in context
[]
DEBUG org.apache.torque.generator.template.velocity.VelocityOutlet - Put attributes in context
[null, key]
DEBUG org.apache.torque.generator.template.velocity.VelocityOutlet - Put variables in context
[]
DEBUG org.apache.torque.generator.configuration.DirectoryConfigurationProvider - Reading template
file: '<https://builds.apache.org/job/Torque4-trunk/ws/torque4-trunk/torque-ant-tasks/src/test/torqueGeneratorTaskTest/src/main/torque-gen/templates/constant.vm'>
DEBUG org.apache.torque.generator.outlet.OutletImpl - mergepoint() : Start for mergepoint
constantName
DEBUG org.apache.torque.generator.outlet.OutletImpl - mergepoint() : Executing action (ApplyAction:
path = ., outlet = constantName, acceptNotSet = true)
DEBUG org.apache.torque.generator.outlet.OutletImpl - Executing outlet constantName on element
properties/entry
DEBUG org.apache.torque.generator.outlet.OutletImpl - mergepoint() : End for mergepoint constantName
DEBUG org.apache.torque.generator.template.velocity.VelocityOutlet - End executing VelocityOutlet
constant
DEBUG org.apache.torque.generator.outlet.OutletImpl - Executing outlet constant on element
properties/entry
DEBUG org.apache.torque.generator.template.velocity.VelocityOutlet - Start executing VelocityOutlet
constant
DEBUG org.apache.torque.generator.template.velocity.VelocityOutlet - Put options in context
[]
DEBUG org.apache.torque.generator.template.velocity.VelocityOutlet - Put attributes in context
[null, key]
DEBUG org.apache.torque.generator.template.velocity.VelocityOutlet - Put variables in context
[]
DEBUG org.apache.torque.generator.outlet.OutletImpl - mergepoint() : Start for mergepoint
constantName
DEBUG org.apache.torque.generator.outlet.OutletImpl - mergepoint() : Executing action (ApplyAction:
path = ., outlet = constantName, acceptNotSet = true)
DEBUG org.apache.torque.generator.outlet.OutletImpl - Executing outlet constantName on element
properties/entry
DEBUG org.apache.torque.generator.outlet.OutletImpl - mergepoint() : End for mergepoint constantName
DEBUG org.apache.torque.generator.template.velocity.VelocityOutlet - End executing VelocityOutlet
constant
DEBUG org.apache.torque.generator.outlet.OutletImpl - mergepoint() : End for mergepoint constants
DEBUG org.apache.torque.generator.outlet.OutletImpl - mergepoint() : Start for mergepoint
fields
DEBUG org.apache.torque.generator.outlet.OutletImpl - mergepoint() : Executing action (ApplyAction:
path = ., outlet = keyField, acceptNotSet = true)
DEBUG org.apache.torque.generator.outlet.OutletImpl - Executing outlet keyField on element
properties
DEBUG org.apache.torque.generator.template.velocity.VelocityOutlet - Start executing VelocityOutlet
keyField
DEBUG org.apache.torque.generator.template.velocity.VelocityOutlet - Put options in context
[]
DEBUG org.apache.torque.generator.template.velocity.VelocityOutlet - Put attributes in context
[]
DEBUG org.apache.torque.generator.template.velocity.VelocityOutlet - Put variables in context
[]
DEBUG org.apache.torque.generator.configuration.DirectoryConfigurationProvider - Reading template
file: '<https://builds.apache.org/job/Torque4-trunk/ws/torque4-trunk/torque-ant-tasks/src/test/torqueGeneratorTaskTest/src/main/torque-gen/templates/keyField.vm'>
DEBUG org.apache.torque.generator.template.velocity.VelocityOutlet - End executing VelocityOutlet
keyField
DEBUG org.apache.torque.generator.outlet.OutletImpl - mergepoint() : End for mergepoint fields
DEBUG org.apache.torque.generator.outlet.OutletImpl - mergepoint() : Executing action (ApplyAction:
path = ., outlet = newline, acceptNotSet = true)
DEBUG org.apache.torque.generator.outlet.OutletImpl - Executing outlet newline on element
properties
DEBUG org.apache.torque.generator.outlet.OutletImpl - mergepoint() : End for mergepoint fields
DEBUG org.apache.torque.generator.outlet.OutletImpl - mergepoint() : Start for mergepoint
methods
DEBUG org.apache.torque.generator.outlet.OutletImpl - mergepoint() : Executing action (ApplyAction:
path = ., outlet = constructor, acceptNotSet = true)
DEBUG org.apache.torque.generator.outlet.OutletImpl - Executing outlet constructor on element
properties
DEBUG org.apache.torque.generator.template.velocity.VelocityOutlet - Start executing VelocityOutlet
constructor
DEBUG org.apache.torque.generator.template.velocity.VelocityOutlet - Put options in context
[]
DEBUG org.apache.torque.generator.template.velocity.VelocityOutlet - Put attributes in context
[]
DEBUG org.apache.torque.generator.template.velocity.VelocityOutlet - Put variables in context
[]
DEBUG org.apache.torque.generator.configuration.DirectoryConfigurationProvider - Reading template
file: '<https://builds.apache.org/job/Torque4-trunk/ws/torque4-trunk/torque-ant-tasks/src/test/torqueGeneratorTaskTest/src/main/torque-gen/templates/constructor.vm'>
DEBUG org.apache.torque.generator.template.velocity.VelocityOutlet - End executing VelocityOutlet
constructor
DEBUG org.apache.torque.generator.outlet.OutletImpl - mergepoint() : End for mergepoint methods
DEBUG org.apache.torque.generator.outlet.OutletImpl - mergepoint() : Executing action (ApplyAction:
path = ., outlet = newline, acceptNotSet = true)
DEBUG org.apache.torque.generator.outlet.OutletImpl - Executing outlet newline on element
properties
DEBUG org.apache.torque.generator.outlet.OutletImpl - mergepoint() : End for mergepoint methods
DEBUG org.apache.torque.generator.outlet.OutletImpl - mergepoint() : Executing action (ApplyAction:
path = ., outlet = getKey, acceptNotSet = true)
DEBUG org.apache.torque.generator.outlet.OutletImpl - Executing outlet getKey on element properties
DEBUG org.apache.torque.generator.template.velocity.VelocityOutlet - Start executing VelocityOutlet
getKey
DEBUG org.apache.torque.generator.template.velocity.VelocityOutlet - Put options in context
[]
DEBUG org.apache.torque.generator.template.velocity.VelocityOutlet - Put attributes in context
[]
DEBUG org.apache.torque.generator.template.velocity.VelocityOutlet - Put variables in context
[]
DEBUG org.apache.torque.generator.configuration.DirectoryConfigurationProvider - Reading template
file: '<https://builds.apache.org/job/Torque4-trunk/ws/torque4-trunk/torque-ant-tasks/src/test/torqueGeneratorTaskTest/src/main/torque-gen/templates/getKey.vm'>
DEBUG org.apache.torque.generator.template.velocity.VelocityOutlet - End executing VelocityOutlet
getKey
DEBUG org.apache.torque.generator.outlet.OutletImpl - mergepoint() : End for mergepoint methods
DEBUG org.apache.torque.generator.outlet.OutletImpl - mergepoint() : Executing action (ApplyAction:
path = ., outlet = newline, acceptNotSet = true)
DEBUG org.apache.torque.generator.outlet.OutletImpl - Executing outlet newline on element
properties
DEBUG org.apache.torque.generator.outlet.OutletImpl - mergepoint() : End for mergepoint methods
DEBUG org.apache.torque.generator.outlet.OutletImpl - mergepoint() : Executing action (ApplyAction:
path = ., outlet = toString, acceptNotSet = true)
DEBUG org.apache.torque.generator.outlet.OutletImpl - Executing outlet toString on element
properties
DEBUG org.apache.torque.generator.template.velocity.VelocityOutlet - Start executing VelocityOutlet
toString
DEBUG org.apache.torque.generator.template.velocity.VelocityOutlet - Put options in context
[]
DEBUG org.apache.torque.generator.template.velocity.VelocityOutlet - Put attributes in context
[]
DEBUG org.apache.torque.generator.template.velocity.VelocityOutlet - Put variables in context
[]
DEBUG org.apache.torque.generator.configuration.DirectoryConfigurationProvider - Reading template
file: '<https://builds.apache.org/job/Torque4-trunk/ws/torque4-trunk/torque-ant-tasks/src/test/torqueGeneratorTaskTest/src/main/torque-gen/templates/toString.vm'>
DEBUG org.apache.torque.generator.template.velocity.VelocityOutlet - End executing VelocityOutlet
toString
DEBUG org.apache.torque.generator.outlet.OutletImpl - mergepoint() : End for mergepoint methods
DEBUG org.apache.torque.generator.template.velocity.VelocityOutlet - End executing VelocityOutlet
classFrame
DEBUG org.apache.torque.generator.control.Controller - End generation of Output File target/tests/torqueGeneratorTaskTest/org/apache/torque/ant/PropertyKeys.java
Generation successful
Tests run: 1, Failures: 0, Errors: 0, Skipped: 0, Time elapsed: 0.764 sec

Results :

Tests run: 1, Failures: 0, Errors: 0, Skipped: 0

Cobertura: Loaded information on 2 classes.
Cobertura: Saved information on 2 classes.
[JENKINS] Recording test results
[INFO] [cobertura:cobertura {execution: default-cli}]
[INFO] Cobertura 1.9.2 - GNU GPL License (NO WARRANTY) - See COPYRIGHT file
Cobertura: Loaded information on 2 classes.
Report time: 226ms

[INFO] Cobertura Report generation was successful.
[INFO] Cobertura 1.9.2 - GNU GPL License (NO WARRANTY) - See COPYRIGHT file
Cobertura: Loaded information on 2 classes.
Report time: 179ms

[INFO] Cobertura Report generation was successful.
[INFO] [findbugs:findbugs {execution: default-cli}]
[INFO] Fork Value is true
[INFO] Done FindBugs Analysis....
[FINDBUGS] Finding all files that match the pattern findbugsXml.xml
[FINDBUGS] Parsing 1 files in <https://builds.apache.org/job/Torque4-trunk/ws/torque4-trunk/torque-ant-tasks/target>
[FINDBUGS] Successfully parsed file <https://builds.apache.org/job/Torque4-trunk/ws/torque4-trunk/torque-ant-tasks/target/findbugsXml.xml>
of module Torque Generator Ant tasks with 0 warnings.
[FINDBUGS] Computing warning deltas based on reference build #334
[INFO] [checkstyle:checkstyle {execution: default-cli}]
[INFO] 
[INFO] There are 1 checkstyle errors.
[CHECKSTYLE] Finding all files that match the pattern checkstyle-result.xml
[CHECKSTYLE] Parsing 1 files in <https://builds.apache.org/job/Torque4-trunk/ws/torque4-trunk/torque-ant-tasks/target>
[CHECKSTYLE] Successfully parsed file <https://builds.apache.org/job/Torque4-trunk/ws/torque4-trunk/torque-ant-tasks/target/checkstyle-result.xml>
of module Torque Generator Ant tasks with 4 warnings.
[CHECKSTYLE] Computing warning deltas based on reference build #334
[INFO] [pmd:pmd {execution: default-cli}]
[PMD] Finding all files that match the pattern pmd.xml
[PMD] Parsing 1 files in <https://builds.apache.org/job/Torque4-trunk/ws/torque4-trunk/torque-ant-tasks/target>
[PMD] Successfully parsed file <https://builds.apache.org/job/Torque4-trunk/ws/torque4-trunk/torque-ant-tasks/target/pmd.xml>
of module Torque Generator Ant tasks with 0 warnings.
[PMD] Computing warning deltas based on reference build #334
[INFO] [pmd:cpd {execution: default-cli}]
[DRY] Finding all files that match the pattern cpd.xml
[DRY] Parsing 1 files in <https://builds.apache.org/job/Torque4-trunk/ws/torque4-trunk/torque-ant-tasks/target>
[DRY] Successfully parsed file <https://builds.apache.org/job/Torque4-trunk/ws/torque4-trunk/torque-ant-tasks/target/cpd.xml>
of module Torque Generator Ant tasks with 0 warnings.
[DRY] Computing warning deltas based on reference build #334
[INFO] ------------------------------------------------------------------------
[INFO] Building Torque Site
[INFO]    task-segment: [clean, install, cobertura:cobertura, findbugs:findbugs, checkstyle:checkstyle,
pmd:pmd, pmd:cpd]
[INFO] ------------------------------------------------------------------------
[INFO] [clean:clean {execution: default-clean}]
[INFO] [remote-resources:process {execution: default}]
[INFO] [site:attach-descriptor {execution: default-attach-descriptor}]
[INFO] Preparing source:jar
[WARNING] Removing: jar from forked lifecycle, to prevent recursive invocation.
[INFO] No goals needed for project - skipping
[INFO] [source:jar {execution: default}]
[INFO] [apache-rat:check {execution: default}]
[INFO] Exclude: velocity.log
[INFO] Exclude: .checkstyle
[INFO] Exclude: checkstyle-cache.ccf
[INFO] Exclude: derby.log
[INFO] Exclude: LICENSE-EDL.txt
[INFO] Exclude: DEPENDENCIES
[INFO] Exclude: torque-test/target/**/*
[INFO] Exclude: torque-test/.classpath
[INFO] Exclude: torque-test/.project
[INFO] Exclude: torque-test/.settings/**
[INFO] Exclude: torque-test/src/main/generated-java/**/*
[CHECKSTYLE] No report found for mojo check
[PMD] No report found for mojo check[INFO] [install:install {execution: default-install}]
[INFO] Installing <https://builds.apache.org/job/Torque4-trunk/ws/torque4-trunk/torque-site/pom.xml>
to /home/jenkins/jenkins-slave/maven-repositories/1/org/apache/torque/torque-site/4.0-beta2-SNAPSHOT/torque-site-4.0-beta2-SNAPSHOT.pom
[INFO] Installing <https://builds.apache.org/job/Torque4-trunk/ws/torque4-trunk/torque-site/target/torque-site-4.0-beta2-SNAPSHOT-site.xml>
to /home/jenkins/jenkins-slave/maven-repositories/1/org/apache/torque/torque-site/4.0-beta2-SNAPSHOT/torque-site-4.0-beta2-SNAPSHOT-site.xml
[INFO] Preparing cobertura:cobertura

[JENKINS] Archiving <https://builds.apache.org/job/Torque4-trunk/ws/torque4-trunk/torque-site/pom.xml>
to /home/hudson/hudson/jobs/Torque4-trunk/modules/org.apache.torque$torque-site/builds/2012-10-24_12-16-56/archive/org.apache.torque/torque-site/4.0-beta2-SNAPSHOT/torque-site-4.0-beta2-SNAPSHOT.pom
[JENKINS] Archiving <https://builds.apache.org/job/Torque4-trunk/ws/torque4-trunk/torque-site/target/torque-site-4.0-beta2-SNAPSHOT-site.xml>
to /home/hudson/hudson/jobs/Torque4-trunk/modules/org.apache.torque$torque-site/builds/2012-10-24_12-16-56/archive/org.apache.torque/torque-site/4.0-beta2-SNAPSHOT/torque-site-4.0-beta2-SNAPSHOT-site.xml
[INFO] [remote-resources:process {execution: default}]
[INFO] [cobertura:instrument {execution: default-instrument}]
[INFO] Not executing cobertura:instrument as the project is not a Java classpath-capable package
[INFO] [cobertura:cobertura {execution: default-cli}]
[INFO] Not executing cobertura:report as the cobertura data file (<https://builds.apache.org/job/Torque4-trunk/ws/torque4-trunk/torque-site/target/cobertura/cobertura.ser)>
could not be found
[INFO] [findbugs:findbugs {execution: default-cli}]
[FINDBUGS] No report found for mojo findbugs[INFO] [checkstyle:checkstyle {execution: default-cli}]
[INFO] Source directory does not exist - skipping report.

[CHECKSTYLE] No report found for mojo checkstyle[INFO] [pmd:pmd {execution: default-cli}]

[PMD] No report found for mojo pmd[INFO] [pmd:cpd {execution: default-cli}]

[DRY] No report found for mojo cpd
[INFO] 
[INFO] 
[INFO] ------------------------------------------------------------------------
[INFO] Reactor Summary:
[INFO] ------------------------------------------------------------------------
[INFO] Torque Maven Parent ................................... SUCCESS [41.120s]
[INFO] Torque Runtime ........................................ SUCCESS [3:19.816s]
[INFO] Torque Generator ...................................... SUCCESS [1:16.941s]
[INFO] Torque Templates ...................................... SUCCESS [57.606s]
[INFO] Torque Generator Maven 2 Plugin ....................... SUCCESS [25.454s]
[INFO] Torque Generator Ant tasks ............................ SUCCESS [20.700s]
[INFO] Torque Site ........................................... SUCCESS [3.831s]
[INFO] ------------------------------------------------------------------------
[INFO] ------------------------------------------------------------------------
[INFO] BUILD SUCCESSFUL
[INFO] ------------------------------------------------------------------------
[INFO] Total time: 7 minutes 28 seconds
[INFO] Finished at: Wed Oct 24 12:24:58 UTC 2012
[INFO] Final Memory: 151M/393M
[INFO] ------------------------------------------------------------------------
channel stopped
Publishing Cobertura coverage report...
FATAL: Unable to find coverage results
hudson.util.IOException2: remote file operation failed: <https://builds.apache.org/job/Torque4-trunk/ws/torque4-trunk>
at hudson.remoting.Channel@5f82ce70:ubuntu4
	at hudson.FilePath.act(FilePath.java:838)
	at hudson.FilePath.act(FilePath.java:824)
	at hudson.plugins.cobertura.CoberturaPublisher.perform(CoberturaPublisher.java:335)
	at hudson.tasks.BuildStepMonitor$3.perform(BuildStepMonitor.java:36)
	at hudson.model.AbstractBuild$AbstractBuildExecution.perform(AbstractBuild.java:717)
	at hudson.model.AbstractBuild$AbstractBuildExecution.performAllBuildSteps(AbstractBuild.java:692)
	at hudson.maven.MavenModuleSetBuild$MavenModuleSetBuildExecution.post2(MavenModuleSetBuild.java:994)
	at hudson.model.AbstractBuild$AbstractBuildExecution.post(AbstractBuild.java:639)
	at hudson.model.Run.execute(Run.java:1527)
	at hudson.maven.MavenModuleSetBuild.run(MavenModuleSetBuild.java:477)
	at hudson.model.ResourceController.execute(ResourceController.java:88)
	at hudson.model.Executor.run(Executor.java:236)
Caused by: java.io.IOException: Unable to serialize hudson.FilePath$FileCallableWrapper@3a8f46da
	at hudson.remoting.UserRequest.serialize(UserRequest.java:166)
	at hudson.remoting.UserRequest.<init>(UserRequest.java:62)
	at hudson.remoting.Channel.call(Channel.java:663)
	at hudson.FilePath.act(FilePath.java:831)
	... 11 more
Caused by: java.io.NotSerializableException: hudson.plugins.cobertura.CoberturaPublisher
	at java.io.ObjectOutputStream.writeObject0(ObjectOutputStream.java:1180)
	at java.io.ObjectOutputStream.defaultWriteFields(ObjectOutputStream.java:1528)
	at java.io.ObjectOutputStream.writeSerialData(ObjectOutputStream.java:1493)
	at java.io.ObjectOutputStream.writeOrdinaryObject(ObjectOutputStream.java:1416)
	at java.io.ObjectOutputStream.writeObject0(ObjectOutputStream.java:1174)
	at java.io.ObjectOutputStream.defaultWriteFields(ObjectOutputStream.java:1528)
	at java.io.ObjectOutputStream.writeSerialData(ObjectOutputStream.java:1493)
	at java.io.ObjectOutputStream.writeOrdinaryObject(ObjectOutputStream.java:1416)
	at java.io.ObjectOutputStream.writeObject0(ObjectOutputStream.java:1174)
	at java.io.ObjectOutputStream.writeObject(ObjectOutputStream.java:346)
	at hudson.remoting.UserRequest._serialize(UserRequest.java:155)
	at hudson.remoting.UserRequest.serialize(UserRequest.java:164)
	... 14 more
No coverage results were found using the pattern 'torque-*/target/site/cobertura/coverage.xml'
relative to '<https://builds.apache.org/job/Torque4-trunk/ws/torque4-trunk'.>  Did you
enter a pattern relative to the correct directory?  Did you generate the XML report(s) for
Cobertura?
Build step 'Publish Cobertura Coverage Report' changed build result to FAILURE

---------------------------------------------------------------------
To unsubscribe, e-mail: torque-dev-unsubscribe@db.apache.org
For additional commands, e-mail: torque-dev-help@db.apache.org


Mime
View raw message