db-torque-dev mailing list archives

Site index · List index
Message view « Date » · « Thread »
Top « Date » · « Thread »
From Apache Jenkins Server <jenk...@builds.apache.org>
Subject Build failed in Jenkins: torque4-test-project-derby #243
Date Sun, 09 Sep 2012 12:15:29 GMT
See <https://builds.apache.org/job/torque4-test-project-derby/243/>

------------------------------------------
[...truncated 2320 lines...]
	at org.apache.commons.dbcp.cpdsadapter.ConnectionImpl.prepareStatement(ConnectionImpl.java:95)
	at org.apache.torque.util.BasePeerImpl.doDelete(BasePeerImpl.java:433)
	... 24 more
Caused by: ERROR 42X05: Table/View 'BOOK' does not exist.
	at org.apache.derby.iapi.error.StandardException.newException(Unknown Source)
	at org.apache.derby.impl.sql.compile.FromBaseTable.bindTableDescriptor(Unknown Source)
	at org.apache.derby.impl.sql.compile.FromBaseTable.bindNonVTITables(Unknown Source)
	at org.apache.derby.impl.sql.compile.FromList.bindTables(Unknown Source)
	at org.apache.derby.impl.sql.compile.SelectNode.bindNonVTITables(Unknown Source)
	at org.apache.derby.impl.sql.compile.DMLStatementNode.bindTables(Unknown Source)
	at org.apache.derby.impl.sql.compile.DeleteNode.bindStatement(Unknown Source)
	at org.apache.derby.impl.sql.GenericStatement.prepMinion(Unknown Source)
	at org.apache.derby.impl.sql.GenericStatement.prepare(Unknown Source)
	at org.apache.derby.impl.sql.conn.GenericLanguageConnectionContext.prepareInternalStatement(Unknown
Source)
	... 33 more
org.apache.torque.TorqueException: java.sql.SQLException: Table/View 'BOOK' does not exist.
	at org.apache.torque.util.BasePeerImpl.doDelete(BasePeerImpl.java:454)
	at org.apache.torque.util.BasePeerImpl.doDelete(BasePeerImpl.java:365)
	at org.apache.torque.test.BaseBookPeer.doDelete(BaseBookPeer.java:795)
	at org.apache.torque.DocsTest.setUp(DocsTest.java:76)
	at junit.framework.TestCase.runBare(TestCase.java:125)
	at junit.framework.TestResult$1.protect(TestResult.java:106)
	at junit.framework.TestResult.runProtected(TestResult.java:124)
	at junit.framework.TestResult.run(TestResult.java:109)
	at junit.framework.TestCase.run(TestCase.java:118)
	at junit.framework.TestSuite.runTest(TestSuite.java:208)
	at junit.framework.TestSuite.run(TestSuite.java:203)
	at sun.reflect.NativeMethodAccessorImpl.invoke0(Native Method)
	at sun.reflect.NativeMethodAccessorImpl.invoke(NativeMethodAccessorImpl.java:39)
	at sun.reflect.DelegatingMethodAccessorImpl.invoke(DelegatingMethodAccessorImpl.java:25)
	at java.lang.reflect.Method.invoke(Method.java:592)
	at org.apache.maven.surefire.junit.JUnitTestSet.execute(JUnitTestSet.java:213)
	at org.apache.maven.surefire.suite.AbstractDirectoryTestSuite.executeTestSet(AbstractDirectoryTestSuite.java:115)
	at org.apache.maven.surefire.suite.AbstractDirectoryTestSuite.execute(AbstractDirectoryTestSuite.java:140)
	at org.apache.maven.surefire.Surefire.run(Surefire.java:109)
	at sun.reflect.NativeMethodAccessorImpl.invoke0(Native Method)
	at sun.reflect.NativeMethodAccessorImpl.invoke(NativeMethodAccessorImpl.java:39)
	at sun.reflect.DelegatingMethodAccessorImpl.invoke(DelegatingMethodAccessorImpl.java:25)
	at java.lang.reflect.Method.invoke(Method.java:592)
	at org.apache.maven.surefire.booter.SurefireBooter.runSuitesInProcess(SurefireBooter.java:290)
	at org.apache.maven.surefire.booter.SurefireBooter.main(SurefireBooter.java:1017)
Caused by: java.sql.SQLException: Table/View 'BOOK' does not exist.
	at org.apache.derby.impl.jdbc.SQLExceptionFactory.getSQLException(Unknown Source)
	at org.apache.derby.impl.jdbc.Util.generateCsSQLException(Unknown Source)
	at org.apache.derby.impl.jdbc.TransactionResourceImpl.wrapInSQLException(Unknown Source)
	at org.apache.derby.impl.jdbc.TransactionResourceImpl.handleException(Unknown Source)
	at org.apache.derby.impl.jdbc.EmbedConnection.handleException(Unknown Source)
	at org.apache.derby.impl.jdbc.ConnectionChild.handleException(Unknown Source)
	at org.apache.derby.impl.jdbc.EmbedPreparedStatement.<init>(Unknown Source)
	at org.apache.derby.impl.jdbc.EmbedPreparedStatement20.<init>(Unknown Source)
	at org.apache.derby.impl.jdbc.EmbedPreparedStatement30.<init>(Unknown Source)
	at org.apache.derby.jdbc.Driver30.newEmbedPreparedStatement(Unknown Source)
	at org.apache.derby.impl.jdbc.EmbedConnection.prepareStatement(Unknown Source)
	at org.apache.derby.impl.jdbc.EmbedConnection.prepareStatement(Unknown Source)
	at org.apache.commons.dbcp.cpdsadapter.PooledConnectionImpl.prepareStatement(PooledConnectionImpl.java:243)
	at org.apache.commons.dbcp.cpdsadapter.ConnectionImpl.prepareStatement(ConnectionImpl.java:95)
	at org.apache.torque.util.BasePeerImpl.doDelete(BasePeerImpl.java:433)
	... 24 more
Caused by: ERROR 42X05: Table/View 'BOOK' does not exist.
	at org.apache.derby.iapi.error.StandardException.newException(Unknown Source)
	at org.apache.derby.impl.sql.compile.FromBaseTable.bindTableDescriptor(Unknown Source)
	at org.apache.derby.impl.sql.compile.FromBaseTable.bindNonVTITables(Unknown Source)
	at org.apache.derby.impl.sql.compile.FromList.bindTables(Unknown Source)
	at org.apache.derby.impl.sql.compile.SelectNode.bindNonVTITables(Unknown Source)
	at org.apache.derby.impl.sql.compile.DMLStatementNode.bindTables(Unknown Source)
	at org.apache.derby.impl.sql.compile.DeleteNode.bindStatement(Unknown Source)
	at org.apache.derby.impl.sql.GenericStatement.prepMinion(Unknown Source)
	at org.apache.derby.impl.sql.GenericStatement.prepare(Unknown Source)
	at org.apache.derby.impl.sql.conn.GenericLanguageConnectionContext.prepareInternalStatement(Unknown
Source)
	... 33 more
Tests run: 5, Failures: 5, Errors: 0, Skipped: 0, Time elapsed: 1.607 sec <<< FAILURE!
Running org.apache.torque.util.LargeSelectTest
Tests run: 9, Failures: 0, Errors: 9, Skipped: 0, Time elapsed: 1.635 sec <<< FAILURE!
Running org.apache.torque.generated.dataobject.SaveTest
Tests run: 8, Failures: 0, Errors: 8, Skipped: 0, Time elapsed: 1.591 sec <<< FAILURE!
Running org.apache.torque.generated.peer.WhereClauseSubselectTest
Tests run: 5, Failures: 0, Errors: 5, Skipped: 0, Time elapsed: 1.558 sec <<< FAILURE!
Running org.apache.torque.generated.peer.ImplInitialisationTest
Tests run: 1, Failures: 0, Errors: 0, Skipped: 0, Time elapsed: 1.5 sec
Running org.apache.torque.DataTest
Tests run: 26, Failures: 0, Errors: 23, Skipped: 0, Time elapsed: 1.679 sec <<< FAILURE!
Running org.apache.torque.map.DatabaseMapTest
Tests run: 10, Failures: 0, Errors: 0, Skipped: 0, Time elapsed: 1.523 sec
Running org.apache.torque.datatypes.BitTest
Tests run: 6, Failures: 0, Errors: 0, Skipped: 0, Time elapsed: 0.489 sec
Running org.apache.torque.generated.peer.DefaultValuesFromDatabaseTest
Tests run: 8, Failures: 0, Errors: 6, Skipped: 0, Time elapsed: 1.546 sec <<< FAILURE!
Running org.apache.torque.generated.dataobject.ForeignKeyGetterTest
Tests run: 12, Failures: 0, Errors: 0, Skipped: 0, Time elapsed: 0.627 sec
Running org.apache.torque.JndiConfigurationTest
Tests run: 3, Failures: 0, Errors: 2, Skipped: 0, Time elapsed: 1.488 sec <<< FAILURE!
Running org.apache.torque.generated.peer.DateTest
Tests run: 14, Failures: 0, Errors: 14, Skipped: 0, Time elapsed: 1.613 sec <<< FAILURE!
Running org.apache.torque.generated.peer.DefaultValuesFromJavaTest
Tests run: 9, Failures: 0, Errors: 0, Skipped: 0, Time elapsed: 1.52 sec
Running org.apache.torque.adapter.AdapterTest
Tests run: 1, Failures: 0, Errors: 1, Skipped: 0, Time elapsed: 1.56 sec <<< FAILURE!
Running org.apache.torque.generated.peer.SelectFunctionTest
Tests run: 8, Failures: 0, Errors: 8, Skipped: 0, Time elapsed: 1.579 sec <<< FAILURE!
Running org.apache.torque.datatypes.BooleanIntCharTest
Tests run: 30, Failures: 0, Errors: 28, Skipped: 0, Time elapsed: 1.713 sec <<< FAILURE!
Running org.apache.torque.generated.peer.FillerTest
Tests run: 17, Failures: 0, Errors: 17, Skipped: 0, Time elapsed: 1.671 sec <<< FAILURE!
Running org.apache.torque.generated.peer.SelectInTest
Tests run: 6, Failures: 0, Errors: 6, Skipped: 0, Time elapsed: 1.597 sec <<< FAILURE!
Running org.apache.torque.generated.dataobject.ForeignKeyAdderTest
Tests run: 10, Failures: 0, Errors: 0, Skipped: 0, Time elapsed: 0.641 sec
Running org.apache.torque.om.OMByNameMethodsTest
Tests run: 7, Failures: 0, Errors: 0, Skipped: 0, Time elapsed: 0.973 sec
Running org.apache.torque.InitShutdownTest
Tests run: 2, Failures: 0, Errors: 2, Skipped: 0, Time elapsed: 1.529 sec <<< FAILURE!
Running org.apache.torque.generated.peer.SaveMethodsInPeerTest
Tests run: 2, Failures: 0, Errors: 2, Skipped: 0, Time elapsed: 1.573 sec <<< FAILURE!
Running org.apache.torque.util.SummaryHelperTest
Tests run: 2, Failures: 0, Errors: 2, Skipped: 0, Time elapsed: 1.572 sec <<< FAILURE!
Running org.apache.torque.generated.peer.SelectTest
Tests run: 7, Failures: 0, Errors: 7, Skipped: 0, Time elapsed: 1.604 sec <<< FAILURE!
Running org.apache.torque.generated.dataobject.ViewTest
Tests run: 1, Failures: 0, Errors: 1, Skipped: 0, Time elapsed: 1.547 sec <<< FAILURE!
Running org.apache.torque.generated.peer.GetRelatedObjectsTest
Tests run: 5, Failures: 0, Errors: 5, Skipped: 0, Time elapsed: 1.587 sec <<< FAILURE!
Running org.apache.torque.util.BasePeerTest
Tests run: 1, Failures: 0, Errors: 1, Skipped: 0, Time elapsed: 1.567 sec <<< FAILURE!
Running org.apache.torque.sql.SkipSqlTest
Tests run: 1, Failures: 0, Errors: 0, Skipped: 0, Time elapsed: 1.201 sec
Running org.apache.torque.avalon.AvalonMapBuildersTest
[DEBUG] Starting container...
[DEBUG] Loading the service container class org.apache.fulcrum.yaafi.framework.container.ServiceContainerImpl
[DEBUG] Instantiating the service container class org.apache.fulcrum.yaafi.framework.container.ServiceContainerImpl
[DEBUG] Setting applicationRootDir to <https://builds.apache.org/job/torque4-test-project-derby/ws/>
[DEBUG] Service Framework is starting up
[DEBUG] Using the following applicationRootDir : <https://builds.apache.org/job/torque4-test-project-derby/ws/>
[DEBUG] Using the following tempRootDir : /tmp
[DEBUG] Looking for src/test/resources/TestComponentConfig.xml in the application directory
[DEBUG] Successfully located src/test/resources/TestComponentConfig.xml
[DEBUG] Looking for src/test/resources/TestRoleConfig.xml in the application directory
[DEBUG] Successfully located src/test/resources/TestRoleConfig.xml
[DEBUG] Looking for /parameters.properties as absolute file location
[DEBUG] Looking for /parameters.properties using the class loader
[WARNING] Unable to locate /parameters.properties
[DEBUG] Loading the implementation class for TorqueComponent
[DEBUG] Instantiating the implementation class for TorqueComponent
[DEBUG] Incarnating the service TorqueComponent
[DEBUG] LogEnabled.enableLogging() for TorqueComponent
[DEBUG] Contextualizable.contextualize() for TorqueComponent
[DEBUG] Configurable.configure() for TorqueComponent
[DEBUG] configure(TorqueComponent::<no value>:@null:20:22)
[DEBUG] Config File changes to src/test/resources/TurbineResources.properties
[DEBUG] Config File is <https://builds.apache.org/job/torque4-test-project-derby/ws/src/test/resources/TurbineResources.properties>
[DEBUG] Initializable.initialize() for TorqueComponent
[DEBUG] initialize()
[DEBUG] Service Framework is up and running
[INFO] YaffiContainer ready.
[DEBUG] Disposing of container...
[INFO] Disposing all services
[DEBUG] Decommisioning the service TorqueComponent
[DEBUG] Disposable.dispose() for TorqueComponent
[DEBUG] dispose()
[DEBUG] All services are disposed
[INFO] YaffiContainer has been disposed.
Tests run: 1, Failures: 0, Errors: 0, Skipped: 0, Time elapsed: 1.16 sec
Running org.apache.torque.generated.peer.DeleteTest
Tests run: 14, Failures: 0, Errors: 13, Skipped: 0, Time elapsed: 1.645 sec <<< FAILURE!
Running org.apache.torque.generated.peer.JoinTest
Tests run: 12, Failures: 0, Errors: 12, Skipped: 0, Time elapsed: 1.592 sec <<< FAILURE!

Results :

Failed tests: 

Tests in error: 
  testLeftJoins(org.apache.torque.generated.peer.JoinTest)
  testInnerJoins(org.apache.torque.generated.peer.JoinTest)
  testImplicitInnerJoins(org.apache.torque.generated.peer.JoinTest)
  testRightJoins(org.apache.torque.generated.peer.JoinTest)
  testInnerJoinsOtherComparator(org.apache.torque.generated.peer.JoinTest)
  testDoubleJoinWithAliases(org.apache.torque.generated.peer.JoinTest)
  testReverseJoin(org.apache.torque.generated.peer.JoinTest)
  testImplicitInnerJoinWithSubselect(org.apache.torque.generated.peer.JoinTest)
  testImplicitInnerJoinTwoConditions(org.apache.torque.generated.peer.JoinTest)
  testExplicitInnerJoinTwoConditions(org.apache.torque.generated.peer.JoinTest)
  testDoSelectJoinY(org.apache.torque.generated.peer.JoinTest)
  testDoSelectJoinAllExceptY(org.apache.torque.generated.peer.JoinTest)

Tests run: 247, Failures: 5, Errors: 176, Skipped: 0

[ERROR] There are test failures.

Please refer to <https://builds.apache.org/job/torque4-test-project-derby/ws/target/surefire-reports>
for the individual test results.
[JENKINS] Archiving <https://builds.apache.org/job/torque4-test-project-derby/ws/pom.xml>
to /home/hudson/hudson/jobs/torque4-test-project-derby/modules/org.apache.torque$torque-test/builds/2012-09-09_12-13-29/archive/org.apache.torque/torque-test/4.0-beta1-SNAPSHOT/torque-test-4.0-beta1-SNAPSHOT.pom
[INFO] ------------------------------------------------------------------------
[ERROR] FATAL ERROR
[INFO] ------------------------------------------------------------------------
[INFO] Failed to load hudson.maven.reporters.Messages
Illegal exception table handler in class file hudson/maven/reporters/Messages
[INFO] ------------------------------------------------------------------------
[INFO] Trace
java.lang.ClassFormatError: Failed to load hudson.maven.reporters.Messages
	at hudson.remoting.RemoteClassLoader.loadClassFile(RemoteClassLoader.java:154)
	at hudson.remoting.RemoteClassLoader.findClass(RemoteClassLoader.java:131)
	at java.lang.ClassLoader.loadClass(ClassLoader.java:307)
	at java.lang.ClassLoader.loadClass(ClassLoader.java:252)
	at java.lang.ClassLoader.loadClassInternal(ClassLoader.java:320)
	at hudson.maven.reporters.SurefireArchiver.postExecute(SurefireArchiver.java:108)
	at hudson.maven.Maven2Builder.postExecute(Maven2Builder.java:155)
	at hudson.maven.MavenBuilder$Adapter.postExecute(MavenBuilder.java:310)
	at hudson.maven.agent.PluginManagerInterceptor$1MojoIntercepterImpl.callPost(PluginManagerInterceptor.java:170)
	at hudson.maven.agent.PluginManagerInterceptor.executeMojo(PluginManagerInterceptor.java:183)
	at org.apache.maven.lifecycle.DefaultLifecycleExecutor.executeGoals(DefaultLifecycleExecutor.java:694)
	at org.apache.maven.lifecycle.DefaultLifecycleExecutor.executeGoalWithLifecycle(DefaultLifecycleExecutor.java:556)
	at org.apache.maven.lifecycle.DefaultLifecycleExecutor.executeGoal(DefaultLifecycleExecutor.java:535)
	at org.apache.maven.lifecycle.DefaultLifecycleExecutor.executeGoalAndHandleFailures(DefaultLifecycleExecutor.java:387)
	at org.apache.maven.lifecycle.DefaultLifecycleExecutor.executeTaskSegments(DefaultLifecycleExecutor.java:348)
	at org.apache.maven.lifecycle.DefaultLifecycleExecutor.execute(DefaultLifecycleExecutor.java:180)
	at org.apache.maven.lifecycle.LifecycleExecutorInterceptor.execute(LifecycleExecutorInterceptor.java:65)
	at org.apache.maven.DefaultMaven.doExecute(DefaultMaven.java:328)
	at org.apache.maven.DefaultMaven.execute(DefaultMaven.java:138)
	at org.apache.maven.cli.MavenCli.main(MavenCli.java:362)
	at sun.reflect.NativeMethodAccessorImpl.invoke0(Native Method)
	at sun.reflect.NativeMethodAccessorImpl.invoke(NativeMethodAccessorImpl.java:39)
	at sun.reflect.DelegatingMethodAccessorImpl.invoke(DelegatingMethodAccessorImpl.java:25)
	at java.lang.reflect.Method.invoke(Method.java:592)
	at org.codehaus.classworlds.Launcher.launchEnhanced(Launcher.java:315)
	at org.codehaus.classworlds.Launcher.launch(Launcher.java:255)
	at hudson.maven.agent.Main.launch(Main.java:185)
	at hudson.maven.MavenBuilder.call(MavenBuilder.java:151)
	at hudson.maven.Maven2Builder.call(Maven2Builder.java:77)
	at hudson.maven.Maven2Builder.call(Maven2Builder.java:53)
	at hudson.remoting.UserRequest.perform(UserRequest.java:118)
	at hudson.remoting.UserRequest.perform(UserRequest.java:48)
	at hudson.remoting.Request$2.run(Request.java:326)
	at hudson.remoting.InterceptingExecutorService$1.call(InterceptingExecutorService.java:72)
	at java.util.concurrent.FutureTask$Sync.innerRun(FutureTask.java:269)
	at java.util.concurrent.FutureTask.run(FutureTask.java:123)
	at java.util.concurrent.ThreadPoolExecutor$Worker.runTask(ThreadPoolExecutor.java:651)
	at java.util.concurrent.ThreadPoolExecutor$Worker.run(ThreadPoolExecutor.java:676)
	at java.lang.Thread.run(Thread.java:595)
Caused by: java.lang.ClassFormatError: Illegal exception table handler in class file hudson/maven/reporters/Messages
	at java.lang.ClassLoader.defineClass1(Native Method)
	at java.lang.ClassLoader.defineClass(ClassLoader.java:621)
	at java.lang.ClassLoader.defineClass(ClassLoader.java:466)
	at hudson.remoting.RemoteClassLoader.loadClassFile(RemoteClassLoader.java:152)
	... 38 more
[INFO] ------------------------------------------------------------------------
[INFO] Total time: 1 minute 36 seconds
[INFO] Finished at: Sun Sep 09 12:15:28 UTC 2012
[INFO] Final Memory: 49M/320M
[INFO] ------------------------------------------------------------------------
channel stopped

---------------------------------------------------------------------
To unsubscribe, e-mail: torque-dev-unsubscribe@db.apache.org
For additional commands, e-mail: torque-dev-help@db.apache.org


Mime
View raw message