db-torque-dev mailing list archives

Site index · List index
Message view « Date » · « Thread »
Top « Date » · « Thread »
From Apache Jenkins Server <jenk...@builds.apache.org>
Subject Build failed in Jenkins: torque4-test-project-derby #248
Date Tue, 11 Sep 2012 08:39:44 GMT
See <https://builds.apache.org/job/torque4-test-project-derby/248/>

------------------------------------------
[...truncated 2329 lines...]
[ERROR] Failed to execute:  drop table multi_ref_same_table
[ERROR] java.sql.SQLException: 'DROP TABLE' cannot be performed on 'MULTI_REF_SAME_TABLE'
because it does not exist.
[ERROR] Failed to execute:  drop table types_object
[ERROR] java.sql.SQLException: 'DROP TABLE' cannot be performed on 'TYPES_OBJECT' because
it does not exist.
[ERROR] Failed to execute:  drop table types_primitive
[ERROR] java.sql.SQLException: 'DROP TABLE' cannot be performed on 'TYPES_PRIMITIVE' because
it does not exist.
[ERROR] Failed to execute:  drop table SUMMARIZE1
[ERROR] java.sql.SQLException: 'DROP TABLE' cannot be performed on 'SUMMARIZE1' because it
does not exist.
[ERROR] Failed to execute:  drop table ABSTRACT
[ERROR] java.sql.SQLException: 'DROP TABLE' cannot be performed on 'ABSTRACT' because it does
not exist.
[ERROR] Failed to execute:  
 
 
 
 ALTER TABLE course_number
 ADD CONSTRAINT course_number_FK_1
 FOREIGN KEY (course_id)
 REFERENCES course (id)
 ON UPDATE cascade
 ON DELETE cascade
[ERROR] java.sql.SQLException: Syntax error: Encountered "cascade" at line 9, column 12.
[ERROR] Failed to execute:  ALTER TABLE reference_to_included
 ADD CONSTRAINT reference_to_included_FK_1
 FOREIGN KEY (included_id)
 REFERENCES included (id)
[ERROR] java.sql.SQLException: Constraint 'REFERENCE_TO_INCLUDED_FK_1' is invalid: referenced
table INCLUDED does not exist.
[ERROR] Failed to execute:  ALTER TABLE reference_to_included
 ADD CONSTRAINT reference_to_included_FK_2
 FOREIGN KEY (included_from_included_id)
 REFERENCES included_from_included (id)
[ERROR] java.sql.SQLException: Constraint 'REFERENCE_TO_INCLUDED_FK_2' is invalid: referenced
table INCLUDED_FROM_INCLUDED does not exist.
[ERROR] Failed to execute:  ALTER TABLE ext_schema
 ADD CONSTRAINT ext_schema_FK_1
 FOREIGN KEY (ext_id)
 REFERENCES ext (ext_id)
[ERROR] java.sql.SQLException: Constraint 'EXT_SCHEMA_FK_1' is invalid: referenced table EXT
does not exist.
[ERROR] Failed to execute:  ALTER TABLE extext_schema
 ADD CONSTRAINT extext_schema_FK_1
 FOREIGN KEY (extext_id)
 REFERENCES extext (extext_id)
[ERROR] java.sql.SQLException: Constraint 'EXTEXT_SCHEMA_FK_1' is invalid: referenced table
EXTEXT does not exist.
[INFO] Executing file: <https://builds.apache.org/job/torque4-test-project-derby/ws/target/generated-sql/types-schema.sql>
[ERROR] Failed to execute:  
 
 drop table bit_value
[ERROR] java.sql.SQLException: 'DROP TABLE' cannot be performed on 'BIT_VALUE' because it
does not exist.
[ERROR] Failed to execute:  drop table blob_test
[ERROR] java.sql.SQLException: 'DROP TABLE' cannot be performed on 'BLOB_TEST' because it
does not exist.
[ERROR] Failed to execute:  drop table clob_test
[ERROR] java.sql.SQLException: 'DROP TABLE' cannot be performed on 'CLOB_TEST' because it
does not exist.
[ERROR] Failed to execute:  drop table bint_bchar_value
[ERROR] java.sql.SQLException: 'DROP TABLE' cannot be performed on 'BINT_BCHAR_VALUE' because
it does not exist.
[ERROR] Failed to execute:  drop table DATE_TIME_TIMESTAMP
[ERROR] java.sql.SQLException: 'DROP TABLE' cannot be performed on 'DATE_TIME_TIMESTAMP' because
it does not exist.
[INFO] 120 of 255 SQL statements executed successfully
[INFO] [sql:execute {execution: execute-idtable-sql}]
[INFO] Executing file: <https://builds.apache.org/job/torque4-test-project-derby/ws/target/generated-sql/bookstore-schema-idtable-init.sql>
[INFO] Executing file: <https://builds.apache.org/job/torque4-test-project-derby/ws/target/generated-sql/databaseMapInit-schema-idtable-init.sql>
[INFO] Executing file: <https://builds.apache.org/job/torque4-test-project-derby/ws/target/generated-sql/default-value-schema-idtable-init.sql>
[INFO] Executing file: <https://builds.apache.org/job/torque4-test-project-derby/ws/target/generated-sql/ext-schema-idtable-init.sql>
[INFO] Executing file: <https://builds.apache.org/job/torque4-test-project-derby/ws/target/generated-sql/extext-schema-idtable-init.sql>
[INFO] Executing file: <https://builds.apache.org/job/torque4-test-project-derby/ws/target/generated-sql/foreign-key-schema-idtable-init.sql>
[INFO] Executing file: <https://builds.apache.org/job/torque4-test-project-derby/ws/target/generated-sql/included-from-included-schema-idtable-init.sql>
[INFO] Executing file: <https://builds.apache.org/job/torque4-test-project-derby/ws/target/generated-sql/included-schema-idtable-init.sql>
[INFO] Executing file: <https://builds.apache.org/job/torque4-test-project-derby/ws/target/generated-sql/pk-schema-idtable-init.sql>
[ERROR] Failed to execute:  insert into ID_TABLE (id_table_id, table_name, next_id, quantity)
VALUES (143, 'VARCHAR_PK', 1000, 10)
[ERROR] java.sql.SQLException: The statement was aborted because it would have caused a duplicate
key value in a unique or primary key constraint or unique index identified by 'ID_TABLE_UQ_1'
defined on 'ID_TABLE'.
[INFO] Executing file: <https://builds.apache.org/job/torque4-test-project-derby/ws/target/generated-sql/save-method-in-peer-schema-idtable-init.sql>
[INFO] Executing file: <https://builds.apache.org/job/torque4-test-project-derby/ws/target/generated-sql/test-schema-idtable-init.sql>
[INFO] Executing file: <https://builds.apache.org/job/torque4-test-project-derby/ws/target/generated-sql/types-schema-idtable-init.sql>
[INFO] 86 of 87 SQL statements executed successfully
[INFO] [sql:execute {execution: shutdown-db-after-ddl}]
[debug] execute contextualize
[INFO] [resources:testResources {execution: default-testResources}]
[INFO] Using 'ISO-8859-1' encoding to copy filtered resources.
[INFO] Copying 6 resources
[INFO] Copying 3 resources
[INFO] [compiler:testCompile {execution: default-testCompile}]
[INFO] Compiling 38 source files to <https://builds.apache.org/job/torque4-test-project-derby/ws/target/test-classes>
[WARNING] DEPRECATED [systemProperties]: Use systemPropertyVariables instead.
[INFO] [surefire:test {execution: default-test}]
[INFO] Surefire report directory: <https://builds.apache.org/job/torque4-test-project-derby/ws/target/surefire-reports>

-------------------------------------------------------
 T E S T S
-------------------------------------------------------
Running org.apache.torque.oid.IDBrokerTest
Tests run: 4, Failures: 0, Errors: 0, Skipped: 0, Time elapsed: 2.989 sec
Running org.apache.torque.DocsTest
Tests run: 5, Failures: 0, Errors: 0, Skipped: 0, Time elapsed: 3.041 sec
Running org.apache.torque.util.LargeSelectTest
Tests run: 9, Failures: 0, Errors: 0, Skipped: 0, Time elapsed: 6.488 sec
Running org.apache.torque.generated.dataobject.SaveTest
Tests run: 8, Failures: 0, Errors: 0, Skipped: 0, Time elapsed: 4.648 sec
Running org.apache.torque.generated.peer.WhereClauseSubselectTest
Tests run: 5, Failures: 0, Errors: 0, Skipped: 0, Time elapsed: 3.483 sec
Running org.apache.torque.generated.peer.ImplInitialisationTest
Tests run: 1, Failures: 0, Errors: 0, Skipped: 0, Time elapsed: 1.71 sec
Running org.apache.torque.DataTest
Tests run: 26, Failures: 0, Errors: 0, Skipped: 0, Time elapsed: 3.224 sec
Running org.apache.torque.map.DatabaseMapTest
Tests run: 10, Failures: 0, Errors: 0, Skipped: 0, Time elapsed: 2.487 sec
Running org.apache.torque.datatypes.BitTest
Tests run: 6, Failures: 0, Errors: 0, Skipped: 0, Time elapsed: 0.543 sec
Running org.apache.torque.generated.peer.DefaultValuesFromDatabaseTest
Tests run: 8, Failures: 0, Errors: 0, Skipped: 0, Time elapsed: 2.47 sec
Running org.apache.torque.generated.dataobject.ForeignKeyGetterTest
Tests run: 12, Failures: 0, Errors: 0, Skipped: 0, Time elapsed: 0.641 sec
Running org.apache.torque.JndiConfigurationTest
Tests run: 3, Failures: 0, Errors: 0, Skipped: 0, Time elapsed: 1.915 sec
Running org.apache.torque.generated.peer.DateTest
Tests run: 14, Failures: 0, Errors: 0, Skipped: 0, Time elapsed: 2.015 sec
Running org.apache.torque.generated.peer.DefaultValuesFromJavaTest
Tests run: 9, Failures: 0, Errors: 0, Skipped: 0, Time elapsed: 4.143 sec
Running org.apache.torque.adapter.AdapterTest
Tests run: 1, Failures: 0, Errors: 0, Skipped: 0, Time elapsed: 2.237 sec
Running org.apache.torque.generated.peer.SelectFunctionTest
Tests run: 8, Failures: 0, Errors: 0, Skipped: 0, Time elapsed: 2.079 sec
Running org.apache.torque.datatypes.BooleanIntCharTest
Tests run: 30, Failures: 0, Errors: 0, Skipped: 0, Time elapsed: 2.43 sec
Running org.apache.torque.generated.peer.FillerTest
Tests run: 17, Failures: 0, Errors: 0, Skipped: 0, Time elapsed: 11.213 sec
Running org.apache.torque.generated.peer.SelectInTest
Tests run: 6, Failures: 0, Errors: 0, Skipped: 0, Time elapsed: 5.023 sec
Running org.apache.torque.generated.dataobject.ForeignKeyAdderTest
Tests run: 10, Failures: 0, Errors: 0, Skipped: 0, Time elapsed: 0.64 sec
Running org.apache.torque.om.OMByNameMethodsTest
Tests run: 7, Failures: 0, Errors: 0, Skipped: 0, Time elapsed: 1.035 sec
Running org.apache.torque.InitShutdownTest
Tests run: 2, Failures: 0, Errors: 0, Skipped: 0, Time elapsed: 3.315 sec
Running org.apache.torque.generated.peer.SaveMethodsInPeerTest
Tests run: 2, Failures: 0, Errors: 0, Skipped: 0, Time elapsed: 3.055 sec
Running org.apache.torque.util.SummaryHelperTest
Tests run: 2, Failures: 0, Errors: 0, Skipped: 0, Time elapsed: 2.006 sec
Running org.apache.torque.generated.peer.SelectTest
Tests run: 7, Failures: 0, Errors: 0, Skipped: 0, Time elapsed: 5.596 sec
Running org.apache.torque.generated.dataobject.ViewTest
Tests run: 1, Failures: 0, Errors: 0, Skipped: 0, Time elapsed: 3.737 sec
Running org.apache.torque.generated.peer.GetRelatedObjectsTest
Tests run: 5, Failures: 0, Errors: 0, Skipped: 0, Time elapsed: 5.353 sec
Running org.apache.torque.util.BasePeerTest
Tests run: 1, Failures: 0, Errors: 0, Skipped: 0, Time elapsed: 3.544 sec
Running org.apache.torque.sql.SkipSqlTest
Tests run: 1, Failures: 0, Errors: 0, Skipped: 0, Time elapsed: 1.489 sec
Running org.apache.torque.avalon.AvalonMapBuildersTest
[DEBUG] Starting container...
[DEBUG] Loading the service container class org.apache.fulcrum.yaafi.framework.container.ServiceContainerImpl
[DEBUG] Instantiating the service container class org.apache.fulcrum.yaafi.framework.container.ServiceContainerImpl
[DEBUG] Setting applicationRootDir to <https://builds.apache.org/job/torque4-test-project-derby/ws/>
[DEBUG] Service Framework is starting up
[DEBUG] Using the following applicationRootDir : <https://builds.apache.org/job/torque4-test-project-derby/ws/>
[DEBUG] Using the following tempRootDir : /tmp
[DEBUG] Looking for src/test/resources/TestComponentConfig.xml in the application directory
[DEBUG] Successfully located src/test/resources/TestComponentConfig.xml
[DEBUG] Looking for src/test/resources/TestRoleConfig.xml in the application directory
[DEBUG] Successfully located src/test/resources/TestRoleConfig.xml
[DEBUG] Looking for /parameters.properties as absolute file location
[DEBUG] Looking for /parameters.properties using the class loader
[WARNING] Unable to locate /parameters.properties
[DEBUG] Loading the implementation class for TorqueComponent
[DEBUG] Instantiating the implementation class for TorqueComponent
[DEBUG] Incarnating the service TorqueComponent
[DEBUG] LogEnabled.enableLogging() for TorqueComponent
[DEBUG] Contextualizable.contextualize() for TorqueComponent
[DEBUG] Configurable.configure() for TorqueComponent
[DEBUG] configure(TorqueComponent::<no value>:@null:20:22)
[DEBUG] Config File changes to src/test/resources/TurbineResources.properties
[DEBUG] Config File is <https://builds.apache.org/job/torque4-test-project-derby/ws/src/test/resources/TurbineResources.properties>
[DEBUG] Initializable.initialize() for TorqueComponent
[DEBUG] initialize()
[DEBUG] Service Framework is up and running
[INFO] YaffiContainer ready.
[DEBUG] Disposing of container...
[INFO] Disposing all services
[DEBUG] Decommisioning the service TorqueComponent
[DEBUG] Disposable.dispose() for TorqueComponent
[DEBUG] dispose()
[DEBUG] All services are disposed
[INFO] YaffiContainer has been disposed.
Tests run: 1, Failures: 0, Errors: 0, Skipped: 0, Time elapsed: 1.203 sec
Running org.apache.torque.generated.peer.DeleteTest
Tests run: 14, Failures: 0, Errors: 0, Skipped: 0, Time elapsed: 3.622 sec
Running org.apache.torque.generated.peer.JoinTest
Tests run: 12, Failures: 0, Errors: 0, Skipped: 0, Time elapsed: 3.052 sec

Results :

Tests run: 247, Failures: 0, Errors: 0, Skipped: 0

[JENKINS] Archiving <https://builds.apache.org/job/torque4-test-project-derby/ws/pom.xml>
to /home/hudson/hudson/jobs/torque4-test-project-derby/modules/org.apache.torque$torque-test/builds/2012-09-11_08-36-35/archive/org.apache.torque/torque-test/4.0-beta1-SNAPSHOT/torque-test-4.0-beta1-SNAPSHOT.pom
[INFO] ------------------------------------------------------------------------
[ERROR] FATAL ERROR
[INFO] ------------------------------------------------------------------------
[INFO] Failed to load hudson.maven.reporters.Messages
Illegal exception table range in class file hudson/maven/reporters/Messages
[INFO] ------------------------------------------------------------------------
[INFO] Trace
java.lang.ClassFormatError: Failed to load hudson.maven.reporters.Messages
	at hudson.remoting.RemoteClassLoader.loadClassFile(RemoteClassLoader.java:154)
	at hudson.remoting.RemoteClassLoader.findClass(RemoteClassLoader.java:131)
	at java.lang.ClassLoader.loadClass(ClassLoader.java:307)
	at java.lang.ClassLoader.loadClass(ClassLoader.java:252)
	at java.lang.ClassLoader.loadClassInternal(ClassLoader.java:320)
	at hudson.maven.reporters.SurefireArchiver.postExecute(SurefireArchiver.java:108)
	at hudson.maven.Maven2Builder.postExecute(Maven2Builder.java:155)
	at hudson.maven.MavenBuilder$Adapter.postExecute(MavenBuilder.java:310)
	at hudson.maven.agent.PluginManagerInterceptor$1MojoIntercepterImpl.callPost(PluginManagerInterceptor.java:170)
	at hudson.maven.agent.PluginManagerInterceptor.executeMojo(PluginManagerInterceptor.java:183)
	at org.apache.maven.lifecycle.DefaultLifecycleExecutor.executeGoals(DefaultLifecycleExecutor.java:694)
	at org.apache.maven.lifecycle.DefaultLifecycleExecutor.executeGoalWithLifecycle(DefaultLifecycleExecutor.java:556)
	at org.apache.maven.lifecycle.DefaultLifecycleExecutor.executeGoal(DefaultLifecycleExecutor.java:535)
	at org.apache.maven.lifecycle.DefaultLifecycleExecutor.executeGoalAndHandleFailures(DefaultLifecycleExecutor.java:387)
	at org.apache.maven.lifecycle.DefaultLifecycleExecutor.executeTaskSegments(DefaultLifecycleExecutor.java:348)
	at org.apache.maven.lifecycle.DefaultLifecycleExecutor.execute(DefaultLifecycleExecutor.java:180)
	at org.apache.maven.lifecycle.LifecycleExecutorInterceptor.execute(LifecycleExecutorInterceptor.java:65)
	at org.apache.maven.DefaultMaven.doExecute(DefaultMaven.java:328)
	at org.apache.maven.DefaultMaven.execute(DefaultMaven.java:138)
	at org.apache.maven.cli.MavenCli.main(MavenCli.java:362)
	at sun.reflect.NativeMethodAccessorImpl.invoke0(Native Method)
	at sun.reflect.NativeMethodAccessorImpl.invoke(NativeMethodAccessorImpl.java:39)
	at sun.reflect.DelegatingMethodAccessorImpl.invoke(DelegatingMethodAccessorImpl.java:25)
	at java.lang.reflect.Method.invoke(Method.java:592)
	at org.codehaus.classworlds.Launcher.launchEnhanced(Launcher.java:315)
	at org.codehaus.classworlds.Launcher.launch(Launcher.java:255)
	at hudson.maven.agent.Main.launch(Main.java:185)
	at hudson.maven.MavenBuilder.call(MavenBuilder.java:151)
	at hudson.maven.Maven2Builder.call(Maven2Builder.java:77)
	at hudson.maven.Maven2Builder.call(Maven2Builder.java:53)
	at hudson.remoting.UserRequest.perform(UserRequest.java:118)
	at hudson.remoting.UserRequest.perform(UserRequest.java:48)
	at hudson.remoting.Request$2.run(Request.java:326)
	at hudson.remoting.InterceptingExecutorService$1.call(InterceptingExecutorService.java:72)
	at java.util.concurrent.FutureTask$Sync.innerRun(FutureTask.java:269)
	at java.util.concurrent.FutureTask.run(FutureTask.java:123)
	at java.util.concurrent.ThreadPoolExecutor$Worker.runTask(ThreadPoolExecutor.java:651)
	at java.util.concurrent.ThreadPoolExecutor$Worker.run(ThreadPoolExecutor.java:676)
	at java.lang.Thread.run(Thread.java:595)
Caused by: java.lang.ClassFormatError: Illegal exception table range in class file hudson/maven/reporters/Messages
	at java.lang.ClassLoader.defineClass1(Native Method)
	at java.lang.ClassLoader.defineClass(ClassLoader.java:621)
	at java.lang.ClassLoader.defineClass(ClassLoader.java:466)
	at hudson.remoting.RemoteClassLoader.loadClassFile(RemoteClassLoader.java:152)
	... 38 more
[INFO] ------------------------------------------------------------------------
[INFO] Total time: 2 minutes 42 seconds
[INFO] Finished at: Tue Sep 11 08:39:42 UTC 2012
[INFO] Final Memory: 55M/323M
[INFO] ------------------------------------------------------------------------
channel stopped

---------------------------------------------------------------------
To unsubscribe, e-mail: torque-dev-unsubscribe@db.apache.org
For additional commands, e-mail: torque-dev-help@db.apache.org


Mime
View raw message