db-torque-dev mailing list archives

Site index · List index
Message view « Date » · « Thread »
Top « Date » · « Thread »
From Apache Jenkins Server <jenk...@builds.apache.org>
Subject Build failed in Jenkins: torque4-test-project-derby » Torque Test Project #229
Date Sun, 26 Aug 2012 04:22:17 GMT
See <https://builds.apache.org/job/torque4-test-project-derby/org.apache.torque$torque-test/229/>

------------------------------------------
<===[JENKINS REMOTING CAPACITY]===>channel started
   log4j:WARN No appenders could be found for logger (org.apache.commons.beanutils.converters.BooleanConverter).
log4j:WARN Please initialize the log4j system properly.
Executing Maven:  -B -f <https://builds.apache.org/job/torque4-test-project-derby/org.apache.torque$torque-test/ws/pom.xml>
-Dmaven.repo.local=/home/jenkins/jenkins-slave/maven-repositories/1 -PderbyEmbedded clean
test
[INFO] Scanning for projects...
[INFO] ------------------------------------------------------------------------
[INFO] Building Torque Test Project
[INFO]    task-segment: [clean, test]
[INFO] ------------------------------------------------------------------------
[INFO] snapshot org.apache.torque:torque-maven-plugin:4.0-beta1-SNAPSHOT: checking for updates
from apache.snapshots
[INFO] [clean:clean {execution: default-clean}]
[INFO] snapshot org.apache.torque:torque-runtime:4.0-beta1-SNAPSHOT: checking for updates
from apache.snapshots
[WARNING] DEPRECATED [tasks]: Use target instead
[INFO] [antrun:run {execution: clean-generated-sources}]
[WARNING] Parameter tasks is deprecated, use target instead
[INFO] Executing tasks

main:
     [echo] Deleting directory src/main/generated-java
     [echo] Deleting directory target/torque
[INFO] Executed tasks
[WARNING] DEPRECATED [tasks]: Use target instead
[INFO] [antrun:run {execution: filter-schema}]
[WARNING] Parameter tasks is deprecated, use target instead
[INFO] Executing tasks

main:
     [copy] Copying 14 files to <https://builds.apache.org/job/torque4-test-project-derby/org.apache.torque$torque-test/ws/target/torque/test/schema>
     [copy] Copying 2 files to <https://builds.apache.org/job/torque4-test-project-derby/org.apache.torque$torque-test/ws/target/torque/test/sql>
[INFO] Executed tasks
[INFO] snapshot org.apache.torque:torque-templates:4.0-beta1-SNAPSHOT: checking for updates
from apache.snapshots
[INFO] snapshot org.apache.torque:torque-generator:4.0-beta1-SNAPSHOT: checking for updates
from apache.snapshots
[INFO] [torque:generate {execution: generate-sources}]
INFO  org.apache.torque.generator.control.Controller - readConfiguration() : Starting to read
configuration files
[ERROR] 
org.apache.torque.generator.configuration.ConfigurationException: Error parsing controller
Configuration org/apache/torque/templates/om/conf/control.xmlError  while instantiating a
source transformer : The constructor of class org.apache.torque.templates.transformer.om.mapInit.DatabaseMapInitTransformer
could not be called
	at org.apache.torque.generator.configuration.controller.ControlConfigurationXmlParser.readControllerConfiguration(ControlConfigurationXmlParser.java:137)
	at org.apache.torque.generator.configuration.UnitConfigurationReader.readControlConfiguration(UnitConfigurationReader.java:319)
	at org.apache.torque.generator.configuration.UnitConfigurationReader.read(UnitConfigurationReader.java:101)
	at org.apache.torque.generator.configuration.UnitConfigurationReader.read(UnitConfigurationReader.java:135)
	at org.apache.torque.generator.configuration.Configuration.read(Configuration.java:130)
	at org.apache.torque.generator.control.Controller.readConfiguration(Controller.java:155)
	at org.apache.torque.generator.control.Controller.run(Controller.java:104)
	at org.apache.torque.generator.maven.TorqueGeneratorMojo.execute(TorqueGeneratorMojo.java:643)
	at org.apache.maven.plugin.DefaultPluginManager.executeMojo(DefaultPluginManager.java:490)
	at hudson.maven.agent.PluginManagerInterceptor.executeMojo(PluginManagerInterceptor.java:182)
	at org.apache.maven.lifecycle.DefaultLifecycleExecutor.executeGoals(DefaultLifecycleExecutor.java:694)
	at org.apache.maven.lifecycle.DefaultLifecycleExecutor.executeGoalWithLifecycle(DefaultLifecycleExecutor.java:556)
	at org.apache.maven.lifecycle.DefaultLifecycleExecutor.executeGoal(DefaultLifecycleExecutor.java:535)
	at org.apache.maven.lifecycle.DefaultLifecycleExecutor.executeGoalAndHandleFailures(DefaultLifecycleExecutor.java:387)
	at org.apache.maven.lifecycle.DefaultLifecycleExecutor.executeTaskSegments(DefaultLifecycleExecutor.java:348)
	at org.apache.maven.lifecycle.DefaultLifecycleExecutor.execute(DefaultLifecycleExecutor.java:180)
	at org.apache.maven.lifecycle.LifecycleExecutorInterceptor.execute(LifecycleExecutorInterceptor.java:65)
	at org.apache.maven.DefaultMaven.doExecute(DefaultMaven.java:328)
	at org.apache.maven.DefaultMaven.execute(DefaultMaven.java:138)
	at org.apache.maven.cli.MavenCli.main(MavenCli.java:362)
	at sun.reflect.NativeMethodAccessorImpl.invoke0(Native Method)
	at sun.reflect.NativeMethodAccessorImpl.invoke(NativeMethodAccessorImpl.java:39)
	at sun.reflect.DelegatingMethodAccessorImpl.invoke(DelegatingMethodAccessorImpl.java:25)
	at java.lang.reflect.Method.invoke(Method.java:592)
	at org.codehaus.classworlds.Launcher.launchEnhanced(Launcher.java:315)
	at org.codehaus.classworlds.Launcher.launch(Launcher.java:255)
	at hudson.maven.agent.Main.launch(Main.java:185)
	at hudson.maven.MavenBuilder.call(MavenBuilder.java:151)
	at hudson.maven.Maven2Builder.call(Maven2Builder.java:77)
	at hudson.maven.Maven2Builder.call(Maven2Builder.java:53)
	at hudson.remoting.UserRequest.perform(UserRequest.java:118)
	at hudson.remoting.UserRequest.perform(UserRequest.java:48)
	at hudson.remoting.Request$2.run(Request.java:326)
	at hudson.remoting.InterceptingExecutorService$1.call(InterceptingExecutorService.java:72)
	at java.util.concurrent.FutureTask$Sync.innerRun(FutureTask.java:269)
	at java.util.concurrent.FutureTask.run(FutureTask.java:123)
	at java.util.concurrent.ThreadPoolExecutor$Worker.runTask(ThreadPoolExecutor.java:651)
	at java.util.concurrent.ThreadPoolExecutor$Worker.run(ThreadPoolExecutor.java:676)
	at java.lang.Thread.run(Thread.java:595)
Caused by: java.lang.reflect.InvocationTargetException
	at org.apache.torque.generator.configuration.source.SourceTransformerSaxHandler.createJavaSourceTransformer(SourceTransformerSaxHandler.java:373)
	at org.apache.torque.generator.configuration.source.SourceTransformerSaxHandler.startElement(SourceTransformerSaxHandler.java:133)
	at org.apache.torque.generator.configuration.source.SourceSaxHandler.startElement(SourceSaxHandler.java:124)
	at org.apache.torque.generator.configuration.source.FileSourceSaxHandler.startElement(FileSourceSaxHandler.java:125)
	at org.apache.torque.generator.configuration.controller.OutputSaxHandler.startElement(OutputSaxHandler.java:163)
	at org.apache.torque.generator.configuration.controller.ControlConfigurationSaxHandler.startElement(ControlConfigurationSaxHandler.java:142)
	at org.apache.xerces.parsers.AbstractSAXParser.startElement(Unknown Source)
	at org.apache.xerces.parsers.AbstractXMLDocumentParser.emptyElement(Unknown Source)
	at org.apache.xerces.impl.xs.XMLSchemaValidator.emptyElement(Unknown Source)
	at org.apache.xerces.impl.XMLNSDocumentScannerImpl.scanStartElement(Unknown Source)
	at org.apache.xerces.impl.XMLDocumentFragmentScannerImpl$FragmentContentDispatcher.dispatch(Unknown
Source)
	at org.apache.xerces.impl.XMLDocumentFragmentScannerImpl.scanDocument(Unknown Source)
	at org.apache.xerces.parsers.XML11Configuration.parse(Unknown Source)
	at org.apache.xerces.parsers.XML11Configuration.parse(Unknown Source)
	at org.apache.xerces.parsers.XMLParser.parse(Unknown Source)
	at org.apache.xerces.parsers.AbstractSAXParser.parse(Unknown Source)
	at org.apache.xerces.jaxp.SAXParserImpl$JAXPSAXParser.parse(Unknown Source)
	at org.apache.xerces.jaxp.SAXParserImpl.parse(Unknown Source)
	at org.apache.torque.generator.configuration.controller.ControlConfigurationXmlParser.readControllerConfiguration(ControlConfigurationXmlParser.java:112)
	... 38 more
Caused by: java.lang.reflect.InvocationTargetException
	at sun.reflect.NativeConstructorAccessorImpl.newInstance0(Native Method)
	at sun.reflect.NativeConstructorAccessorImpl.newInstance(NativeConstructorAccessorImpl.java:39)
	at sun.reflect.DelegatingConstructorAccessorImpl.newInstance(DelegatingConstructorAccessorImpl.java:27)
	at java.lang.reflect.Constructor.newInstance(Constructor.java:501)
	at org.apache.torque.generator.configuration.source.SourceTransformerSaxHandler.createJavaSourceTransformer(SourceTransformerSaxHandler.java:344)
	... 56 more
Caused by: java.lang.NullPointerException
	at java.io.Reader.<init>(Reader.java:61)
	at java.io.InputStreamReader.<init>(InputStreamReader.java:80)
	at org.apache.torque.templates.transformer.om.mapInit.DatabaseMapInitTransformer.getTransformerProperties(DatabaseMapInitTransformer.java:94)
	at org.apache.torque.templates.transformer.om.mapInit.DatabaseMapInitTransformer.<init>(DatabaseMapInitTransformer.java:82)
	... 61 more
[JENKINS] Archiving <https://builds.apache.org/job/torque4-test-project-derby/org.apache.torque$torque-test/ws/pom.xml>
to /home/hudson/hudson/jobs/torque4-test-project-derby/modules/org.apache.torque$torque-test/builds/2012-08-26_04-21-27/archive/org.apache.torque/torque-test/4.0-beta1-SNAPSHOT/torque-test-4.0-beta1-SNAPSHOT.pom
[INFO] ------------------------------------------------------------------------
[ERROR] BUILD ERROR
[INFO] ------------------------------------------------------------------------
[INFO] Error parsing controller Configuration org/apache/torque/templates/om/conf/control.xmlError
 while instantiating a source transformer : The constructor of class org.apache.torque.templates.transformer.om.mapInit.DatabaseMapInitTransformer
could not be called
[INFO] ------------------------------------------------------------------------
[INFO] For more information, run Maven with the -e switch
[INFO] ------------------------------------------------------------------------
[INFO] Total time: 22 seconds
[INFO] Finished at: Sun Aug 26 04:22:17 UTC 2012
[INFO] Final Memory: 26M/309M
[INFO] ------------------------------------------------------------------------
Waiting for Jenkins to finish collecting data

---------------------------------------------------------------------
To unsubscribe, e-mail: torque-dev-unsubscribe@db.apache.org
For additional commands, e-mail: torque-dev-help@db.apache.org


Mime
View raw message