db-torque-dev mailing list archives

Site index · List index
Message view « Date » · « Thread »
Top « Date » · « Thread »
From Apache Jenkins Server <jenk...@builds.apache.org>
Subject Build failed in Jenkins: torque4-test-project-derby » Torque Test Project #215
Date Mon, 20 Aug 2012 03:59:02 GMT
See <https://builds.apache.org/job/torque4-test-project-derby/org.apache.torque$torque-test/215/>

------------------------------------------
[...truncated 2442 lines...]

[ERROR] <https://builds.apache.org/job/torque4-test-project-derby/org.apache.torque$torque-test/ws/src/test/java/org/apache/torque/DataTest.java>:[435,16]
cannot find symbol
symbol  : method doSelect(org.apache.torque.criteria.Criteria,org.apache.torque.om.mapper.IntegerMapper)
location: class org.apache.torque.util.BasePeer

[ERROR] <https://builds.apache.org/job/torque4-test-project-derby/org.apache.torque$torque-test/ws/src/test/java/org/apache/torque/DataTest.java>:[448,16]
cannot find symbol
symbol  : method doSelect(org.apache.torque.criteria.Criteria,org.apache.torque.om.mapper.IntegerMapper)
location: class org.apache.torque.util.BasePeer

[ERROR] <https://builds.apache.org/job/torque4-test-project-derby/org.apache.torque$torque-test/ws/src/test/java/org/apache/torque/DataTest.java>:[872,16]
cannot find symbol
symbol  : method doSelect(org.apache.torque.criteria.Criteria,org.apache.torque.DataTest.DoNothingMapper)
location: class org.apache.torque.util.BasePeer

[ERROR] <https://builds.apache.org/job/torque4-test-project-derby/org.apache.torque$torque-test/ws/src/test/java/org/apache/torque/DataTest.java>:[910,26]
cannot find symbol
symbol  : method doSelect(org.apache.torque.criteria.Criteria,org.apache.torque.om.mapper.CompositeMapper)
location: class org.apache.torque.test.BookPeer

[ERROR] <https://builds.apache.org/job/torque4-test-project-derby/org.apache.torque$torque-test/ws/src/test/java/org/apache/torque/datatypes/BooleanIntCharTest.java>:[472,16]
cannot find symbol
symbol  : method correctBooleans(org.apache.torque.criteria.Criteria)
location: class org.apache.torque.util.BasePeer

[ERROR] <https://builds.apache.org/job/torque4-test-project-derby/org.apache.torque$torque-test/ws/src/test/java/org/apache/torque/datatypes/BooleanIntCharTest.java>:[498,36]
cannot find symbol
symbol  : constructor ColumnValues()
location: class org.apache.torque.util.ColumnValues

[ERROR] <https://builds.apache.org/job/torque4-test-project-derby/org.apache.torque$torque-test/ws/src/test/java/org/apache/torque/datatypes/BooleanIntCharTest.java>:[536,36]
cannot find symbol
symbol  : constructor ColumnValues()
location: class org.apache.torque.util.ColumnValues

[ERROR] <https://builds.apache.org/job/torque4-test-project-derby/org.apache.torque$torque-test/ws/src/test/java/org/apache/torque/datatypes/BooleanIntCharTest.java>:[574,36]
cannot find symbol
symbol  : constructor ColumnValues()
location: class org.apache.torque.util.ColumnValues

[ERROR] <https://builds.apache.org/job/torque4-test-project-derby/org.apache.torque$torque-test/ws/src/test/java/org/apache/torque/datatypes/BooleanIntCharTest.java>:[612,36]
cannot find symbol
symbol  : constructor ColumnValues()
location: class org.apache.torque.util.ColumnValues

[ERROR] <https://builds.apache.org/job/torque4-test-project-derby/org.apache.torque$torque-test/ws/src/test/java/org/apache/torque/datatypes/BooleanIntCharTest.java>:[650,36]
cannot find symbol
symbol  : constructor ColumnValues()
location: class org.apache.torque.util.ColumnValues

[ERROR] <https://builds.apache.org/job/torque4-test-project-derby/org.apache.torque$torque-test/ws/src/test/java/org/apache/torque/datatypes/BooleanIntCharTest.java>:[686,36]
cannot find symbol
symbol  : constructor ColumnValues()
location: class org.apache.torque.util.ColumnValues

[ERROR] <https://builds.apache.org/job/torque4-test-project-derby/org.apache.torque$torque-test/ws/src/test/java/org/apache/torque/datatypes/BooleanIntCharTest.java>:[722,36]
cannot find symbol
symbol  : constructor ColumnValues()
location: class org.apache.torque.util.ColumnValues

[ERROR] <https://builds.apache.org/job/torque4-test-project-derby/org.apache.torque$torque-test/ws/src/test/java/org/apache/torque/datatypes/BooleanIntCharTest.java>:[760,36]
cannot find symbol
symbol  : constructor ColumnValues()
location: class org.apache.torque.util.ColumnValues

[ERROR] <https://builds.apache.org/job/torque4-test-project-derby/org.apache.torque$torque-test/ws/src/test/java/org/apache/torque/datatypes/BooleanIntCharTest.java>:[798,36]
cannot find symbol
symbol  : constructor ColumnValues()
location: class org.apache.torque.util.ColumnValues

[ERROR] <https://builds.apache.org/job/torque4-test-project-derby/org.apache.torque$torque-test/ws/src/test/java/org/apache/torque/datatypes/BooleanIntCharTest.java>:[836,36]
cannot find symbol
symbol  : constructor ColumnValues()
location: class org.apache.torque.util.ColumnValues

[ERROR] <https://builds.apache.org/job/torque4-test-project-derby/org.apache.torque$torque-test/ws/src/test/java/org/apache/torque/datatypes/BooleanIntCharTest.java>:[874,36]
cannot find symbol
symbol  : constructor ColumnValues()
location: class org.apache.torque.util.ColumnValues

[ERROR] <https://builds.apache.org/job/torque4-test-project-derby/org.apache.torque$torque-test/ws/src/test/java/org/apache/torque/datatypes/BooleanIntCharTest.java>:[904,36]
cannot find symbol
symbol  : constructor ColumnValues()
location: class org.apache.torque.util.ColumnValues

[ERROR] <https://builds.apache.org/job/torque4-test-project-derby/org.apache.torque$torque-test/ws/src/test/java/org/apache/torque/util/LargeSelectTest.java>:[89,39]
cannot find symbol
symbol  : method doSelect(org.apache.torque.criteria.Criteria,org.apache.torque.om.mapper.IntegerMapper)
location: class org.apache.torque.util.BasePeer

[ERROR] <https://builds.apache.org/job/torque4-test-project-derby/org.apache.torque$torque-test/ws/src/test/java/org/apache/torque/generated/peer/SelectFunctionTest.java>:[72,30]
cannot find symbol
symbol  : method doSelectSingleRecord(org.apache.torque.criteria.Criteria,org.apache.torque.om.mapper.IntegerMapper)
location: class org.apache.torque.util.BasePeer

[ERROR] <https://builds.apache.org/job/torque4-test-project-derby/org.apache.torque$torque-test/ws/src/test/java/org/apache/torque/generated/peer/SelectFunctionTest.java>:[88,30]
cannot find symbol
symbol  : method doSelectSingleRecord(org.apache.torque.criteria.Criteria,org.apache.torque.om.mapper.IntegerMapper)
location: class org.apache.torque.util.BasePeer

[ERROR] <https://builds.apache.org/job/torque4-test-project-derby/org.apache.torque$torque-test/ws/src/test/java/org/apache/torque/generated/peer/SelectFunctionTest.java>:[103,38]
cannot find symbol
symbol  : method doSelectSingleRecord(org.apache.torque.criteria.Criteria,org.apache.torque.om.mapper.IntegerMapper)
location: class org.apache.torque.test.Summarize1Peer

[ERROR] <https://builds.apache.org/job/torque4-test-project-derby/org.apache.torque$torque-test/ws/src/test/java/org/apache/torque/generated/peer/SelectFunctionTest.java>:[119,32]
cannot find symbol
symbol  : method doSelectSingleRecord(org.apache.torque.criteria.Criteria,org.apache.torque.om.mapper.IntegerMapper)
location: class org.apache.torque.util.BasePeer

[ERROR] <https://builds.apache.org/job/torque4-test-project-derby/org.apache.torque$torque-test/ws/src/test/java/org/apache/torque/generated/peer/SelectFunctionTest.java>:[135,30]
cannot find symbol
symbol  : method doSelectSingleRecord(org.apache.torque.criteria.Criteria,org.apache.torque.om.mapper.IntegerMapper)
location: class org.apache.torque.util.BasePeer

[ERROR] <https://builds.apache.org/job/torque4-test-project-derby/org.apache.torque$torque-test/ws/src/test/java/org/apache/torque/generated/peer/SelectFunctionTest.java>:[151,30]
cannot find symbol
symbol  : method doSelectSingleRecord(org.apache.torque.criteria.Criteria,org.apache.torque.om.mapper.IntegerMapper)
location: class org.apache.torque.util.BasePeer

[ERROR] <https://builds.apache.org/job/torque4-test-project-derby/org.apache.torque$torque-test/ws/src/test/java/org/apache/torque/generated/peer/SelectFunctionTest.java>:[167,29]
cannot find symbol
symbol  : method doSelectSingleRecord(org.apache.torque.criteria.Criteria,org.apache.torque.om.mapper.IntegerMapper)
location: class org.apache.torque.util.BasePeer

[ERROR] <https://builds.apache.org/job/torque4-test-project-derby/org.apache.torque$torque-test/ws/src/test/java/org/apache/torque/generated/peer/SelectFunctionTest.java>:[183,29]
cannot find symbol
symbol  : method doSelectSingleRecord(org.apache.torque.criteria.Criteria,org.apache.torque.om.mapper.IntegerMapper)
location: class org.apache.torque.util.BasePeer

[ERROR] <https://builds.apache.org/job/torque4-test-project-derby/org.apache.torque$torque-test/ws/src/test/java/org/apache/torque/DocsTest.java>:[223,29]
cannot find symbol
symbol  : method doSelect(java.lang.String,org.apache.torque.om.mapper.ObjectListMapper,java.lang.String)
location: class org.apache.torque.util.BasePeer

[ERROR] <https://builds.apache.org/job/torque4-test-project-derby/org.apache.torque$torque-test/ws/src/test/java/org/apache/torque/DocsTest.java>:[246,29]
cannot find symbol
symbol  : method doSelect(java.lang.String,org.apache.torque.om.mapper.ObjectListMapper,java.lang.String)
location: class org.apache.torque.util.BasePeer

[INFO] 30 errors 
[INFO] -------------------------------------------------------------
[JENKINS] Archiving <https://builds.apache.org/job/torque4-test-project-derby/org.apache.torque$torque-test/ws/pom.xml>
to /home/hudson/hudson/jobs/torque4-test-project-derby/modules/org.apache.torque$torque-test/builds/2012-08-20_03-57-46/archive/org.apache.torque/torque-test/4.0-beta1-SNAPSHOT/torque-test-4.0-beta1-SNAPSHOT.pom
[INFO] ------------------------------------------------------------------------
[ERROR] BUILD FAILURE
[INFO] ------------------------------------------------------------------------
[INFO] Compilation failure

<https://builds.apache.org/job/torque4-test-project-derby/org.apache.torque$torque-test/ws/src/test/java/org/apache/torque/BaseDatabaseTestCase.java>:[87,39]
cannot find symbol
symbol  : method doSelect(java.lang.String,org.apache.torque.om.mapper.StringMapper,java.lang.String)
location: class org.apache.torque.util.BasePeer

<https://builds.apache.org/job/torque4-test-project-derby/org.apache.torque$torque-test/ws/src/test/java/org/apache/torque/DataTest.java>:[429,16]
cannot find symbol
symbol  : method doSelect(org.apache.torque.criteria.Criteria,org.apache.torque.om.mapper.IntegerMapper)
location: class org.apache.torque.util.BasePeer

<https://builds.apache.org/job/torque4-test-project-derby/org.apache.torque$torque-test/ws/src/test/java/org/apache/torque/DataTest.java>:[435,16]
cannot find symbol
symbol  : method doSelect(org.apache.torque.criteria.Criteria,org.apache.torque.om.mapper.IntegerMapper)
location: class org.apache.torque.util.BasePeer

<https://builds.apache.org/job/torque4-test-project-derby/org.apache.torque$torque-test/ws/src/test/java/org/apache/torque/DataTest.java>:[448,16]
cannot find symbol
symbol  : method doSelect(org.apache.torque.criteria.Criteria,org.apache.torque.om.mapper.IntegerMapper)
location: class org.apache.torque.util.BasePeer

<https://builds.apache.org/job/torque4-test-project-derby/org.apache.torque$torque-test/ws/src/test/java/org/apache/torque/DataTest.java>:[872,16]
cannot find symbol
symbol  : method doSelect(org.apache.torque.criteria.Criteria,org.apache.torque.DataTest.DoNothingMapper)
location: class org.apache.torque.util.BasePeer

<https://builds.apache.org/job/torque4-test-project-derby/org.apache.torque$torque-test/ws/src/test/java/org/apache/torque/DataTest.java>:[910,26]
cannot find symbol
symbol  : method doSelect(org.apache.torque.criteria.Criteria,org.apache.torque.om.mapper.CompositeMapper)
location: class org.apache.torque.test.BookPeer

<https://builds.apache.org/job/torque4-test-project-derby/org.apache.torque$torque-test/ws/src/test/java/org/apache/torque/datatypes/BooleanIntCharTest.java>:[472,16]
cannot find symbol
symbol  : method correctBooleans(org.apache.torque.criteria.Criteria)
location: class org.apache.torque.util.BasePeer

<https://builds.apache.org/job/torque4-test-project-derby/org.apache.torque$torque-test/ws/src/test/java/org/apache/torque/datatypes/BooleanIntCharTest.java>:[498,36]
cannot find symbol
symbol  : constructor ColumnValues()
location: class org.apache.torque.util.ColumnValues

<https://builds.apache.org/job/torque4-test-project-derby/org.apache.torque$torque-test/ws/src/test/java/org/apache/torque/datatypes/BooleanIntCharTest.java>:[536,36]
cannot find symbol
symbol  : constructor ColumnValues()
location: class org.apache.torque.util.ColumnValues

<https://builds.apache.org/job/torque4-test-project-derby/org.apache.torque$torque-test/ws/src/test/java/org/apache/torque/datatypes/BooleanIntCharTest.java>:[574,36]
cannot find symbol
symbol  : constructor ColumnValues()
location: class org.apache.torque.util.ColumnValues

<https://builds.apache.org/job/torque4-test-project-derby/org.apache.torque$torque-test/ws/src/test/java/org/apache/torque/datatypes/BooleanIntCharTest.java>:[612,36]
cannot find symbol
symbol  : constructor ColumnValues()
location: class org.apache.torque.util.ColumnValues

<https://builds.apache.org/job/torque4-test-project-derby/org.apache.torque$torque-test/ws/src/test/java/org/apache/torque/datatypes/BooleanIntCharTest.java>:[650,36]
cannot find symbol
symbol  : constructor ColumnValues()
location: class org.apache.torque.util.ColumnValues

<https://builds.apache.org/job/torque4-test-project-derby/org.apache.torque$torque-test/ws/src/test/java/org/apache/torque/datatypes/BooleanIntCharTest.java>:[686,36]
cannot find symbol
symbol  : constructor ColumnValues()
location: class org.apache.torque.util.ColumnValues

<https://builds.apache.org/job/torque4-test-project-derby/org.apache.torque$torque-test/ws/src/test/java/org/apache/torque/datatypes/BooleanIntCharTest.java>:[722,36]
cannot find symbol
symbol  : constructor ColumnValues()
location: class org.apache.torque.util.ColumnValues

<https://builds.apache.org/job/torque4-test-project-derby/org.apache.torque$torque-test/ws/src/test/java/org/apache/torque/datatypes/BooleanIntCharTest.java>:[760,36]
cannot find symbol
symbol  : constructor ColumnValues()
location: class org.apache.torque.util.ColumnValues

<https://builds.apache.org/job/torque4-test-project-derby/org.apache.torque$torque-test/ws/src/test/java/org/apache/torque/datatypes/BooleanIntCharTest.java>:[798,36]
cannot find symbol
symbol  : constructor ColumnValues()
location: class org.apache.torque.util.ColumnValues

<https://builds.apache.org/job/torque4-test-project-derby/org.apache.torque$torque-test/ws/src/test/java/org/apache/torque/datatypes/BooleanIntCharTest.java>:[836,36]
cannot find symbol
symbol  : constructor ColumnValues()
location: class org.apache.torque.util.ColumnValues

<https://builds.apache.org/job/torque4-test-project-derby/org.apache.torque$torque-test/ws/src/test/java/org/apache/torque/datatypes/BooleanIntCharTest.java>:[874,36]
cannot find symbol
symbol  : constructor ColumnValues()
location: class org.apache.torque.util.ColumnValues

<https://builds.apache.org/job/torque4-test-project-derby/org.apache.torque$torque-test/ws/src/test/java/org/apache/torque/datatypes/BooleanIntCharTest.java>:[904,36]
cannot find symbol
symbol  : constructor ColumnValues()
location: class org.apache.torque.util.ColumnValues

<https://builds.apache.org/job/torque4-test-project-derby/org.apache.torque$torque-test/ws/src/test/java/org/apache/torque/util/LargeSelectTest.java>:[89,39]
cannot find symbol
symbol  : method doSelect(org.apache.torque.criteria.Criteria,org.apache.torque.om.mapper.IntegerMapper)
location: class org.apache.torque.util.BasePeer

<https://builds.apache.org/job/torque4-test-project-derby/org.apache.torque$torque-test/ws/src/test/java/org/apache/torque/generated/peer/SelectFunctionTest.java>:[72,30]
cannot find symbol
symbol  : method doSelectSingleRecord(org.apache.torque.criteria.Criteria,org.apache.torque.om.mapper.IntegerMapper)
location: class org.apache.torque.util.BasePeer

<https://builds.apache.org/job/torque4-test-project-derby/org.apache.torque$torque-test/ws/src/test/java/org/apache/torque/generated/peer/SelectFunctionTest.java>:[88,30]
cannot find symbol
symbol  : method doSelectSingleRecord(org.apache.torque.criteria.Criteria,org.apache.torque.om.mapper.IntegerMapper)
location: class org.apache.torque.util.BasePeer

<https://builds.apache.org/job/torque4-test-project-derby/org.apache.torque$torque-test/ws/src/test/java/org/apache/torque/generated/peer/SelectFunctionTest.java>:[103,38]
cannot find symbol
symbol  : method doSelectSingleRecord(org.apache.torque.criteria.Criteria,org.apache.torque.om.mapper.IntegerMapper)
location: class org.apache.torque.test.Summarize1Peer

<https://builds.apache.org/job/torque4-test-project-derby/org.apache.torque$torque-test/ws/src/test/java/org/apache/torque/generated/peer/SelectFunctionTest.java>:[119,32]
cannot find symbol
symbol  : method doSelectSingleRecord(org.apache.torque.criteria.Criteria,org.apache.torque.om.mapper.IntegerMapper)
location: class org.apache.torque.util.BasePeer

<https://builds.apache.org/job/torque4-test-project-derby/org.apache.torque$torque-test/ws/src/test/java/org/apache/torque/generated/peer/SelectFunctionTest.java>:[135,30]
cannot find symbol
symbol  : method doSelectSingleRecord(org.apache.torque.criteria.Criteria,org.apache.torque.om.mapper.IntegerMapper)
location: class org.apache.torque.util.BasePeer

<https://builds.apache.org/job/torque4-test-project-derby/org.apache.torque$torque-test/ws/src/test/java/org/apache/torque/generated/peer/SelectFunctionTest.java>:[151,30]
cannot find symbol
symbol  : method doSelectSingleRecord(org.apache.torque.criteria.Criteria,org.apache.torque.om.mapper.IntegerMapper)
location: class org.apache.torque.util.BasePeer

<https://builds.apache.org/job/torque4-test-project-derby/org.apache.torque$torque-test/ws/src/test/java/org/apache/torque/generated/peer/SelectFunctionTest.java>:[167,29]
cannot find symbol
symbol  : method doSelectSingleRecord(org.apache.torque.criteria.Criteria,org.apache.torque.om.mapper.IntegerMapper)
location: class org.apache.torque.util.BasePeer

<https://builds.apache.org/job/torque4-test-project-derby/org.apache.torque$torque-test/ws/src/test/java/org/apache/torque/generated/peer/SelectFunctionTest.java>:[183,29]
cannot find symbol
symbol  : method doSelectSingleRecord(org.apache.torque.criteria.Criteria,org.apache.torque.om.mapper.IntegerMapper)
location: class org.apache.torque.util.BasePeer

<https://builds.apache.org/job/torque4-test-project-derby/org.apache.torque$torque-test/ws/src/test/java/org/apache/torque/DocsTest.java>:[223,29]
cannot find symbol
symbol  : method doSelect(java.lang.String,org.apache.torque.om.mapper.ObjectListMapper,java.lang.String)
location: class org.apache.torque.util.BasePeer

<https://builds.apache.org/job/torque4-test-project-derby/org.apache.torque$torque-test/ws/src/test/java/org/apache/torque/DocsTest.java>:[246,29]
cannot find symbol
symbol  : method doSelect(java.lang.String,org.apache.torque.om.mapper.ObjectListMapper,java.lang.String)
location: class org.apache.torque.util.BasePeer


[INFO] ------------------------------------------------------------------------
[INFO] For more information, run Maven with the -e switch
[INFO] ------------------------------------------------------------------------
[INFO] Total time: 44 seconds
[INFO] Finished at: Mon Aug 20 03:59:01 UTC 2012
[INFO] Final Memory: 48M/307M
[INFO] ------------------------------------------------------------------------

---------------------------------------------------------------------
To unsubscribe, e-mail: torque-dev-unsubscribe@db.apache.org
For additional commands, e-mail: torque-dev-help@db.apache.org


Mime
View raw message