db-torque-dev mailing list archives

Site index · List index
Message view « Date » · « Thread »
Top « Date » · « Thread »
From Apache Jenkins Server <jenk...@builds.apache.org>
Subject Build failed in Jenkins: Torque4-trunk » Torque Runtime #237
Date Fri, 06 Jul 2012 07:48:04 GMT
See <https://builds.apache.org/job/Torque4-trunk/org.apache.torque$torque-runtime/237/>

------------------------------------------
[INFO] ------------------------------------------------------------------------
[INFO] Building Torque Runtime
[INFO]    task-segment: [clean, install, cobertura:cobertura, findbugs:findbugs, checkstyle:checkstyle]
[INFO] ------------------------------------------------------------------------
[INFO] [clean:clean {execution: default-clean}]
[INFO] [remote-resources:process {execution: default}]
Downloading: http://repo1.maven.org/maven2/org/apache/jcs/jcs/1.3/jcs-1.3.pom
12K downloaded  (jcs-1.3.pom)
Downloading: http://repo1.maven.org/maven2/concurrent/concurrent/1.0/concurrent-1.0.pom
152b downloaded  (concurrent-1.0.pom)
Downloading: http://repo1.maven.org/maven2/org/apache/fulcrum/fulcrum-testcontainer/1.0.6/fulcrum-testcontainer-1.0.6.pom
4K downloaded  (fulcrum-testcontainer-1.0.6.pom)
Downloading: http://repo1.maven.org/maven2/org/apache/fulcrum/fulcrum-parent/1/fulcrum-parent-1.pom
18K downloaded  (fulcrum-parent-1.pom)
Downloading: http://repo1.maven.org/maven2/org/apache/fulcrum/fulcrum-yaafi/1.0.6/fulcrum-yaafi-1.0.6.pom
2K downloaded  (fulcrum-yaafi-1.0.6.pom)
Downloading: http://repo1.maven.org/maven2/org/apache/jcs/jcs/1.3/jcs-1.3.jar
Downloading: http://repo1.maven.org/maven2/org/apache/fulcrum/fulcrum-testcontainer/1.0.6/fulcrum-testcontainer-1.0.6.jar
Downloading: http://repo1.maven.org/maven2/concurrent/concurrent/1.0/concurrent-1.0.jar
247K downloaded  (concurrent-1.0.jar)
13K downloaded  (fulcrum-testcontainer-1.0.6.jar)
Downloading: http://repo1.maven.org/maven2/org/apache/fulcrum/fulcrum-yaafi/1.0.6/fulcrum-yaafi-1.0.6.jar
425K downloaded  (jcs-1.3.jar)
127K downloaded  (fulcrum-yaafi-1.0.6.jar)
[INFO] [resources:resources {execution: default-resources}]
[INFO] Using 'ISO-8859-1' encoding to copy filtered resources.
[INFO] skip non existing resourceDirectory <https://builds.apache.org/job/Torque4-trunk/org.apache.torque$torque-runtime/ws/src/main/resources>
[INFO] Copying 3 resources
[INFO] [compiler:compile {execution: default-compile}]
[INFO] Compiling 106 source files to <https://builds.apache.org/job/Torque4-trunk/org.apache.torque$torque-runtime/ws/target/classes>
[INFO] -------------------------------------------------------------
[ERROR] COMPILATION ERROR : 
[INFO] -------------------------------------------------------------
[ERROR] <https://builds.apache.org/job/Torque4-trunk/org.apache.torque$torque-runtime/ws/src/main/java/org/apache/torque/Torque.java>:[197,39]
type parameters of <T>T cannot be determined; no unique maximal instance exists for
type variable T with upper bounds T,org.apache.torque.manager.AbstractBaseManager<? extends
org.apache.torque.om.Persistent>

[ERROR] <https://builds.apache.org/job/Torque4-trunk/org.apache.torque$torque-runtime/ws/src/main/java/org/apache/torque/Torque.java>:[212,39]
type parameters of <T>T cannot be determined; no unique maximal instance exists for
type variable T with upper bounds T,org.apache.torque.manager.AbstractBaseManager<? extends
org.apache.torque.om.Persistent>

[INFO] 2 errors 
[INFO] -------------------------------------------------------------
[JENKINS] Archiving <https://builds.apache.org/job/Torque4-trunk/org.apache.torque$torque-runtime/ws/pom.xml>
to /home/hudson/hudson/jobs/Torque4-trunk/modules/org.apache.torque$torque-runtime/builds/2012-07-06_07-46-39/archive/org.apache.torque/torque-runtime/4.0-beta1-SNAPSHOT/torque-runtime-4.0-beta1-SNAPSHOT.pom
[INFO] ------------------------------------------------------------------------
[ERROR] BUILD FAILURE
[INFO] ------------------------------------------------------------------------
[INFO] Compilation failure

<https://builds.apache.org/job/Torque4-trunk/org.apache.torque$torque-runtime/ws/src/main/java/org/apache/torque/Torque.java>:[197,39]
type parameters of <T>T cannot be determined; no unique maximal instance exists for
type variable T with upper bounds T,org.apache.torque.manager.AbstractBaseManager<? extends
org.apache.torque.om.Persistent>

<https://builds.apache.org/job/Torque4-trunk/org.apache.torque$torque-runtime/ws/src/main/java/org/apache/torque/Torque.java>:[212,39]
type parameters of <T>T cannot be determined; no unique maximal instance exists for
type variable T with upper bounds T,org.apache.torque.manager.AbstractBaseManager<? extends
org.apache.torque.om.Persistent>


[INFO] ------------------------------------------------------------------------
[INFO] For more information, run Maven with the -e switch
[INFO] ------------------------------------------------------------------------
[INFO] Total time: 53 seconds
[INFO] Finished at: Fri Jul 06 07:48:03 UTC 2012
[INFO] Final Memory: 59M/327M
[INFO] ------------------------------------------------------------------------

---------------------------------------------------------------------
To unsubscribe, e-mail: torque-dev-unsubscribe@db.apache.org
For additional commands, e-mail: torque-dev-help@db.apache.org


Mime
View raw message