db-torque-dev mailing list archives

Site index · List index
Message view « Date » · « Thread »
Top « Date » · « Thread »
From Apache Jenkins Server <jenk...@builds.apache.org>
Subject Build failed in Jenkins: torque4-test-project-derby #194
Date Sat, 21 Jul 2012 14:19:17 GMT
See <https://builds.apache.org/job/torque4-test-project-derby/194/>

------------------------------------------
[...truncated 1812 lines...]
INFO  org.apache.torque.generator.control.Controller - Start generation of File <https://builds.apache.org/job/torque4-test-project-derby/ws/target/generated-sources/org/apache/torque/test/manager/base/BaseIncludedManager.java>
INFO  org.apache.torque.generator.control.Controller - Start generation of File <https://builds.apache.org/job/torque4-test-project-derby/ws/target/generated-sources/org/apache/torque/test/manager/base/BaseIncludedFromIncludedManager.java>
INFO  org.apache.torque.generator.control.Controller - Processing source <https://builds.apache.org/job/torque4-test-project-derby/ws/target/torque/test/schema/types-schema.xml>
INFO  org.apache.torque.generator.control.Controller - Start generation of File <https://builds.apache.org/job/torque4-test-project-derby/ws/target/generated-sources/org/apache/torque/test/manager/base/BaseBitValueManager.java>
INFO  org.apache.torque.generator.control.Controller - Start generation of File <https://builds.apache.org/job/torque4-test-project-derby/ws/target/generated-sources/org/apache/torque/test/manager/base/BaseBlobTestManager.java>
INFO  org.apache.torque.generator.control.Controller - Start generation of File <https://builds.apache.org/job/torque4-test-project-derby/ws/target/generated-sources/org/apache/torque/test/manager/base/BaseClobTestManager.java>
INFO  org.apache.torque.generator.control.Controller - Start generation of File <https://builds.apache.org/job/torque4-test-project-derby/ws/target/generated-sources/org/apache/torque/test/manager/base/BaseBintBcharValueManager.java>
INFO  org.apache.torque.generator.control.Controller - Start generation of File <https://builds.apache.org/job/torque4-test-project-derby/ws/target/generated-sources/org/apache/torque/test/manager/base/BaseDateTimeTimestampManager.java>
INFO  org.apache.torque.generator.control.Controller - Processing output torque.om.baseManagerForView
INFO  org.apache.torque.generator.control.Controller - Processing source <https://builds.apache.org/job/torque4-test-project-derby/ws/target/torque/test/schema/bookstore-schema.xml>
INFO  org.apache.torque.generator.control.Controller - Start generation of File <https://builds.apache.org/job/torque4-test-project-derby/ws/target/generated-sources/org/apache/torque/test/manager/base/BaseBookAuthorsManager.java>
INFO  org.apache.torque.generator.control.Controller - Processing source <https://builds.apache.org/job/torque4-test-project-derby/ws/target/torque/test/schema/databaseMapInit-schema.xml>
INFO  org.apache.torque.generator.control.Controller - No start Elements found for path database/all-views/view
INFO  org.apache.torque.generator.control.Controller - Processing source <https://builds.apache.org/job/torque4-test-project-derby/ws/target/torque/test/schema/default-value-schema.xml>
INFO  org.apache.torque.generator.control.Controller - No start Elements found for path database/all-views/view
INFO  org.apache.torque.generator.control.Controller - Processing source <https://builds.apache.org/job/torque4-test-project-derby/ws/target/torque/test/schema/foreign-key-schema.xml>
INFO  org.apache.torque.generator.control.Controller - No start Elements found for path database/all-views/view
INFO  org.apache.torque.generator.control.Controller - Processing source <https://builds.apache.org/job/torque4-test-project-derby/ws/target/torque/test/schema/index.xml>
INFO  org.apache.torque.generator.control.Controller - No start Elements found for path database/all-views/view
INFO  org.apache.torque.generator.control.Controller - Processing source <https://builds.apache.org/job/torque4-test-project-derby/ws/target/torque/test/schema/pk-schema.xml>
INFO  org.apache.torque.generator.control.Controller - No start Elements found for path database/all-views/view
INFO  org.apache.torque.generator.control.Controller - Processing source <https://builds.apache.org/job/torque4-test-project-derby/ws/target/torque/test/schema/save-method-in-peer-schema.xml>
INFO  org.apache.torque.generator.control.Controller - No start Elements found for path database/all-views/view
INFO  org.apache.torque.generator.control.Controller - Processing source <https://builds.apache.org/job/torque4-test-project-derby/ws/target/torque/test/schema/test-schema.xml>
INFO  org.apache.torque.generator.control.Controller - No start Elements found for path database/all-views/view
INFO  org.apache.torque.generator.control.Controller - Processing source <https://builds.apache.org/job/torque4-test-project-derby/ws/target/torque/test/schema/types-schema.xml>
INFO  org.apache.torque.generator.control.Controller - No start Elements found for path database/all-views/view
[INFO] Generation successful
[INFO] [torque:generate {execution: generate-sql}]
INFO  org.apache.torque.generator.control.Controller - readConfiguration() : Starting to read
configuration files
INFO  org.apache.torque.generator.control.Controller - readConfiguration() : Configuration
read.
INFO  org.apache.torque.generator.control.Controller - Processing output torque.sql.ddl
INFO  org.apache.torque.generator.control.Controller - Processing source <https://builds.apache.org/job/torque4-test-project-derby/ws/target/torque/test/schema/bookstore-schema.xml>
INFO  org.apache.torque.generator.control.Controller - Start generation of File <https://builds.apache.org/job/torque4-test-project-derby/ws/target/generated-sql/bookstore-schema.sql>
INFO  org.apache.torque.generator.control.Controller - Processing source <https://builds.apache.org/job/torque4-test-project-derby/ws/target/torque/test/schema/databaseMapInit-schema.xml>
INFO  org.apache.torque.generator.control.Controller - Start generation of File <https://builds.apache.org/job/torque4-test-project-derby/ws/target/generated-sql/databaseMapInit-schema.sql>
INFO  org.apache.torque.generator.control.Controller - Processing source <https://builds.apache.org/job/torque4-test-project-derby/ws/target/torque/test/schema/default-value-schema.xml>
INFO  org.apache.torque.generator.control.Controller - Start generation of File <https://builds.apache.org/job/torque4-test-project-derby/ws/target/generated-sql/default-value-schema.sql>
INFO  org.apache.torque.generator.control.Controller - Processing source <https://builds.apache.org/job/torque4-test-project-derby/ws/target/torque/test/schema/foreign-key-schema.xml>
INFO  org.apache.torque.generator.control.Controller - Start generation of File <https://builds.apache.org/job/torque4-test-project-derby/ws/target/generated-sql/foreign-key-schema.sql>
INFO  org.apache.torque.generator.control.Controller - Processing source <https://builds.apache.org/job/torque4-test-project-derby/ws/target/torque/test/schema/id-table-schema.xml>
INFO  org.apache.torque.generator.control.Controller - Start generation of File <https://builds.apache.org/job/torque4-test-project-derby/ws/target/generated-sql/id-table-schema.sql>
INFO  org.apache.torque.generator.control.Controller - Processing source <https://builds.apache.org/job/torque4-test-project-derby/ws/target/torque/test/schema/index.xml>
INFO  org.apache.torque.generator.control.Controller - Start generation of File <https://builds.apache.org/job/torque4-test-project-derby/ws/target/generated-sql/index.sql>
INFO  org.apache.torque.generator.control.Controller - Processing source <https://builds.apache.org/job/torque4-test-project-derby/ws/target/torque/test/schema/pk-schema.xml>
INFO  org.apache.torque.generator.control.Controller - Start generation of File <https://builds.apache.org/job/torque4-test-project-derby/ws/target/generated-sql/pk-schema.sql>
INFO  org.apache.torque.generator.control.Controller - Processing source <https://builds.apache.org/job/torque4-test-project-derby/ws/target/torque/test/schema/save-method-in-peer-schema.xml>
INFO  org.apache.torque.generator.control.Controller - Start generation of File <https://builds.apache.org/job/torque4-test-project-derby/ws/target/generated-sql/save-method-in-peer-schema.sql>
INFO  org.apache.torque.generator.control.Controller - Processing source <https://builds.apache.org/job/torque4-test-project-derby/ws/target/torque/test/schema/test-schema.xml>
INFO  org.apache.torque.generator.control.Controller - Start generation of File <https://builds.apache.org/job/torque4-test-project-derby/ws/target/generated-sql/test-schema.sql>
INFO  org.apache.torque.generator.control.Controller - Processing source <https://builds.apache.org/job/torque4-test-project-derby/ws/target/torque/test/schema/types-schema.xml>
INFO  org.apache.torque.generator.control.Controller - Start generation of File <https://builds.apache.org/job/torque4-test-project-derby/ws/target/generated-sql/types-schema.sql>
[INFO] Generation successful
[INFO] [torque:generate {execution: generate-createdb-sql}]
INFO  org.apache.torque.generator.control.Controller - readConfiguration() : Starting to read
configuration files
INFO  org.apache.torque.generator.control.Controller - readConfiguration() : Configuration
read.
INFO  org.apache.torque.generator.control.Controller - Processing output torque.sql.createdb
INFO  org.apache.torque.generator.control.Controller - Processing source <https://builds.apache.org/job/torque4-test-project-derby/ws/target/torque/test/schema/bookstore-schema.xml>
INFO  org.apache.torque.generator.control.Controller - Start generation of File <https://builds.apache.org/job/torque4-test-project-derby/ws/target/generated-createdb-sql/bookstore-schema-create.sql>
INFO  org.apache.torque.generator.control.Controller - Processing source <https://builds.apache.org/job/torque4-test-project-derby/ws/target/torque/test/schema/databaseMapInit-schema.xml>
INFO  org.apache.torque.generator.control.Controller - Start generation of File <https://builds.apache.org/job/torque4-test-project-derby/ws/target/generated-createdb-sql/databaseMapInit-schema-create.sql>
INFO  org.apache.torque.generator.control.Controller - Processing source <https://builds.apache.org/job/torque4-test-project-derby/ws/target/torque/test/schema/default-value-schema.xml>
INFO  org.apache.torque.generator.control.Controller - Start generation of File <https://builds.apache.org/job/torque4-test-project-derby/ws/target/generated-createdb-sql/default-value-schema-create.sql>
INFO  org.apache.torque.generator.control.Controller - Processing source <https://builds.apache.org/job/torque4-test-project-derby/ws/target/torque/test/schema/foreign-key-schema.xml>
INFO  org.apache.torque.generator.control.Controller - Start generation of File <https://builds.apache.org/job/torque4-test-project-derby/ws/target/generated-createdb-sql/foreign-key-schema-create.sql>
INFO  org.apache.torque.generator.control.Controller - Processing source <https://builds.apache.org/job/torque4-test-project-derby/ws/target/torque/test/schema/index.xml>
INFO  org.apache.torque.generator.control.Controller - Start generation of File <https://builds.apache.org/job/torque4-test-project-derby/ws/target/generated-createdb-sql/index-create.sql>
INFO  org.apache.torque.generator.control.Controller - Processing source <https://builds.apache.org/job/torque4-test-project-derby/ws/target/torque/test/schema/pk-schema.xml>
INFO  org.apache.torque.generator.control.Controller - Start generation of File <https://builds.apache.org/job/torque4-test-project-derby/ws/target/generated-createdb-sql/pk-schema-create.sql>
INFO  org.apache.torque.generator.control.Controller - Processing source <https://builds.apache.org/job/torque4-test-project-derby/ws/target/torque/test/schema/save-method-in-peer-schema.xml>
INFO  org.apache.torque.generator.control.Controller - Start generation of File <https://builds.apache.org/job/torque4-test-project-derby/ws/target/generated-createdb-sql/save-method-in-peer-schema-create.sql>
INFO  org.apache.torque.generator.control.Controller - Processing source <https://builds.apache.org/job/torque4-test-project-derby/ws/target/torque/test/schema/test-schema.xml>
INFO  org.apache.torque.generator.control.Controller - Start generation of File <https://builds.apache.org/job/torque4-test-project-derby/ws/target/generated-createdb-sql/test-schema-create.sql>
INFO  org.apache.torque.generator.control.Controller - Processing source <https://builds.apache.org/job/torque4-test-project-derby/ws/target/torque/test/schema/types-schema.xml>
INFO  org.apache.torque.generator.control.Controller - Start generation of File <https://builds.apache.org/job/torque4-test-project-derby/ws/target/generated-createdb-sql/types-schema-create.sql>
[INFO] Generation successful
[INFO] [torque:generate {execution: generate-idtable-sql}]
INFO  org.apache.torque.generator.control.Controller - readConfiguration() : Starting to read
configuration files
INFO  org.apache.torque.generator.control.Controller - readConfiguration() : Configuration
read.
INFO  org.apache.torque.generator.control.Controller - Processing output torque.sql.idtable.idtable
INFO  org.apache.torque.generator.control.Controller - Processing source <https://builds.apache.org/job/torque4-test-project-derby/ws/target/torque/test/schema/./bookstore-schema.xml>
INFO  org.apache.torque.generator.control.Controller - Start generation of File <https://builds.apache.org/job/torque4-test-project-derby/ws/target/generated-sql/bookstore-schema-idtable-init.sql>
INFO  org.apache.torque.generator.control.Controller - Processing source <https://builds.apache.org/job/torque4-test-project-derby/ws/target/torque/test/schema/./databaseMapInit-schema.xml>
INFO  org.apache.torque.generator.control.Controller - Start generation of File <https://builds.apache.org/job/torque4-test-project-derby/ws/target/generated-sql/databaseMapInit-schema-idtable-init.sql>
INFO  org.apache.torque.generator.control.Controller - Processing source <https://builds.apache.org/job/torque4-test-project-derby/ws/target/torque/test/schema/./default-value-schema.xml>
INFO  org.apache.torque.generator.control.Controller - Start generation of File <https://builds.apache.org/job/torque4-test-project-derby/ws/target/generated-sql/default-value-schema-idtable-init.sql>
INFO  org.apache.torque.generator.control.Controller - Processing source <https://builds.apache.org/job/torque4-test-project-derby/ws/target/torque/test/schema/./ext-schema.xml>
INFO  org.apache.torque.generator.control.Controller - Start generation of File <https://builds.apache.org/job/torque4-test-project-derby/ws/target/generated-sql/ext-schema-idtable-init.sql>
INFO  org.apache.torque.generator.control.Controller - Processing source <https://builds.apache.org/job/torque4-test-project-derby/ws/target/torque/test/schema/./extext-schema.xml>
INFO  org.apache.torque.generator.control.Controller - Start generation of File <https://builds.apache.org/job/torque4-test-project-derby/ws/target/generated-sql/extext-schema-idtable-init.sql>
INFO  org.apache.torque.generator.control.Controller - Processing source <https://builds.apache.org/job/torque4-test-project-derby/ws/target/torque/test/schema/./foreign-key-schema.xml>
INFO  org.apache.torque.generator.control.Controller - Start generation of File <https://builds.apache.org/job/torque4-test-project-derby/ws/target/generated-sql/foreign-key-schema-idtable-init.sql>
INFO  org.apache.torque.generator.control.Controller - Processing source <https://builds.apache.org/job/torque4-test-project-derby/ws/target/torque/test/schema/./included-from-included-schema.xml>
INFO  org.apache.torque.generator.control.Controller - Start generation of File <https://builds.apache.org/job/torque4-test-project-derby/ws/target/generated-sql/included-from-included-schema-idtable-init.sql>
INFO  org.apache.torque.generator.control.Controller - Processing source <https://builds.apache.org/job/torque4-test-project-derby/ws/target/torque/test/schema/./included-schema.xml>
INFO  org.apache.torque.generator.control.Controller - Start generation of File <https://builds.apache.org/job/torque4-test-project-derby/ws/target/generated-sql/included-schema-idtable-init.sql>
INFO  org.apache.torque.generator.control.Controller - Processing source <https://builds.apache.org/job/torque4-test-project-derby/ws/target/torque/test/schema/./pk-schema.xml>
INFO  org.apache.torque.generator.control.Controller - Start generation of File <https://builds.apache.org/job/torque4-test-project-derby/ws/target/generated-sql/pk-schema-idtable-init.sql>
INFO  org.apache.torque.generator.control.Controller - Processing source <https://builds.apache.org/job/torque4-test-project-derby/ws/target/torque/test/schema/./save-method-in-peer-schema.xml>
INFO  org.apache.torque.generator.control.Controller - Start generation of File <https://builds.apache.org/job/torque4-test-project-derby/ws/target/generated-sql/save-method-in-peer-schema-idtable-init.sql>
INFO  org.apache.torque.generator.control.Controller - Processing source <https://builds.apache.org/job/torque4-test-project-derby/ws/target/torque/test/schema/./test-schema.xml>
INFO  org.apache.torque.generator.control.Controller - Start generation of File <https://builds.apache.org/job/torque4-test-project-derby/ws/target/generated-sql/test-schema-idtable-init.sql>
INFO  org.apache.torque.generator.control.Controller - Processing source <https://builds.apache.org/job/torque4-test-project-derby/ws/target/torque/test/schema/./types-schema.xml>
INFO  org.apache.torque.generator.control.Controller - Start generation of File <https://builds.apache.org/job/torque4-test-project-derby/ws/target/generated-sql/types-schema-idtable-init.sql>
[INFO] Generation successful
[INFO] [torque:generate {execution: generate-html-doc}]
INFO  org.apache.torque.generator.control.Controller - readConfiguration() : Starting to read
configuration files
INFO  org.apache.torque.generator.control.Controller - readConfiguration() : Configuration
read.
INFO  org.apache.torque.generator.control.Controller - Processing output torque.doc.html.css
INFO  org.apache.torque.generator.control.Controller - Processing source <https://builds.apache.org/job/torque4-test-project-derby/ws/target/torque/test/schema/bookstore-schema.xml>
INFO  org.apache.torque.generator.control.Controller - Start generation of File <https://builds.apache.org/job/torque4-test-project-derby/ws/target/generated-docs/datamodel.css>
INFO  org.apache.torque.generator.control.Controller - Processing source <https://builds.apache.org/job/torque4-test-project-derby/ws/target/torque/test/schema/databaseMapInit-schema.xml>
INFO  org.apache.torque.generator.control.Controller - Start generation of File <https://builds.apache.org/job/torque4-test-project-derby/ws/target/generated-docs/datamodel.css>
INFO  org.apache.torque.generator.control.Controller - Processing source <https://builds.apache.org/job/torque4-test-project-derby/ws/target/torque/test/schema/default-value-schema.xml>
INFO  org.apache.torque.generator.control.Controller - Start generation of File <https://builds.apache.org/job/torque4-test-project-derby/ws/target/generated-docs/datamodel.css>
INFO  org.apache.torque.generator.control.Controller - Processing source <https://builds.apache.org/job/torque4-test-project-derby/ws/target/torque/test/schema/foreign-key-schema.xml>
INFO  org.apache.torque.generator.control.Controller - Start generation of File <https://builds.apache.org/job/torque4-test-project-derby/ws/target/generated-docs/datamodel.css>
INFO  org.apache.torque.generator.control.Controller - Processing source <https://builds.apache.org/job/torque4-test-project-derby/ws/target/torque/test/schema/index.xml>
INFO  org.apache.torque.generator.control.Controller - Start generation of File <https://builds.apache.org/job/torque4-test-project-derby/ws/target/generated-docs/datamodel.css>
INFO  org.apache.torque.generator.control.Controller - Processing source <https://builds.apache.org/job/torque4-test-project-derby/ws/target/torque/test/schema/pk-schema.xml>
INFO  org.apache.torque.generator.control.Controller - Start generation of File <https://builds.apache.org/job/torque4-test-project-derby/ws/target/generated-docs/datamodel.css>
INFO  org.apache.torque.generator.control.Controller - Processing source <https://builds.apache.org/job/torque4-test-project-derby/ws/target/torque/test/schema/save-method-in-peer-schema.xml>
INFO  org.apache.torque.generator.control.Controller - Start generation of File <https://builds.apache.org/job/torque4-test-project-derby/ws/target/generated-docs/datamodel.css>
INFO  org.apache.torque.generator.control.Controller - Processing source <https://builds.apache.org/job/torque4-test-project-derby/ws/target/torque/test/schema/test-schema.xml>
INFO  org.apache.torque.generator.control.Controller - Start generation of File <https://builds.apache.org/job/torque4-test-project-derby/ws/target/generated-docs/datamodel.css>
INFO  org.apache.torque.generator.control.Controller - Processing source <https://builds.apache.org/job/torque4-test-project-derby/ws/target/torque/test/schema/types-schema.xml>
INFO  org.apache.torque.generator.control.Controller - Start generation of File <https://builds.apache.org/job/torque4-test-project-derby/ws/target/generated-docs/datamodel.css>
INFO  org.apache.torque.generator.control.Controller - Processing output torque.doc.html.html
INFO  org.apache.torque.generator.control.Controller - Processing source <https://builds.apache.org/job/torque4-test-project-derby/ws/target/torque/test/schema/bookstore-schema.xml>
INFO  org.apache.torque.generator.control.Controller - Start generation of File <https://builds.apache.org/job/torque4-test-project-derby/ws/target/generated-docs/bookstore-schema.html>
INFO  org.apache.torque.generator.control.Controller - Processing source <https://builds.apache.org/job/torque4-test-project-derby/ws/target/torque/test/schema/databaseMapInit-schema.xml>
INFO  org.apache.torque.generator.control.Controller - Start generation of File <https://builds.apache.org/job/torque4-test-project-derby/ws/target/generated-docs/databaseMapInit-schema.html>
INFO  org.apache.torque.generator.control.Controller - Processing source <https://builds.apache.org/job/torque4-test-project-derby/ws/target/torque/test/schema/default-value-schema.xml>
INFO  org.apache.torque.generator.control.Controller - Start generation of File <https://builds.apache.org/job/torque4-test-project-derby/ws/target/generated-docs/default-value-schema.html>
INFO  org.apache.torque.generator.control.Controller - Processing source <https://builds.apache.org/job/torque4-test-project-derby/ws/target/torque/test/schema/foreign-key-schema.xml>
INFO  org.apache.torque.generator.control.Controller - Start generation of File <https://builds.apache.org/job/torque4-test-project-derby/ws/target/generated-docs/foreign-key-schema.html>
INFO  org.apache.torque.generator.control.Controller - Processing source <https://builds.apache.org/job/torque4-test-project-derby/ws/target/torque/test/schema/index.xml>
INFO  org.apache.torque.generator.control.Controller - Start generation of File <https://builds.apache.org/job/torque4-test-project-derby/ws/target/generated-docs/index.html>
INFO  org.apache.torque.generator.control.Controller - Processing source <https://builds.apache.org/job/torque4-test-project-derby/ws/target/torque/test/schema/pk-schema.xml>
INFO  org.apache.torque.generator.control.Controller - Start generation of File <https://builds.apache.org/job/torque4-test-project-derby/ws/target/generated-docs/pk-schema.html>
INFO  org.apache.torque.generator.control.Controller - Processing source <https://builds.apache.org/job/torque4-test-project-derby/ws/target/torque/test/schema/save-method-in-peer-schema.xml>
INFO  org.apache.torque.generator.control.Controller - Start generation of File <https://builds.apache.org/job/torque4-test-project-derby/ws/target/generated-docs/save-method-in-peer-schema.html>
INFO  org.apache.torque.generator.control.Controller - Processing source <https://builds.apache.org/job/torque4-test-project-derby/ws/target/torque/test/schema/test-schema.xml>
INFO  org.apache.torque.generator.control.Controller - Start generation of File <https://builds.apache.org/job/torque4-test-project-derby/ws/target/generated-docs/test-schema.html>
INFO  org.apache.torque.generator.control.Controller - Processing source <https://builds.apache.org/job/torque4-test-project-derby/ws/target/torque/test/schema/types-schema.xml>
INFO  org.apache.torque.generator.control.Controller - Start generation of File <https://builds.apache.org/job/torque4-test-project-derby/ws/target/generated-docs/types-schema.html>
[INFO] Generation successful
[INFO] [remote-resources:process {execution: default}]
[debug] execute contextualize
[INFO] [resources:resources {execution: default-resources}]
[INFO] Using 'ISO-8859-1' encoding to copy filtered resources.
[INFO] skip non existing resourceDirectory <https://builds.apache.org/job/torque4-test-project-derby/ws/src/main/resources>
[INFO] Copying 3 resources
[INFO] [compiler:compile {execution: default-compile}]
[INFO] Compiling 849 source files to <https://builds.apache.org/job/torque4-test-project-derby/ws/target/classes>
[INFO] -------------------------------------------------------------
[ERROR] COMPILATION ERROR : 
[INFO] -------------------------------------------------------------
[ERROR] <https://builds.apache.org/job/torque4-test-project-derby/ws/target/generated-sources/org/apache/torque/test/BaseDatabaseDefaultValuesPeerImpl.java>:[854,40]
integer number too large: 09

[ERROR] <https://builds.apache.org/job/torque4-test-project-derby/ws/target/generated-sources/org/apache/torque/test/BaseDatabaseDefaultValuesPeerImpl.java>:[854,43]
integer number too large: 08

[ERROR] <https://builds.apache.org/job/torque4-test-project-derby/ws/target/generated-sources/org/apache/torque/test/BaseDatabaseDefaultValuesPeerImpl.java>:[854,46]
')' expected

[ERROR] <https://builds.apache.org/job/torque4-test-project-derby/ws/target/generated-sources/org/apache/torque/test/BaseDatabaseDefaultValuesPeerImpl.java>:[925,27]
')' expected

[ERROR] <https://builds.apache.org/job/torque4-test-project-derby/ws/target/generated-sources/org/apache/torque/test/BaseDatabaseDefaultValues.java>:[91,63]
integer number too large: 09

[ERROR] <https://builds.apache.org/job/torque4-test-project-derby/ws/target/generated-sources/org/apache/torque/test/BaseDatabaseDefaultValues.java>:[91,66]
integer number too large: 08

[ERROR] <https://builds.apache.org/job/torque4-test-project-derby/ws/target/generated-sources/org/apache/torque/test/BaseDatabaseDefaultValues.java>:[91,69]
')' expected

[ERROR] <https://builds.apache.org/job/torque4-test-project-derby/ws/target/generated-sources/org/apache/torque/test/BaseDatabaseDefaultValues.java>:[102,69]
')' expected

[ERROR] <https://builds.apache.org/job/torque4-test-project-derby/ws/target/generated-sources/org/apache/torque/test/BaseDatabaseDefaultValues.java>:[113,68]
integer number too large: 09

[ERROR] <https://builds.apache.org/job/torque4-test-project-derby/ws/target/generated-sources/org/apache/torque/test/BaseDatabaseDefaultValues.java>:[113,71]
integer number too large: 08

[ERROR] <https://builds.apache.org/job/torque4-test-project-derby/ws/target/generated-sources/org/apache/torque/test/BaseDatabaseDefaultValues.java>:[113,74]
')' expected

[ERROR] <https://builds.apache.org/job/torque4-test-project-derby/ws/target/generated-sources/org/apache/torque/test/BaseJavaDefaultValues.java>:[56,63]
integer number too large: 09

[ERROR] <https://builds.apache.org/job/torque4-test-project-derby/ws/target/generated-sources/org/apache/torque/test/BaseJavaDefaultValues.java>:[56,66]
integer number too large: 08

[ERROR] <https://builds.apache.org/job/torque4-test-project-derby/ws/target/generated-sources/org/apache/torque/test/BaseJavaDefaultValues.java>:[56,69]
')' expected

[ERROR] <https://builds.apache.org/job/torque4-test-project-derby/ws/target/generated-sources/org/apache/torque/test/BaseJavaDefaultValues.java>:[59,69]
')' expected

[ERROR] <https://builds.apache.org/job/torque4-test-project-derby/ws/target/generated-sources/org/apache/torque/test/BaseJavaDefaultValues.java>:[62,68]
integer number too large: 09

[ERROR] <https://builds.apache.org/job/torque4-test-project-derby/ws/target/generated-sources/org/apache/torque/test/BaseJavaDefaultValues.java>:[62,71]
integer number too large: 08

[ERROR] <https://builds.apache.org/job/torque4-test-project-derby/ws/target/generated-sources/org/apache/torque/test/BaseJavaDefaultValues.java>:[62,74]
')' expected

[INFO] 18 errors 
[INFO] -------------------------------------------------------------
[JENKINS] Archiving <https://builds.apache.org/job/torque4-test-project-derby/ws/pom.xml>
to /home/hudson/hudson/jobs/torque4-test-project-derby/modules/org.apache.torque$torque-test/builds/2012-07-21_14-18-18/archive/org.apache.torque/torque-test/4.0-beta1-SNAPSHOT/torque-test-4.0-beta1-SNAPSHOT.pom
[INFO] ------------------------------------------------------------------------
[ERROR] BUILD FAILURE
[INFO] ------------------------------------------------------------------------
[INFO] Compilation failure

<https://builds.apache.org/job/torque4-test-project-derby/ws/target/generated-sources/org/apache/torque/test/BaseDatabaseDefaultValuesPeerImpl.java>:[854,40]
integer number too large: 09

<https://builds.apache.org/job/torque4-test-project-derby/ws/target/generated-sources/org/apache/torque/test/BaseDatabaseDefaultValuesPeerImpl.java>:[854,43]
integer number too large: 08

<https://builds.apache.org/job/torque4-test-project-derby/ws/target/generated-sources/org/apache/torque/test/BaseDatabaseDefaultValuesPeerImpl.java>:[854,46]
')' expected

<https://builds.apache.org/job/torque4-test-project-derby/ws/target/generated-sources/org/apache/torque/test/BaseDatabaseDefaultValuesPeerImpl.java>:[925,27]
')' expected

<https://builds.apache.org/job/torque4-test-project-derby/ws/target/generated-sources/org/apache/torque/test/BaseDatabaseDefaultValues.java>:[91,63]
integer number too large: 09

<https://builds.apache.org/job/torque4-test-project-derby/ws/target/generated-sources/org/apache/torque/test/BaseDatabaseDefaultValues.java>:[91,66]
integer number too large: 08

<https://builds.apache.org/job/torque4-test-project-derby/ws/target/generated-sources/org/apache/torque/test/BaseDatabaseDefaultValues.java>:[91,69]
')' expected

<https://builds.apache.org/job/torque4-test-project-derby/ws/target/generated-sources/org/apache/torque/test/BaseDatabaseDefaultValues.java>:[102,69]
')' expected

<https://builds.apache.org/job/torque4-test-project-derby/ws/target/generated-sources/org/apache/torque/test/BaseDatabaseDefaultValues.java>:[113,68]
integer number too large: 09

<https://builds.apache.org/job/torque4-test-project-derby/ws/target/generated-sources/org/apache/torque/test/BaseDatabaseDefaultValues.java>:[113,71]
integer number too large: 08

<https://builds.apache.org/job/torque4-test-project-derby/ws/target/generated-sources/org/apache/torque/test/BaseDatabaseDefaultValues.java>:[113,74]
')' expected

<https://builds.apache.org/job/torque4-test-project-derby/ws/target/generated-sources/org/apache/torque/test/BaseJavaDefaultValues.java>:[56,63]
integer number too large: 09

<https://builds.apache.org/job/torque4-test-project-derby/ws/target/generated-sources/org/apache/torque/test/BaseJavaDefaultValues.java>:[56,66]
integer number too large: 08

<https://builds.apache.org/job/torque4-test-project-derby/ws/target/generated-sources/org/apache/torque/test/BaseJavaDefaultValues.java>:[56,69]
')' expected

<https://builds.apache.org/job/torque4-test-project-derby/ws/target/generated-sources/org/apache/torque/test/BaseJavaDefaultValues.java>:[59,69]
')' expected

<https://builds.apache.org/job/torque4-test-project-derby/ws/target/generated-sources/org/apache/torque/test/BaseJavaDefaultValues.java>:[62,68]
integer number too large: 09

<https://builds.apache.org/job/torque4-test-project-derby/ws/target/generated-sources/org/apache/torque/test/BaseJavaDefaultValues.java>:[62,71]
integer number too large: 08

<https://builds.apache.org/job/torque4-test-project-derby/ws/target/generated-sources/org/apache/torque/test/BaseJavaDefaultValues.java>:[62,74]
')' expected


[INFO] ------------------------------------------------------------------------
[INFO] For more information, run Maven with the -e switch
[INFO] ------------------------------------------------------------------------
[INFO] Total time: 33 seconds
[INFO] Finished at: Sat Jul 21 14:19:15 UTC 2012
[INFO] Final Memory: 42M/304M
[INFO] ------------------------------------------------------------------------
Waiting for Jenkins to finish collecting data
Sending e-mails to: torque-dev@db.apache.org
channel stopped

---------------------------------------------------------------------
To unsubscribe, e-mail: torque-dev-unsubscribe@db.apache.org
For additional commands, e-mail: torque-dev-help@db.apache.org


Mime
View raw message