db-torque-dev mailing list archives

Site index · List index
Message view « Date » · « Thread »
Top « Date » · « Thread »
From Apache Jenkins Server <jenk...@builds.apache.org>
Subject Build failed in Jenkins: Torque4-trunk #237
Date Fri, 06 Jul 2012 07:48:05 GMT
See <https://builds.apache.org/job/Torque4-trunk/237/>

------------------------------------------
[...truncated 1495 lines...]
A         torque-test/src/test
A         torque-test/src/test/sql
AU        torque-test/src/test/sql/schema.sql.ref.xml
AU        torque-test/src/test/sql/schema.sql
A         torque-test/src/test/profile
A         torque-test/src/test/profile/derbyEmbedded
A         torque-test/src/test/profile/derbyEmbedded/notes.txt
A         torque-test/src/test/profile/derbyEmbedded/Torque.properties
A         torque-test/src/test/profile/mssql
A         torque-test/src/test/profile/mssql/Torque.properties
A         torque-test/src/test/profile/postgresql
AU        torque-test/src/test/profile/postgresql/Torque.properties
A         torque-test/src/test/profile/derby
A         torque-test/src/test/profile/derby/notes.txt
AU        torque-test/src/test/profile/derby/Torque.properties
A         torque-test/src/test/profile/mysql
AU        torque-test/src/test/profile/mysql/Torque.properties
A         torque-test/src/test/profile/oracle
AU        torque-test/src/test/profile/oracle/Torque.properties
A         torque-test/src/test/profile/henning
AU        torque-test/src/test/profile/henning/Torque.properties
A         torque-test/src/test/profile/jmcnally
AU        torque-test/src/test/profile/jmcnally/Torque.properties
A         torque-test/src/test/profile/tv
A         torque-test/src/test/profile/tv/Torque.properties
A         torque-test/src/test/profile/hsqldb
AU        torque-test/src/test/profile/hsqldb/Torque.properties
A         torque-test/src/test/java
A         torque-test/src/test/java/org
A         torque-test/src/test/java/org/apache
A         torque-test/src/test/java/org/apache/torque
A         torque-test/src/test/java/org/apache/torque/test
AU        torque-test/src/test/java/org/apache/torque/test/InheritanceClassnameTestChild1.java
AU        torque-test/src/test/java/org/apache/torque/test/InheritanceClassnameTestChild2.java
AU        torque-test/src/test/java/org/apache/torque/InitShutdownTest.java
A         torque-test/src/test/java/org/apache/torque/adapter
AU        torque-test/src/test/java/org/apache/torque/adapter/AdapterTest.java
A         torque-test/src/test/java/org/apache/torque/avalon
AU        torque-test/src/test/java/org/apache/torque/avalon/AvalonMapBuildersTest.java
AU        torque-test/src/test/java/org/apache/torque/DataTest.java
AU        torque-test/src/test/java/org/apache/torque/JndiConfigurationTest.java
AU        torque-test/src/test/java/org/apache/torque/ForeignKeySchemaData.java
A         torque-test/src/test/java/org/apache/torque/datatypes
AU        torque-test/src/test/java/org/apache/torque/datatypes/BooleanIntCharTest.java
AU        torque-test/src/test/java/org/apache/torque/datatypes/BitTest.java
A         torque-test/src/test/java/org/apache/torque/generated
A         torque-test/src/test/java/org/apache/torque/generated/dataobject
AU        torque-test/src/test/java/org/apache/torque/generated/dataobject/ForeignKeyAdderTest.java
AU        torque-test/src/test/java/org/apache/torque/generated/dataobject/ViewTest.java
AU        torque-test/src/test/java/org/apache/torque/generated/dataobject/ForeignKeyGetterTest.java
AU        torque-test/src/test/java/org/apache/torque/generated/dataobject/SaveTest.java
A         torque-test/src/test/java/org/apache/torque/generated/peer
AU        torque-test/src/test/java/org/apache/torque/generated/peer/JoinTest.java
AU        torque-test/src/test/java/org/apache/torque/generated/peer/SelectTest.java
A         torque-test/src/test/java/org/apache/torque/generated/peer/DefaultValueTest.java
AU        torque-test/src/test/java/org/apache/torque/generated/peer/WhereClauseSubselectTest.java
AU        torque-test/src/test/java/org/apache/torque/generated/peer/DeleteTest.java
AU        torque-test/src/test/java/org/apache/torque/generated/peer/SaveMethodsInPeerTest.java
A         torque-test/src/test/java/org/apache/torque/generated/peer/SelectFunctionTest.java
AU        torque-test/src/test/java/org/apache/torque/generated/peer/SelectInTest.java
AU        torque-test/src/test/java/org/apache/torque/generated/peer/UseDefaultValueFromDatabaseTest.java
AU        torque-test/src/test/java/org/apache/torque/generated/peer/GetRelatedObjectsTest.java
AU        torque-test/src/test/java/org/apache/torque/generated/peer/DateTest.java
AU        torque-test/src/test/java/org/apache/torque/generated/peer/FillerTest.java
A         torque-test/src/test/java/org/apache/torque/sql
AU        torque-test/src/test/java/org/apache/torque/sql/DatabaseTools.java
AU        torque-test/src/test/java/org/apache/torque/sql/SkipSqlTest.java
AU        torque-test/src/test/java/org/apache/torque/PkSchemaData.java
AU        torque-test/src/test/java/org/apache/torque/DocsTest.java
AU        torque-test/src/test/java/org/apache/torque/BeanTestConditional.java
AU        torque-test/src/test/java/org/apache/torque/BaseDatabaseTestCase.java
A         torque-test/src/test/java/org/apache/torque/oid
AU        torque-test/src/test/java/org/apache/torque/oid/IDBrokerTest.java
A         torque-test/src/test/java/org/apache/torque/om
AU        torque-test/src/test/java/org/apache/torque/om/OMByNameMethodsTest.java
A         torque-test/src/test/java/org/apache/torque/map
AU        torque-test/src/test/java/org/apache/torque/map/DatabaseMapTest.java
A         torque-test/src/test/java/org/apache/torque/util
AU        torque-test/src/test/java/org/apache/torque/util/BasePeerTest.java
AU        torque-test/src/test/java/org/apache/torque/util/LargeSelectTest.java
AU        torque-test/src/test/java/org/apache/torque/util/SummaryHelperTest.java
AU        torque-test/src/test/java/org/apache/torque/util/CopyTestConditional.java
AU        torque-test/src/test/java/org/apache/torque/ManagerTestConditional.java
A         torque-test/src/test/resources
AU        torque-test/src/test/resources/TestRoleConfig.xml
AU        torque-test/src/test/resources/TestComponentConfig.xml
AU        torque-test/src/test/resources/commons-logging.properties
AU        torque-test/src/test/resources/log4j.properties
AU        torque-test/src/test/resources/cache.ccf
AU        torque-test/src/test/resources/TurbineResources.properties
A         torque-test/src/main
A         torque-test/src/main/schema
A         torque-test/src/main/schema/types-schema.xml
A         torque-test/src/main/schema/databaseMapInit-schema.xml
AU        torque-test/src/main/schema/bookstore-schema.xml
A         torque-test/src/main/schema/included-schema.xml
A         torque-test/src/main/schema/index.xml
A         torque-test/src/main/schema/save-method-in-peer-schema.xml
A         torque-test/src/main/schema/pk-schema.xml
A         torque-test/src/main/schema/included-from-included-schema.xml
A         torque-test/src/main/schema/default-value-schema.xml
A         torque-test/src/main/schema/foreign-key-schema.xml
AU        torque-test/src/main/schema/test-schema.xml
AU        torque-test/src/main/schema/ext-schema.xml
AU        torque-test/src/main/schema/extext-schema.xml
AU        torque-test/src/main/schema/id-table-schema.xml
A         torque-test/src/main/java
A         torque-test/src/main/java/org
A         torque-test/src/main/java/org/apache
A         torque-test/src/main/java/org/apache/torque
AU        torque-test/src/main/java/org/apache/torque/TestInterface.java
A         torque-test/src/main/torque-gen
A         torque-test/src/main/torque-gen/outlets
A         torque-test/src/main/torque-gen/outlets/peer.xml
A         torque-test/src/main/torque-gen/conf
A         torque-test/src/main/torque-gen/conf/control.xml
A         torque-test/src/main/torque-gen/templates
A         torque-test/src/main/torque-gen/templates/peer
A         torque-test/src/main/torque-gen/templates/peer/base
A         torque-test/src/main/torque-gen/templates/peer/base/classAnnotations.vm
AU        torque-test/pom.xml
At revision 1358060
no revision recorded for http://svn.apache.org/repos/asf/db/torque/torque4/trunk in the previous
build
Parsing POMs
Modules changed, recalculating dependency graph
[torque-maven-parent] $ /home/hudson/tools/java/latest1.5/bin/java -cp /home/jenkins/jenkins-slave/maven-agent.jar:/home/jenkins/jenkins-slave/classworlds.jar
hudson.maven.agent.Main /home/hudson/tools/maven/apache-maven-2.2.1 /home/jenkins/jenkins-slave/slave.jar
/home/jenkins/jenkins-slave/maven-interceptor.jar 49104 /home/jenkins/jenkins-slave/maven2.1-interceptor.jar
<===[JENKINS REMOTING CAPACITY]===>channel started
   log4j:WARN No appenders could be found for logger (org.apache.commons.beanutils.converters.BooleanConverter).
log4j:WARN Please initialize the log4j system properly.
Executing Maven:  -B -f <https://builds.apache.org/job/Torque4-trunk/ws/torque4-trunk/torque-maven-parent/pom.xml>
-Dmaven.repo.local=/home/jenkins/jenkins-slave/maven-repositories/1 clean install cobertura:cobertura
findbugs:findbugs checkstyle:checkstyle
[INFO] Scanning for projects...
[INFO] Reactor build order: 
[INFO]   Torque Maven Parent
[INFO]   Torque Runtime
[INFO]   Torque Generator
[INFO]   Torque Templates
[INFO]   Torque Generator Maven 2 Plugin
[INFO]   Torque Generator Ant tasks
[INFO]   Torque Site
Downloading: http://repo1.maven.org/maven2/org/apache/maven/plugins/maven-eclipse-plugin/2.7/maven-eclipse-plugin-2.7.pom
10K downloaded  (maven-eclipse-plugin-2.7.pom)
Downloading: http://repo1.maven.org/maven2/org/apache/maven/plugins/maven-eclipse-plugin/2.7/maven-eclipse-plugin-2.7.jar
201K downloaded  (maven-eclipse-plugin-2.7.jar)
[INFO] ------------------------------------------------------------------------
[INFO] Building Torque Maven Parent
[INFO]    task-segment: [clean, install, cobertura:cobertura, findbugs:findbugs, checkstyle:checkstyle]
[INFO] ------------------------------------------------------------------------
[INFO] [clean:clean {execution: default-clean}]
Downloading: http://repo1.maven.org/maven2/org/apache/maven/plugins/maven-site-plugin/2.4/maven-site-plugin-2.4.pom
15K downloaded  (maven-site-plugin-2.4.pom)
Downloading: http://repo1.maven.org/maven2/org/apache/maven/plugins/maven-site-plugin/2.4/maven-site-plugin-2.4.jar
99K downloaded  (maven-site-plugin-2.4.jar)
[INFO] Setting property: classpath.resource.loader.class => 'org.codehaus.plexus.velocity.ContextClassLoaderResourceLoader'.
[INFO] Setting property: velocimacro.messages.on => 'false'.
[INFO] Setting property: resource.loader => 'classpath'.
[INFO] Setting property: resource.manager.logwhenfound => 'false'.
[INFO] [remote-resources:process {execution: default}]
[INFO] [site:attach-descriptor {execution: default-attach-descriptor}]
[INFO] Preparing source:jar
[WARNING] Removing: jar from forked lifecycle, to prevent recursive invocation.
[INFO] No goals needed for project - skipping
[INFO] [source:jar {execution: default}]
[INFO] [apache-rat:check {execution: default}]
[INFO] Exclude: velocity.log
[INFO] Exclude: .checkstyle
[INFO] Exclude: checkstyle-cache.ccf
[INFO] Exclude: derby.log
[INFO] Exclude: LICENSE-EDL.txt
[INFO] [install:install {execution: default-install}]
[INFO] Installing <https://builds.apache.org/job/Torque4-trunk/ws/torque4-trunk/torque-maven-parent/pom.xml>
to /home/jenkins/jenkins-slave/maven-repositories/1/org/apache/torque/torque-maven-parent/4.0-beta1-SNAPSHOT/torque-maven-parent-4.0-beta1-SNAPSHOT.pom
[INFO] Preparing cobertura:cobertura
[JENKINS] Archiving <https://builds.apache.org/job/Torque4-trunk/ws/torque4-trunk/torque-maven-parent/pom.xml>
to /home/hudson/hudson/jobs/Torque4-trunk/modules/org.apache.torque$torque-maven-parent/builds/2012-07-06_07-46-39/archive/org.apache.torque/torque-maven-parent/4.0-beta1-SNAPSHOT/torque-maven-parent-4.0-beta1-SNAPSHOT.pom
[INFO] [remote-resources:process {execution: default}]
[INFO] [cobertura:instrument {execution: default-instrument}]
[INFO] Not executing cobertura:instrument as the project is not a Java classpath-capable package
[JENKINS] cobertura-maven-plugin already configured with xml reports enabled[INFO] [cobertura:cobertura
{execution: default-cli}]
[INFO] Not executing cobertura:report as the cobertura data file (<https://builds.apache.org/job/Torque4-trunk/ws/torque4-trunk/torque-maven-parent/target/cobertura/cobertura.ser)>
could not be found
[INFO] Preparing findbugs:findbugs

[JENKINS] Cobertura report not generated (probably this module is not a java module)
[INFO] [remote-resources:process {execution: default}]
[INFO] [findbugs:findbugs {execution: default-cli}]
[FINDBUGS] No report found for mojo findbugs
Downloading: http://repo1.maven.org/maven2/org/codehaus/plexus/plexus-resources/1.0-alpha-6/plexus-resources-1.0-alpha-6.pom
1K downloaded  (plexus-resources-1.0-alpha-6.pom)
Downloading: http://repo1.maven.org/maven2/org/codehaus/plexus/plexus-resources/1.0-alpha-6/plexus-resources-1.0-alpha-6.jar
21K downloaded  (plexus-resources-1.0-alpha-6.jar)
[INFO] [checkstyle:checkstyle {execution: default-cli}]
[INFO] Source directory does not exist - skipping report.
[INFO] ------------------------------------------------------------------------
[INFO] Building Torque Runtime
[INFO]    task-segment: [clean, install, cobertura:cobertura, findbugs:findbugs, checkstyle:checkstyle]
[INFO] ------------------------------------------------------------------------
[INFO] [clean:clean {execution: default-clean}]
[INFO] [remote-resources:process {execution: default}]
Downloading: http://repo1.maven.org/maven2/org/apache/jcs/jcs/1.3/jcs-1.3.pom
12K downloaded  (jcs-1.3.pom)
Downloading: http://repo1.maven.org/maven2/concurrent/concurrent/1.0/concurrent-1.0.pom
152b downloaded  (concurrent-1.0.pom)
Downloading: http://repo1.maven.org/maven2/org/apache/fulcrum/fulcrum-testcontainer/1.0.6/fulcrum-testcontainer-1.0.6.pom
4K downloaded  (fulcrum-testcontainer-1.0.6.pom)
Downloading: http://repo1.maven.org/maven2/org/apache/fulcrum/fulcrum-parent/1/fulcrum-parent-1.pom
18K downloaded  (fulcrum-parent-1.pom)
Downloading: http://repo1.maven.org/maven2/org/apache/fulcrum/fulcrum-yaafi/1.0.6/fulcrum-yaafi-1.0.6.pom
2K downloaded  (fulcrum-yaafi-1.0.6.pom)
Downloading: http://repo1.maven.org/maven2/org/apache/jcs/jcs/1.3/jcs-1.3.jar
Downloading: http://repo1.maven.org/maven2/org/apache/fulcrum/fulcrum-testcontainer/1.0.6/fulcrum-testcontainer-1.0.6.jar
Downloading: http://repo1.maven.org/maven2/concurrent/concurrent/1.0/concurrent-1.0.jar
247K downloaded  (concurrent-1.0.jar)
13K downloaded  (fulcrum-testcontainer-1.0.6.jar)
Downloading: http://repo1.maven.org/maven2/org/apache/fulcrum/fulcrum-yaafi/1.0.6/fulcrum-yaafi-1.0.6.jar
425K downloaded  (jcs-1.3.jar)
127K downloaded  (fulcrum-yaafi-1.0.6.jar)
[INFO] [resources:resources {execution: default-resources}]
[INFO] Using 'ISO-8859-1' encoding to copy filtered resources.
[INFO] skip non existing resourceDirectory <https://builds.apache.org/job/Torque4-trunk/ws/torque4-trunk/torque-runtime/src/main/resources>
[INFO] Copying 3 resources
[INFO] [compiler:compile {execution: default-compile}]
[INFO] Compiling 106 source files to <https://builds.apache.org/job/Torque4-trunk/ws/torque4-trunk/torque-runtime/target/classes>
[INFO] -------------------------------------------------------------
[ERROR] COMPILATION ERROR : 
[INFO] -------------------------------------------------------------
[ERROR] <https://builds.apache.org/job/Torque4-trunk/ws/torque4-trunk/torque-runtime/src/main/java/org/apache/torque/Torque.java>:[197,39]
type parameters of <T>T cannot be determined; no unique maximal instance exists for
type variable T with upper bounds T,org.apache.torque.manager.AbstractBaseManager<? extends
org.apache.torque.om.Persistent>

[ERROR] <https://builds.apache.org/job/Torque4-trunk/ws/torque4-trunk/torque-runtime/src/main/java/org/apache/torque/Torque.java>:[212,39]
type parameters of <T>T cannot be determined; no unique maximal instance exists for
type variable T with upper bounds T,org.apache.torque.manager.AbstractBaseManager<? extends
org.apache.torque.om.Persistent>

[INFO] 2 errors 
[INFO] -------------------------------------------------------------
[JENKINS] Archiving <https://builds.apache.org/job/Torque4-trunk/ws/torque4-trunk/torque-runtime/pom.xml>
to /home/hudson/hudson/jobs/Torque4-trunk/modules/org.apache.torque$torque-runtime/builds/2012-07-06_07-46-39/archive/org.apache.torque/torque-runtime/4.0-beta1-SNAPSHOT/torque-runtime-4.0-beta1-SNAPSHOT.pom
[INFO] ------------------------------------------------------------------------
[ERROR] BUILD FAILURE
[INFO] ------------------------------------------------------------------------
[INFO] Compilation failure

<https://builds.apache.org/job/Torque4-trunk/ws/torque4-trunk/torque-runtime/src/main/java/org/apache/torque/Torque.java>:[197,39]
type parameters of <T>T cannot be determined; no unique maximal instance exists for
type variable T with upper bounds T,org.apache.torque.manager.AbstractBaseManager<? extends
org.apache.torque.om.Persistent>

<https://builds.apache.org/job/Torque4-trunk/ws/torque4-trunk/torque-runtime/src/main/java/org/apache/torque/Torque.java>:[212,39]
type parameters of <T>T cannot be determined; no unique maximal instance exists for
type variable T with upper bounds T,org.apache.torque.manager.AbstractBaseManager<? extends
org.apache.torque.om.Persistent>


[INFO] ------------------------------------------------------------------------
[INFO] For more information, run Maven with the -e switch
[INFO] ------------------------------------------------------------------------
[INFO] Total time: 53 seconds
[INFO] Finished at: Fri Jul 06 07:48:03 UTC 2012
[INFO] Final Memory: 59M/327M
[INFO] ------------------------------------------------------------------------
Sending e-mails to: torque-dev@db.apache.org
channel stopped
Skipping Cobertura coverage report as build was not UNSTABLE or better ...

---------------------------------------------------------------------
To unsubscribe, e-mail: torque-dev-unsubscribe@db.apache.org
For additional commands, e-mail: torque-dev-help@db.apache.org


Mime
View raw message