db-torque-dev mailing list archives

Site index · List index
Message view « Date » · « Thread »
Top « Date » · « Thread »
From Apache Jenkins Server <jenk...@builds.apache.org>
Subject Build failed in Jenkins: torque4-test-project-hsqldb #115
Date Wed, 18 Jul 2012 03:56:11 GMT
See <https://builds.apache.org/job/torque4-test-project-hsqldb/115/>

------------------------------------------
[...truncated 1455 lines...]
AU        torque-templates/src/main/resources/org/apache/torque/templates/om/templates/dbObject/base/savingMethods.vm
A         torque-templates/src/main/resources/org/apache/torque/templates/om/templates/dbObject/base/isCacheOnSave.vm
AU        torque-templates/src/main/resources/org/apache/torque/templates/om/templates/dbObject/base/foreignKeyGetter.vm
AU        torque-templates/src/main/resources/org/apache/torque/templates/om/templates/dbObject/base/adderReferencingObject.vm
AU        torque-templates/src/main/resources/org/apache/torque/templates/om/templates/dbObject/base/newModifiedMethods.vm
AU        torque-templates/src/main/resources/org/apache/torque/templates/om/templates/dbObject/base/primaryKeyMethods.vm
AU        torque-templates/src/main/resources/org/apache/torque/templates/om/templates/dbObject/base/loadingField.vm
AU        torque-templates/src/main/resources/org/apache/torque/templates/om/templates/dbObject/base/newModifiedFields.vm
AU        torque-templates/src/main/resources/org/apache/torque/templates/om/templates/dbObject/base/initializerReferencingObject.vm
A         torque-templates/src/main/resources/org/apache/torque/templates/om/templates/dbObject/base/bean
AU        torque-templates/src/main/resources/org/apache/torque/templates/om/templates/dbObject/base/bean/objectBeanMethods.vm
AU        torque-templates/src/main/resources/org/apache/torque/templates/om/templates/dbObject/base/bean/objectBeanImports.vm
AU        torque-templates/src/main/resources/org/apache/torque/templates/om/templates/dbObject/base/getterReferencingObject.vm
AU        torque-templates/src/main/resources/org/apache/torque/templates/om/templates/dbObject/base/equalsHashCode.vm
AU        torque-templates/src/main/resources/org/apache/torque/templates/om/templates/dbObject/base/deletedMethods.vm
AU        torque-templates/src/main/resources/org/apache/torque/templates/om/templates/dbObject/base/savingField.vm
AU        torque-templates/src/main/resources/org/apache/torque/templates/om/templates/dbObject/base/classJavadoc.vm
AU        torque-templates/src/main/resources/org/apache/torque/templates/om/templates/dbObject/dbObject.vm
AU        torque-templates/src/main/resources/org/apache/torque/templates/om/templates/dbObject/classJavadoc.vm
A         torque-templates/src/main/resources/org/apache/torque/templates/om/templates/general
AU        torque-templates/src/main/resources/org/apache/torque/templates/om/templates/general/setterMethodEnd.vm
AU        torque-templates/src/main/resources/org/apache/torque/templates/om/templates/general/setterReferencedObject.vm
AU        torque-templates/src/main/resources/org/apache/torque/templates/om/templates/general/getterSetter.vm
AU        torque-templates/src/main/resources/org/apache/torque/templates/om/templates/general/saveMethods.vm
AU        torque-templates/src/main/resources/org/apache/torque/templates/om/templates/general/createDbObjectInstance.vm
AU        torque-templates/src/main/resources/org/apache/torque/templates/om/templates/general/setterMethodStart.vm
AU        torque-templates/src/main/resources/org/apache/torque/templates/om/templates/general/setter.vm
AU        torque-templates/src/main/resources/org/apache/torque/templates/om/templates/general/serialVersionUid.vm
AU        torque-templates/src/main/resources/org/apache/torque/templates/om/templates/general/getter.vm
AU        torque-templates/src/main/resources/org/apache/torque/templates/om/templates/general/fieldDefinition.vm
A         torque-templates/src/main/resources/org/apache/torque/templates/xsd
AU        torque-templates/src/main/resources/org/apache/torque/templates/xsd/database-4-0.xsd
AU        torque-templates/src/main/resources/org/apache/torque/templates/xsd/database-4-0-strict.xsd
A         torque-templates/src/changes
A         torque-templates/src/changes/changes.xml
A         torque-templates/pom.xml
A         torque-test
A         torque-test/torque-gen.properties
AU        torque-test/profiles.xml
A         torque-test/src
A         torque-test/src/test
A         torque-test/src/test/sql
AU        torque-test/src/test/sql/schema.sql.ref.xml
AU        torque-test/src/test/sql/schema.sql
A         torque-test/src/test/profile
A         torque-test/src/test/profile/derbyEmbedded
A         torque-test/src/test/profile/derbyEmbedded/notes.txt
A         torque-test/src/test/profile/derbyEmbedded/Torque.properties
A         torque-test/src/test/profile/mssql
A         torque-test/src/test/profile/mssql/Torque.properties
A         torque-test/src/test/profile/postgresql
AU        torque-test/src/test/profile/postgresql/Torque.properties
A         torque-test/src/test/profile/derby
A         torque-test/src/test/profile/derby/notes.txt
AU        torque-test/src/test/profile/derby/Torque.properties
A         torque-test/src/test/profile/mysql
AU        torque-test/src/test/profile/mysql/Torque.properties
A         torque-test/src/test/profile/oracle
AU        torque-test/src/test/profile/oracle/Torque.properties
A         torque-test/src/test/profile/henning
AU        torque-test/src/test/profile/henning/Torque.properties
A         torque-test/src/test/profile/jmcnally
AU        torque-test/src/test/profile/jmcnally/Torque.properties
A         torque-test/src/test/profile/tv
A         torque-test/src/test/profile/tv/Torque.properties
A         torque-test/src/test/profile/hsqldb
AU        torque-test/src/test/profile/hsqldb/Torque.properties
A         torque-test/src/test/java
A         torque-test/src/test/java/org
A         torque-test/src/test/java/org/apache
A         torque-test/src/test/java/org/apache/torque
A         torque-test/src/test/java/org/apache/torque/test
AU        torque-test/src/test/java/org/apache/torque/test/InheritanceClassnameTestChild1.java
AU        torque-test/src/test/java/org/apache/torque/test/InheritanceClassnameTestChild2.java
AU        torque-test/src/test/java/org/apache/torque/InitShutdownTest.java
A         torque-test/src/test/java/org/apache/torque/adapter
AU        torque-test/src/test/java/org/apache/torque/adapter/AdapterTest.java
A         torque-test/src/test/java/org/apache/torque/avalon
AU        torque-test/src/test/java/org/apache/torque/avalon/AvalonMapBuildersTest.java
AU        torque-test/src/test/java/org/apache/torque/DataTest.java
AU        torque-test/src/test/java/org/apache/torque/JndiConfigurationTest.java
AU        torque-test/src/test/java/org/apache/torque/ForeignKeySchemaData.java
A         torque-test/src/test/java/org/apache/torque/datatypes
AU        torque-test/src/test/java/org/apache/torque/datatypes/BooleanIntCharTest.java
AU        torque-test/src/test/java/org/apache/torque/datatypes/BitTest.java
A         torque-test/src/test/java/org/apache/torque/generated
A         torque-test/src/test/java/org/apache/torque/generated/dataobject
AU        torque-test/src/test/java/org/apache/torque/generated/dataobject/ForeignKeyAdderTest.java
AU        torque-test/src/test/java/org/apache/torque/generated/dataobject/ViewTest.java
AU        torque-test/src/test/java/org/apache/torque/generated/dataobject/ForeignKeyGetterTest.java
AU        torque-test/src/test/java/org/apache/torque/generated/dataobject/SaveTest.java
A         torque-test/src/test/java/org/apache/torque/generated/peer
AU        torque-test/src/test/java/org/apache/torque/generated/peer/JoinTest.java
AU        torque-test/src/test/java/org/apache/torque/generated/peer/SelectTest.java
A         torque-test/src/test/java/org/apache/torque/generated/peer/DefaultValueTest.java
AU        torque-test/src/test/java/org/apache/torque/generated/peer/WhereClauseSubselectTest.java
AU        torque-test/src/test/java/org/apache/torque/generated/peer/DeleteTest.java
AU        torque-test/src/test/java/org/apache/torque/generated/peer/SaveMethodsInPeerTest.java
A         torque-test/src/test/java/org/apache/torque/generated/peer/SelectFunctionTest.java
AU        torque-test/src/test/java/org/apache/torque/generated/peer/SelectInTest.java
AU        torque-test/src/test/java/org/apache/torque/generated/peer/UseDefaultValueFromDatabaseTest.java
AU        torque-test/src/test/java/org/apache/torque/generated/peer/GetRelatedObjectsTest.java
AU        torque-test/src/test/java/org/apache/torque/generated/peer/DateTest.java
AU        torque-test/src/test/java/org/apache/torque/generated/peer/FillerTest.java
A         torque-test/src/test/java/org/apache/torque/sql
AU        torque-test/src/test/java/org/apache/torque/sql/DatabaseTools.java
AU        torque-test/src/test/java/org/apache/torque/sql/SkipSqlTest.java
AU        torque-test/src/test/java/org/apache/torque/PkSchemaData.java
AU        torque-test/src/test/java/org/apache/torque/DocsTest.java
AU        torque-test/src/test/java/org/apache/torque/BeanTestConditional.java
AU        torque-test/src/test/java/org/apache/torque/BaseDatabaseTestCase.java
A         torque-test/src/test/java/org/apache/torque/oid
AU        torque-test/src/test/java/org/apache/torque/oid/IDBrokerTest.java
A         torque-test/src/test/java/org/apache/torque/om
AU        torque-test/src/test/java/org/apache/torque/om/OMByNameMethodsTest.java
A         torque-test/src/test/java/org/apache/torque/map
AU        torque-test/src/test/java/org/apache/torque/map/DatabaseMapTest.java
A         torque-test/src/test/java/org/apache/torque/util
AU        torque-test/src/test/java/org/apache/torque/util/BasePeerTest.java
AU        torque-test/src/test/java/org/apache/torque/util/LargeSelectTest.java
AU        torque-test/src/test/java/org/apache/torque/util/SummaryHelperTest.java
AU        torque-test/src/test/java/org/apache/torque/util/CopyTestConditional.java
AU        torque-test/src/test/java/org/apache/torque/ManagerTestConditional.java
A         torque-test/src/test/resources
AU        torque-test/src/test/resources/TestRoleConfig.xml
AU        torque-test/src/test/resources/TestComponentConfig.xml
AU        torque-test/src/test/resources/commons-logging.properties
AU        torque-test/src/test/resources/log4j.properties
AU        torque-test/src/test/resources/cache.ccf
AU        torque-test/src/test/resources/TurbineResources.properties
A         torque-test/src/main
A         torque-test/src/main/schema
A         torque-test/src/main/schema/types-schema.xml
A         torque-test/src/main/schema/databaseMapInit-schema.xml
AU        torque-test/src/main/schema/bookstore-schema.xml
A         torque-test/src/main/schema/included-schema.xml
A         torque-test/src/main/schema/index.xml
A         torque-test/src/main/schema/save-method-in-peer-schema.xml
A         torque-test/src/main/schema/pk-schema.xml
A         torque-test/src/main/schema/included-from-included-schema.xml
A         torque-test/src/main/schema/default-value-schema.xml
A         torque-test/src/main/schema/foreign-key-schema.xml
AU        torque-test/src/main/schema/test-schema.xml
AU        torque-test/src/main/schema/ext-schema.xml
AU        torque-test/src/main/schema/extext-schema.xml
AU        torque-test/src/main/schema/id-table-schema.xml
A         torque-test/src/main/java
A         torque-test/src/main/java/org
A         torque-test/src/main/java/org/apache
A         torque-test/src/main/java/org/apache/torque
AU        torque-test/src/main/java/org/apache/torque/TestInterface.java
A         torque-test/src/main/torque-gen
A         torque-test/src/main/torque-gen/outlets
A         torque-test/src/main/torque-gen/outlets/peer.xml
A         torque-test/src/main/torque-gen/conf
A         torque-test/src/main/torque-gen/conf/control.xml
A         torque-test/src/main/torque-gen/templates
A         torque-test/src/main/torque-gen/templates/peer
A         torque-test/src/main/torque-gen/templates/peer/base
A         torque-test/src/main/torque-gen/templates/peer/base/classAnnotations.vm
AU        torque-test/pom.xml
At revision 1362754
no revision recorded for http://svn.apache.org/repos/asf/db/torque/torque4/trunk in the previous
build
Parsing POMs
Discovered a new module org.apache.torque:torque-maven-parent Torque Maven Parent
Discovered a new module org.apache.torque:torque-runtime Torque Runtime
Discovered a new module org.apache.torque:torque-generator Torque Generator
Discovered a new module org.apache.torque:torque-templates Torque Templates
Discovered a new module org.apache.torque:torque-maven-plugin Torque Generator Maven 2 Plugin
Discovered a new module org.apache.torque:torque-ant-tasks Torque Generator Ant tasks
Discovered a new module org.apache.torque:torque-site Torque Site
Modules changed, recalculating dependency graph
[torque-maven-parent] $ /home/hudson/tools/java/latest1.5/bin/java -cp /home/jenkins/jenkins-slave/maven-agent.jar:/home/jenkins/jenkins-slave/classworlds.jar
hudson.maven.agent.Main /home/hudson/tools/maven/apache-maven-2.2.1 /home/jenkins/jenkins-slave/slave.jar
/home/jenkins/jenkins-slave/maven-interceptor.jar 43439 /home/jenkins/jenkins-slave/maven2.1-interceptor.jar
<===[JENKINS REMOTING channel started
CAPACITY]===>   log4j:WARN No appenders could be found for logger (org.apache.commons.beanutils.converters.BooleanConverter).
log4j:WARN Please initialize the log4j system properly.
Executing Maven:  -B -f <https://builds.apache.org/job/torque4-test-project-hsqldb/ws/torque-maven-parent/pom.xml>
-Dmaven.repo.local=/home/jenkins/jenkins-slave/maven-repositories/0 -Ptest,hsqldb,beans,managers
clean install
[INFO] Scanning for projects...
[INFO] Reactor build order: 
[INFO]   Torque Maven Parent
[INFO]   Torque Runtime
[INFO]   Torque Generator
[INFO]   Torque Templates
[INFO]   Torque Generator Maven 2 Plugin
[INFO]   Torque Generator Ant tasks
[INFO]   Torque Site
[INFO]   Torque Test Project
[INFO] ------------------------------------------------------------------------
[INFO] Building Torque Maven Parent
[INFO]    task-segment: [clean, install]
[INFO] ------------------------------------------------------------------------
[INFO] [clean:clean {execution: default-clean}]
[INFO] [remote-resources:process {execution: default}]
[INFO] [site:attach-descriptor {execution: default-attach-descriptor}]
[INFO] Preparing source:jar
[WARNING] Removing: jar from forked lifecycle, to prevent recursive invocation.
[INFO] No goals needed for project - skipping
[INFO] [source:jar {execution: default}]
[INFO] [apache-rat:check {execution: default}]
[INFO] Exclude: velocity.log
[INFO] Exclude: .checkstyle
[INFO] Exclude: checkstyle-cache.ccf
[INFO] Exclude: derby.log
[INFO] Exclude: LICENSE-EDL.txt
[INFO] [install:install {execution: default-install}]
[INFO] Installing <https://builds.apache.org/job/torque4-test-project-hsqldb/ws/torque-maven-parent/pom.xml>
to /home/jenkins/jenkins-slave/maven-repositories/0/org/apache/torque/torque-maven-parent/4.0-beta1-SNAPSHOT/torque-maven-parent-4.0-beta1-SNAPSHOT.pom
[JENKINS] Archiving <https://builds.apache.org/job/torque4-test-project-hsqldb/ws/torque-maven-parent/pom.xml>
to /home/hudson/hudson/jobs/torque4-test-project-hsqldb/modules/org.apache.torque$torque-maven-parent/builds/2012-07-18_03-55-14/archive/org.apache.torque/torque-maven-parent/4.0-beta1-SNAPSHOT/torque-maven-parent-4.0-beta1-SNAPSHOT.pom
[INFO] ------------------------------------------------------------------------
[INFO] Building Torque Runtime
[INFO]    task-segment: [clean, install]
[INFO] ------------------------------------------------------------------------
[INFO] [clean:clean {execution: default-clean}]
[INFO] [remote-resources:process {execution: default}]
[debug] execute contextualize
[INFO] [resources:resources {execution: default-resources}]
[INFO] Using 'ISO-8859-1' encoding to copy filtered resources.
[INFO] skip non existing resourceDirectory <https://builds.apache.org/job/torque4-test-project-hsqldb/ws/torque-runtime/src/main/resources>
[INFO] Copying 3 resources
[INFO] [compiler:compile {execution: default-compile}]
[INFO] Compiling 106 source files to <https://builds.apache.org/job/torque4-test-project-hsqldb/ws/torque-runtime/target/classes>
[INFO] -------------------------------------------------------------
[ERROR] COMPILATION ERROR : 
[INFO] -------------------------------------------------------------
[ERROR] <https://builds.apache.org/job/torque4-test-project-hsqldb/ws/torque-runtime/src/main/java/org/apache/torque/Torque.java>:[197,39]
type parameters of <T>T cannot be determined; no unique maximal instance exists for
type variable T with upper bounds T,org.apache.torque.manager.AbstractBaseManager<? extends
org.apache.torque.om.Persistent>

[ERROR] <https://builds.apache.org/job/torque4-test-project-hsqldb/ws/torque-runtime/src/main/java/org/apache/torque/Torque.java>:[212,39]
type parameters of <T>T cannot be determined; no unique maximal instance exists for
type variable T with upper bounds T,org.apache.torque.manager.AbstractBaseManager<? extends
org.apache.torque.om.Persistent>

[INFO] 2 errors 
[INFO] -------------------------------------------------------------
[JENKINS] Archiving <https://builds.apache.org/job/torque4-test-project-hsqldb/ws/torque-runtime/pom.xml>
to /home/hudson/hudson/jobs/torque4-test-project-hsqldb/modules/org.apache.torque$torque-runtime/builds/2012-07-18_03-55-14/archive/org.apache.torque/torque-runtime/4.0-beta1-SNAPSHOT/torque-runtime-4.0-beta1-SNAPSHOT.pom
[INFO] ------------------------------------------------------------------------
[ERROR] BUILD FAILURE
[INFO] ------------------------------------------------------------------------
[INFO] Compilation failure

<https://builds.apache.org/job/torque4-test-project-hsqldb/ws/torque-runtime/src/main/java/org/apache/torque/Torque.java>:[197,39]
type parameters of <T>T cannot be determined; no unique maximal instance exists for
type variable T with upper bounds T,org.apache.torque.manager.AbstractBaseManager<? extends
org.apache.torque.om.Persistent>

<https://builds.apache.org/job/torque4-test-project-hsqldb/ws/torque-runtime/src/main/java/org/apache/torque/Torque.java>:[212,39]
type parameters of <T>T cannot be determined; no unique maximal instance exists for
type variable T with upper bounds T,org.apache.torque.manager.AbstractBaseManager<? extends
org.apache.torque.om.Persistent>


[INFO] ------------------------------------------------------------------------
[INFO] For more information, run Maven with the -e switch
[INFO] ------------------------------------------------------------------------
[INFO] Total time: 29 seconds
[INFO] Finished at: Wed Jul 18 03:56:10 UTC 2012
[INFO] Final Memory: 48M/323M
[INFO] ------------------------------------------------------------------------
Sending e-mails to: torque-dev@db.apache.org
channel stopped

---------------------------------------------------------------------
To unsubscribe, e-mail: torque-dev-unsubscribe@db.apache.org
For additional commands, e-mail: torque-dev-help@db.apache.org


Mime
View raw message