db-torque-dev mailing list archives

Site index · List index
Message view « Date » · « Thread »
Top « Date » · « Thread »
From Apache Jenkins Server <jenk...@builds.apache.org>
Subject Build failed in Jenkins: Torque4-trunk #219
Date Tue, 26 Jun 2012 13:21:08 GMT
See <https://builds.apache.org/job/Torque4-trunk/219/changes>

Changes:

[tfischer] Allow setting a defaultOutputEncoding from the maven and ant plugins

------------------------------------------
[...truncated 8044 lines...]
4718 [main] DEBUG org.apache.torque.generator.source.transform.SourceTargetAttributeTransformer
 - overwrite set to false
DEBUG org.apache.torque.generator.source.transform.SourceTargetAttributeTransformer - targetAttributeName
set to targetAttribute
4719 [main] DEBUG org.apache.torque.generator.source.transform.SourceTargetAttributeTransformer
 - targetAttributeName set to targetAttribute
Tests run: 4, Failures: 0, Errors: 0, Skipped: 0, Time elapsed: 0.009 sec
Running org.apache.torque.generator.qname.QualifiedNameMapTest
Tests run: 4, Failures: 0, Errors: 0, Skipped: 0, Time elapsed: 0.006 sec
Running org.apache.torque.generator.control.TokenReplacerTest
Tests run: 9, Failures: 0, Errors: 0, Skipped: 0, Time elapsed: 0.01 sec
Running org.apache.torque.generator.processor.string.CamelbackerTest
Tests run: 5, Failures: 0, Errors: 0, Skipped: 0, Time elapsed: 0.006 sec
Running org.apache.torque.generator.source.transform.AttributeTransformerTest
ERROR org.apache.torque.generator.source.transform.AttributeTransformer - Definition type
option may not occur in target 
4760 [main] ERROR org.apache.torque.generator.source.transform.AttributeTransformer  - Definition
type option may not occur in target 
ERROR org.apache.torque.generator.source.transform.AttributeTransformer - Definition type
option may not occur in target 
4761 [main] ERROR org.apache.torque.generator.source.transform.AttributeTransformer  - Definition
type option may not occur in target 
ERROR org.apache.torque.generator.source.transform.AttributeTransformer - Definition type
option may not occur in target 
4762 [main] ERROR org.apache.torque.generator.source.transform.AttributeTransformer  - Definition
type option may not occur in target 
ERROR org.apache.torque.generator.source.transform.AttributeTransformer - While parsing "${unknownDefinition:torque.unknownDefinition}"
: Unknown definition type unknownDefinition at Position 19
4763 [main] ERROR org.apache.torque.generator.source.transform.AttributeTransformer  - While
parsing "${unknownDefinition:torque.unknownDefinition}" : Unknown definition type unknownDefinition
at Position 19
ERROR org.apache.torque.generator.source.transform.AttributeTransformer - Definition type
plain may not occur in target 
4763 [main] ERROR org.apache.torque.generator.source.transform.AttributeTransformer  - Definition
type plain may not occur in target 
ERROR org.apache.torque.generator.source.transform.AttributeTransformer - Definition type
option may not occur in target 
4764 [main] ERROR org.apache.torque.generator.source.transform.AttributeTransformer  - Definition
type option may not occur in target 
ERROR org.apache.torque.generator.source.transform.AttributeTransformer - Definition type
attribute may not occur in target 
4765 [main] ERROR org.apache.torque.generator.source.transform.AttributeTransformer  - Definition
type attribute may not occur in target 
ERROR org.apache.torque.generator.source.transform.AttributeTransformer - Definition type
attribute(noOverride) may not occur in source 
4766 [main] ERROR org.apache.torque.generator.source.transform.AttributeTransformer  - Definition
type attribute(noOverride) may not occur in source 
ERROR org.apache.torque.generator.source.transform.AttributeTransformer - Definition type
attribute(override) may not occur in source 
4767 [main] ERROR org.apache.torque.generator.source.transform.AttributeTransformer  - Definition
type attribute(override) may not occur in source 
Tests run: 17, Failures: 0, Errors: 0, Skipped: 0, Time elapsed: 0.025 sec
Running org.apache.torque.generator.source.stream.SourceToXmlTest
DEBUG org.apache.torque.generator.source.stream.FileSource - start creating root Element
4772 [main] DEBUG org.apache.torque.generator.source.stream.FileSource  - start creating root
Element
DEBUG org.apache.torque.generator.source.stream.FileSource - Reading file <https://builds.apache.org/job/Torque4-trunk/ws/torque4-trunk/torque-generator/src/test/resources/org/apache/torque/generator/source/xml/source.xml>
of type xml
4773 [main] DEBUG org.apache.torque.generator.source.stream.FileSource  - Reading file <https://builds.apache.org/job/Torque4-trunk/ws/torque4-trunk/torque-generator/src/test/resources/org/apache/torque/generator/source/xml/source.xml>
of type xml
DEBUG org.apache.torque.generator.source.stream.FileSource - finished creating root Element,
source is
<root rootElementAttribute="rootElementAttributeValue" id="1">
  <secondLevelElement1 id="2">
    <thirdLevelElement1 tla="tlaValue" id="3"/>
  </secondLevelElement1>
  <secondLevelElement2 id="4"/>
  <secondLevelElement3 sla="slaValue" id="5"> text For Second Level Element 3 <thirdLevelElement2
tla2="tla2Value" id="6"/>
  </secondLevelElement3>
  <secondLevelElement4 id="7">  text For Second Level Element 4  </secondLevelElement4>
</root>

4777 [main] DEBUG org.apache.torque.generator.source.stream.FileSource  - finished creating
root Element, source is
<root rootElementAttribute="rootElementAttributeValue" id="1">
  <secondLevelElement1 id="2">
    <thirdLevelElement1 tla="tlaValue" id="3"/>
  </secondLevelElement1>
  <secondLevelElement2 id="4"/>
  <secondLevelElement3 sla="slaValue" id="5"> text For Second Level Element 3 <thirdLevelElement2
tla2="tla2Value" id="6"/>
  </secondLevelElement3>
  <secondLevelElement4 id="7">  text For Second Level Element 4  </secondLevelElement4>
</root>

DEBUG org.apache.torque.generator.source.stream.FileSource - start creating root Element
4779 [main] DEBUG org.apache.torque.generator.source.stream.FileSource  - start creating root
Element
DEBUG org.apache.torque.generator.source.stream.FileSource - Reading file <https://builds.apache.org/job/Torque4-trunk/ws/torque4-trunk/torque-generator/src/test/resources/org/apache/torque/generator/source/xml/source.xml>
of type xml
4779 [main] DEBUG org.apache.torque.generator.source.stream.FileSource  - Reading file <https://builds.apache.org/job/Torque4-trunk/ws/torque4-trunk/torque-generator/src/test/resources/org/apache/torque/generator/source/xml/source.xml>
of type xml
DEBUG org.apache.torque.generator.source.stream.FileSource - finished creating root Element,
source is
<root rootElementAttribute="rootElementAttributeValue" id="1">
  <secondLevelElement1 id="2">
    <thirdLevelElement1 tla="tlaValue" id="3"/>
  </secondLevelElement1>
  <secondLevelElement2 id="4"/>
  <secondLevelElement3 sla="slaValue" id="5"> text For Second Level Element 3 <thirdLevelElement2
tla2="tla2Value" id="6"/>
  </secondLevelElement3>
  <secondLevelElement4 id="7">  text For Second Level Element 4  </secondLevelElement4>
</root>

4781 [main] DEBUG org.apache.torque.generator.source.stream.FileSource  - finished creating
root Element, source is
<root rootElementAttribute="rootElementAttributeValue" id="1">
  <secondLevelElement1 id="2">
    <thirdLevelElement1 tla="tlaValue" id="3"/>
  </secondLevelElement1>
  <secondLevelElement2 id="4"/>
  <secondLevelElement3 sla="slaValue" id="5"> text For Second Level Element 3 <thirdLevelElement2
tla2="tla2Value" id="6"/>
  </secondLevelElement3>
  <secondLevelElement4 id="7">  text For Second Level Element 4  </secondLevelElement4>
</root>

Tests run: 5, Failures: 0, Errors: 0, Skipped: 0, Time elapsed: 0.015 sec
Running org.apache.torque.generator.source.properties.PropertiesParserTest
DEBUG org.apache.torque.generator.source.stream.FileSource - start creating root Element
4787 [main] DEBUG org.apache.torque.generator.source.stream.FileSource  - start creating root
Element
DEBUG org.apache.torque.generator.source.stream.FileSource - Reading file <https://builds.apache.org/job/Torque4-trunk/ws/torque4-trunk/torque-generator/src/test/resources/org/apache/torque/generator/source/properties/propertiesParserTest.properties>
of type properties
4787 [main] DEBUG org.apache.torque.generator.source.stream.FileSource  - Reading file <https://builds.apache.org/job/Torque4-trunk/ws/torque4-trunk/torque-generator/src/test/resources/org/apache/torque/generator/source/properties/propertiesParserTest.properties>
of type properties
DEBUG org.apache.torque.generator.source.stream.FileSource - finished creating root Element,
source is
<properties id="1">
  <entry key="propertyName1" id="2">propertyValue1</entry>
  <entry key="propertyName2" id="3">propertyValue2</entry>
</properties>

4788 [main] DEBUG org.apache.torque.generator.source.stream.FileSource  - finished creating
root Element, source is
<properties id="1">
  <entry key="propertyName1" id="2">propertyValue1</entry>
  <entry key="propertyName2" id="3">propertyValue2</entry>
</properties>

Tests run: 2, Failures: 0, Errors: 0, Skipped: 0, Time elapsed: 0.005 sec

Results :

Failed tests: 
  testOutputEncoding(org.apache.torque.generator.control.OutputEncodingTest)

Tests run: 183, Failures: 1, Errors: 0, Skipped: 0

Cobertura: Loaded information on 186 classes.
Cobertura: Saved information on 186 classes.
[ERROR] There are test failures.

Please refer to <https://builds.apache.org/job/Torque4-trunk/ws/torque4-trunk/torque-generator/target/surefire-reports>
for the individual test results.
[JENKINS] Recording test results
[JENKINS] cobertura-maven-plugin already configured with xml reports enabled[INFO] [cobertura:cobertura
{execution: default-cli}]

[INFO] Cobertura 1.9.2 - GNU GPL License (NO WARRANTY) - See COPYRIGHT file
Cobertura: Loaded information on 186 classes.
Report time: 2405ms

[INFO] Cobertura Report generation was successful.
[INFO] Cobertura 1.9.2 - GNU GPL License (NO WARRANTY) - See COPYRIGHT file
Cobertura: Loaded information on 186 classes.
Report time: 1529ms

[INFO] Cobertura Report generation was successful.
[JENKINS] Recording coverage results
[INFO] Preparing findbugs:findbugs
[INFO] [remote-resources:process {execution: default}]
[INFO] [resources:resources {execution: default-resources}]
[INFO] Using 'ISO-8859-1' encoding to copy filtered resources.
[INFO] Copying 3 resources
[INFO] Copying 3 resources
[INFO] Copying 3 resources
[INFO] [compiler:compile {execution: default-compile}]
[INFO] Nothing to compile - all classes are up to date
[INFO] [findbugs:findbugs {execution: default-cli}]
[INFO] Locale is en
     [java] Warnings generated: 1
[FINDBUGS] Parsing 1 files in <https://builds.apache.org/job/Torque4-trunk/ws/torque4-trunk/torque-generator/target>
[FINDBUGS] Successfully parsed file <https://builds.apache.org/job/Torque4-trunk/ws/torque4-trunk/torque-generator/target/findbugsXml.xml>
of module Torque Generator with 1 warnings.
[FINDBUGS] Computing warning deltas based on reference build #218
[INFO] [checkstyle:checkstyle {execution: default-cli}]
[INFO] 
[INFO] ------------------------------------------------------------------------
[INFO] Building Torque Templates
[INFO]    task-segment: [clean, install, cobertura:cobertura, findbugs:findbugs, checkstyle:checkstyle]
[INFO] ------------------------------------------------------------------------
[INFO] [clean:clean {execution: default-clean}]
[INFO] Deleting file set: <https://builds.apache.org/job/Torque4-trunk/ws/torque4-trunk/torque-templates/target>
(included: [**], excluded: [])
[INFO] [remote-resources:process {execution: default}]
[INFO] [resources:resources {execution: default-resources}]
[INFO] Using 'ISO-8859-1' encoding to copy filtered resources.
[INFO] Copying 271 resources
[INFO] Copying 3 resources
[INFO] [compiler:compile {execution: default-compile}]
[INFO] Compiling 58 source files to <https://builds.apache.org/job/Torque4-trunk/ws/torque4-trunk/torque-templates/target/classes>
[INFO] [resources:testResources {execution: default-testResources}]
[INFO] Using 'ISO-8859-1' encoding to copy filtered resources.
[INFO] Copying 2 resources
[INFO] Copying 3 resources
[INFO] [compiler:testCompile {execution: default-testCompile}]
[INFO] Compiling 2 source files to <https://builds.apache.org/job/Torque4-trunk/ws/torque4-trunk/torque-templates/target/test-classes>
[INFO] -------------------------------------------------------------
[ERROR] COMPILATION ERROR : 
[INFO] -------------------------------------------------------------
[ERROR] <https://builds.apache.org/job/Torque4-trunk/ws/torque4-trunk/torque-templates/src/test/java/org/apache/torque/templates/jdbc2schema/Jdbc2SchemaTest.java>:[132,28]
cannot find symbol
symbol  : constructor UnitDescriptor(org.apache.torque.generator.configuration.UnitDescriptor.Packaging,org.apache.torque.generator.configuration.paths.CustomProjectPaths,org.apache.torque.generator.configuration.paths.DefaultTorqueGeneratorPaths,<nulltype>,<nulltype>,org.apache.torque.generator.configuration.option.MapOptionsConfiguration,<nulltype>)
location: class org.apache.torque.generator.configuration.UnitDescriptor

[ERROR] <https://builds.apache.org/job/Torque4-trunk/ws/torque4-trunk/torque-templates/src/test/java/org/apache/torque/templates/TestProcessing.java>:[104,28]
cannot find symbol
symbol  : constructor UnitDescriptor(org.apache.torque.generator.configuration.UnitDescriptor.Packaging,org.apache.torque.generator.configuration.paths.CustomProjectPaths,org.apache.torque.generator.configuration.paths.DefaultTorqueGeneratorPaths,<nulltype>,org.apache.torque.generator.source.SourceProvider,org.apache.torque.generator.configuration.option.MapOptionsConfiguration,<nulltype>)
location: class org.apache.torque.generator.configuration.UnitDescriptor

[ERROR] <https://builds.apache.org/job/Torque4-trunk/ws/torque4-trunk/torque-templates/src/test/java/org/apache/torque/templates/TestProcessing.java>:[127,28]
cannot find symbol
symbol  : constructor UnitDescriptor(org.apache.torque.generator.configuration.UnitDescriptor.Packaging,org.apache.torque.generator.configuration.paths.CustomProjectPaths,org.apache.torque.generator.configuration.paths.DefaultTorqueGeneratorPaths,<nulltype>,<nulltype>,org.apache.torque.generator.configuration.option.MapOptionsConfiguration,<nulltype>)
location: class org.apache.torque.generator.configuration.UnitDescriptor

[ERROR] <https://builds.apache.org/job/Torque4-trunk/ws/torque4-trunk/torque-templates/src/test/java/org/apache/torque/templates/TestProcessing.java>:[150,28]
cannot find symbol
symbol  : constructor UnitDescriptor(org.apache.torque.generator.configuration.UnitDescriptor.Packaging,org.apache.torque.generator.configuration.paths.CustomProjectPaths,org.apache.torque.generator.configuration.paths.DefaultTorqueGeneratorPaths,<nulltype>,<nulltype>,org.apache.torque.generator.configuration.option.MapOptionsConfiguration,<nulltype>)
location: class org.apache.torque.generator.configuration.UnitDescriptor

[ERROR] <https://builds.apache.org/job/Torque4-trunk/ws/torque4-trunk/torque-templates/src/test/java/org/apache/torque/templates/TestProcessing.java>:[173,28]
cannot find symbol
symbol  : constructor UnitDescriptor(org.apache.torque.generator.configuration.UnitDescriptor.Packaging,org.apache.torque.generator.configuration.paths.CustomProjectPaths,org.apache.torque.generator.configuration.paths.DefaultTorqueGeneratorPaths,<nulltype>,<nulltype>,org.apache.torque.generator.configuration.option.MapOptionsConfiguration,<nulltype>)
location: class org.apache.torque.generator.configuration.UnitDescriptor

[ERROR] <https://builds.apache.org/job/Torque4-trunk/ws/torque4-trunk/torque-templates/src/test/java/org/apache/torque/templates/TestProcessing.java>:[195,28]
cannot find symbol
symbol  : constructor UnitDescriptor(org.apache.torque.generator.configuration.UnitDescriptor.Packaging,org.apache.torque.generator.configuration.paths.CustomProjectPaths,org.apache.torque.generator.configuration.paths.DefaultTorqueGeneratorPaths,<nulltype>,<nulltype>,org.apache.torque.generator.configuration.option.MapOptionsConfiguration,<nulltype>)
location: class org.apache.torque.generator.configuration.UnitDescriptor

[ERROR] <https://builds.apache.org/job/Torque4-trunk/ws/torque4-trunk/torque-templates/src/test/java/org/apache/torque/templates/TestProcessing.java>:[217,28]
cannot find symbol
symbol  : constructor UnitDescriptor(org.apache.torque.generator.configuration.UnitDescriptor.Packaging,org.apache.torque.generator.configuration.paths.CustomProjectPaths,org.apache.torque.generator.configuration.paths.DefaultTorqueGeneratorPaths,<nulltype>,<nulltype>,org.apache.torque.generator.configuration.option.MapOptionsConfiguration,<nulltype>)
location: class org.apache.torque.generator.configuration.UnitDescriptor

[INFO] 7 errors 
[INFO] -------------------------------------------------------------
[JENKINS] Archiving <https://builds.apache.org/job/Torque4-trunk/ws/torque4-trunk/torque-templates/pom.xml>
to /home/hudson/hudson/jobs/Torque4-trunk/modules/org.apache.torque$torque-templates/builds/2012-06-26_13-12-43/archive/org.apache.torque/torque-templates/4.0-alpha1-SNAPSHOT/torque-templates-4.0-alpha1-SNAPSHOT.pom
[INFO] ------------------------------------------------------------------------
[ERROR] BUILD FAILURE
[INFO] ------------------------------------------------------------------------
[INFO] Compilation failure

<https://builds.apache.org/job/Torque4-trunk/ws/torque4-trunk/torque-templates/src/test/java/org/apache/torque/templates/jdbc2schema/Jdbc2SchemaTest.java>:[132,28]
cannot find symbol
symbol  : constructor UnitDescriptor(org.apache.torque.generator.configuration.UnitDescriptor.Packaging,org.apache.torque.generator.configuration.paths.CustomProjectPaths,org.apache.torque.generator.configuration.paths.DefaultTorqueGeneratorPaths,<nulltype>,<nulltype>,org.apache.torque.generator.configuration.option.MapOptionsConfiguration,<nulltype>)
location: class org.apache.torque.generator.configuration.UnitDescriptor

<https://builds.apache.org/job/Torque4-trunk/ws/torque4-trunk/torque-templates/src/test/java/org/apache/torque/templates/TestProcessing.java>:[104,28]
cannot find symbol
symbol  : constructor UnitDescriptor(org.apache.torque.generator.configuration.UnitDescriptor.Packaging,org.apache.torque.generator.configuration.paths.CustomProjectPaths,org.apache.torque.generator.configuration.paths.DefaultTorqueGeneratorPaths,<nulltype>,org.apache.torque.generator.source.SourceProvider,org.apache.torque.generator.configuration.option.MapOptionsConfiguration,<nulltype>)
location: class org.apache.torque.generator.configuration.UnitDescriptor

<https://builds.apache.org/job/Torque4-trunk/ws/torque4-trunk/torque-templates/src/test/java/org/apache/torque/templates/TestProcessing.java>:[127,28]
cannot find symbol
symbol  : constructor UnitDescriptor(org.apache.torque.generator.configuration.UnitDescriptor.Packaging,org.apache.torque.generator.configuration.paths.CustomProjectPaths,org.apache.torque.generator.configuration.paths.DefaultTorqueGeneratorPaths,<nulltype>,<nulltype>,org.apache.torque.generator.configuration.option.MapOptionsConfiguration,<nulltype>)
location: class org.apache.torque.generator.configuration.UnitDescriptor

<https://builds.apache.org/job/Torque4-trunk/ws/torque4-trunk/torque-templates/src/test/java/org/apache/torque/templates/TestProcessing.java>:[150,28]
cannot find symbol
symbol  : constructor UnitDescriptor(org.apache.torque.generator.configuration.UnitDescriptor.Packaging,org.apache.torque.generator.configuration.paths.CustomProjectPaths,org.apache.torque.generator.configuration.paths.DefaultTorqueGeneratorPaths,<nulltype>,<nulltype>,org.apache.torque.generator.configuration.option.MapOptionsConfiguration,<nulltype>)
location: class org.apache.torque.generator.configuration.UnitDescriptor

<https://builds.apache.org/job/Torque4-trunk/ws/torque4-trunk/torque-templates/src/test/java/org/apache/torque/templates/TestProcessing.java>:[173,28]
cannot find symbol
symbol  : constructor UnitDescriptor(org.apache.torque.generator.configuration.UnitDescriptor.Packaging,org.apache.torque.generator.configuration.paths.CustomProjectPaths,org.apache.torque.generator.configuration.paths.DefaultTorqueGeneratorPaths,<nulltype>,<nulltype>,org.apache.torque.generator.configuration.option.MapOptionsConfiguration,<nulltype>)
location: class org.apache.torque.generator.configuration.UnitDescriptor

<https://builds.apache.org/job/Torque4-trunk/ws/torque4-trunk/torque-templates/src/test/java/org/apache/torque/templates/TestProcessing.java>:[195,28]
cannot find symbol
symbol  : constructor UnitDescriptor(org.apache.torque.generator.configuration.UnitDescriptor.Packaging,org.apache.torque.generator.configuration.paths.CustomProjectPaths,org.apache.torque.generator.configuration.paths.DefaultTorqueGeneratorPaths,<nulltype>,<nulltype>,org.apache.torque.generator.configuration.option.MapOptionsConfiguration,<nulltype>)
location: class org.apache.torque.generator.configuration.UnitDescriptor

<https://builds.apache.org/job/Torque4-trunk/ws/torque4-trunk/torque-templates/src/test/java/org/apache/torque/templates/TestProcessing.java>:[217,28]
cannot find symbol
symbol  : constructor UnitDescriptor(org.apache.torque.generator.configuration.UnitDescriptor.Packaging,org.apache.torque.generator.configuration.paths.CustomProjectPaths,org.apache.torque.generator.configuration.paths.DefaultTorqueGeneratorPaths,<nulltype>,<nulltype>,org.apache.torque.generator.configuration.option.MapOptionsConfiguration,<nulltype>)
location: class org.apache.torque.generator.configuration.UnitDescriptor


[INFO] ------------------------------------------------------------------------
[INFO] For more information, run Maven with the -e switch
[INFO] ------------------------------------------------------------------------
[INFO] Total time: 7 minutes 54 seconds
[INFO] Finished at: Tue Jun 26 13:21:06 UTC 2012
[INFO] Final Memory: 87M/328M
[INFO] ------------------------------------------------------------------------
Maven failed with error.
[FINDBUGS] Aggregating results of Torque Runtime
[FINDBUGS] Using set difference to compute new warnings
[FINDBUGS] Aggregating results of Torque Generator
[FINDBUGS] Using set difference to compute new warnings
Sending e-mails to: torque-dev@db.apache.org
Sending e-mails to: torque-dev@db.apache.org
channel stopped
Skipping Cobertura coverage report as build was not UNSTABLE or better ...

---------------------------------------------------------------------
To unsubscribe, e-mail: torque-dev-unsubscribe@db.apache.org
For additional commands, e-mail: torque-dev-help@db.apache.org


Mime
View raw message