db-torque-dev mailing list archives

Site index · List index
Message view « Date » · « Thread »
Top « Date » · « Thread »
From Apache Jenkins Server <jenk...@builds.apache.org>
Subject Build failed in Jenkins: Torque4-trunk » Torque Templates #219
Date Tue, 26 Jun 2012 13:21:07 GMT
See <https://builds.apache.org/job/Torque4-trunk/org.apache.torque$torque-templates/219/>

------------------------------------------
[INFO] ------------------------------------------------------------------------
[INFO] Building Torque Templates
[INFO]    task-segment: [clean, install, cobertura:cobertura, findbugs:findbugs, checkstyle:checkstyle]
[INFO] ------------------------------------------------------------------------
[INFO] [clean:clean {execution: default-clean}]
[INFO] Deleting file set: <https://builds.apache.org/job/Torque4-trunk/org.apache.torque$torque-templates/ws/target>
(included: [**], excluded: [])
[INFO] [remote-resources:process {execution: default}]
[INFO] [resources:resources {execution: default-resources}]
[INFO] Using 'ISO-8859-1' encoding to copy filtered resources.
[INFO] Copying 271 resources
[INFO] Copying 3 resources
[INFO] [compiler:compile {execution: default-compile}]
[INFO] Compiling 58 source files to <https://builds.apache.org/job/Torque4-trunk/org.apache.torque$torque-templates/ws/target/classes>
[INFO] [resources:testResources {execution: default-testResources}]
[INFO] Using 'ISO-8859-1' encoding to copy filtered resources.
[INFO] Copying 2 resources
[INFO] Copying 3 resources
[INFO] [compiler:testCompile {execution: default-testCompile}]
[INFO] Compiling 2 source files to <https://builds.apache.org/job/Torque4-trunk/org.apache.torque$torque-templates/ws/target/test-classes>
[INFO] -------------------------------------------------------------
[ERROR] COMPILATION ERROR : 
[INFO] -------------------------------------------------------------
[ERROR] <https://builds.apache.org/job/Torque4-trunk/org.apache.torque$torque-templates/ws/src/test/java/org/apache/torque/templates/jdbc2schema/Jdbc2SchemaTest.java>:[132,28]
cannot find symbol
symbol  : constructor UnitDescriptor(org.apache.torque.generator.configuration.UnitDescriptor.Packaging,org.apache.torque.generator.configuration.paths.CustomProjectPaths,org.apache.torque.generator.configuration.paths.DefaultTorqueGeneratorPaths,<nulltype>,<nulltype>,org.apache.torque.generator.configuration.option.MapOptionsConfiguration,<nulltype>)
location: class org.apache.torque.generator.configuration.UnitDescriptor

[ERROR] <https://builds.apache.org/job/Torque4-trunk/org.apache.torque$torque-templates/ws/src/test/java/org/apache/torque/templates/TestProcessing.java>:[104,28]
cannot find symbol
symbol  : constructor UnitDescriptor(org.apache.torque.generator.configuration.UnitDescriptor.Packaging,org.apache.torque.generator.configuration.paths.CustomProjectPaths,org.apache.torque.generator.configuration.paths.DefaultTorqueGeneratorPaths,<nulltype>,org.apache.torque.generator.source.SourceProvider,org.apache.torque.generator.configuration.option.MapOptionsConfiguration,<nulltype>)
location: class org.apache.torque.generator.configuration.UnitDescriptor

[ERROR] <https://builds.apache.org/job/Torque4-trunk/org.apache.torque$torque-templates/ws/src/test/java/org/apache/torque/templates/TestProcessing.java>:[127,28]
cannot find symbol
symbol  : constructor UnitDescriptor(org.apache.torque.generator.configuration.UnitDescriptor.Packaging,org.apache.torque.generator.configuration.paths.CustomProjectPaths,org.apache.torque.generator.configuration.paths.DefaultTorqueGeneratorPaths,<nulltype>,<nulltype>,org.apache.torque.generator.configuration.option.MapOptionsConfiguration,<nulltype>)
location: class org.apache.torque.generator.configuration.UnitDescriptor

[ERROR] <https://builds.apache.org/job/Torque4-trunk/org.apache.torque$torque-templates/ws/src/test/java/org/apache/torque/templates/TestProcessing.java>:[150,28]
cannot find symbol
symbol  : constructor UnitDescriptor(org.apache.torque.generator.configuration.UnitDescriptor.Packaging,org.apache.torque.generator.configuration.paths.CustomProjectPaths,org.apache.torque.generator.configuration.paths.DefaultTorqueGeneratorPaths,<nulltype>,<nulltype>,org.apache.torque.generator.configuration.option.MapOptionsConfiguration,<nulltype>)
location: class org.apache.torque.generator.configuration.UnitDescriptor

[ERROR] <https://builds.apache.org/job/Torque4-trunk/org.apache.torque$torque-templates/ws/src/test/java/org/apache/torque/templates/TestProcessing.java>:[173,28]
cannot find symbol
symbol  : constructor UnitDescriptor(org.apache.torque.generator.configuration.UnitDescriptor.Packaging,org.apache.torque.generator.configuration.paths.CustomProjectPaths,org.apache.torque.generator.configuration.paths.DefaultTorqueGeneratorPaths,<nulltype>,<nulltype>,org.apache.torque.generator.configuration.option.MapOptionsConfiguration,<nulltype>)
location: class org.apache.torque.generator.configuration.UnitDescriptor

[ERROR] <https://builds.apache.org/job/Torque4-trunk/org.apache.torque$torque-templates/ws/src/test/java/org/apache/torque/templates/TestProcessing.java>:[195,28]
cannot find symbol
symbol  : constructor UnitDescriptor(org.apache.torque.generator.configuration.UnitDescriptor.Packaging,org.apache.torque.generator.configuration.paths.CustomProjectPaths,org.apache.torque.generator.configuration.paths.DefaultTorqueGeneratorPaths,<nulltype>,<nulltype>,org.apache.torque.generator.configuration.option.MapOptionsConfiguration,<nulltype>)
location: class org.apache.torque.generator.configuration.UnitDescriptor

[ERROR] <https://builds.apache.org/job/Torque4-trunk/org.apache.torque$torque-templates/ws/src/test/java/org/apache/torque/templates/TestProcessing.java>:[217,28]
cannot find symbol
symbol  : constructor UnitDescriptor(org.apache.torque.generator.configuration.UnitDescriptor.Packaging,org.apache.torque.generator.configuration.paths.CustomProjectPaths,org.apache.torque.generator.configuration.paths.DefaultTorqueGeneratorPaths,<nulltype>,<nulltype>,org.apache.torque.generator.configuration.option.MapOptionsConfiguration,<nulltype>)
location: class org.apache.torque.generator.configuration.UnitDescriptor

[INFO] 7 errors 
[INFO] -------------------------------------------------------------
[JENKINS] Archiving <https://builds.apache.org/job/Torque4-trunk/org.apache.torque$torque-templates/ws/pom.xml>
to /home/hudson/hudson/jobs/Torque4-trunk/modules/org.apache.torque$torque-templates/builds/2012-06-26_13-12-43/archive/org.apache.torque/torque-templates/4.0-alpha1-SNAPSHOT/torque-templates-4.0-alpha1-SNAPSHOT.pom
[INFO] ------------------------------------------------------------------------
[ERROR] BUILD FAILURE
[INFO] ------------------------------------------------------------------------
[INFO] Compilation failure

<https://builds.apache.org/job/Torque4-trunk/org.apache.torque$torque-templates/ws/src/test/java/org/apache/torque/templates/jdbc2schema/Jdbc2SchemaTest.java>:[132,28]
cannot find symbol
symbol  : constructor UnitDescriptor(org.apache.torque.generator.configuration.UnitDescriptor.Packaging,org.apache.torque.generator.configuration.paths.CustomProjectPaths,org.apache.torque.generator.configuration.paths.DefaultTorqueGeneratorPaths,<nulltype>,<nulltype>,org.apache.torque.generator.configuration.option.MapOptionsConfiguration,<nulltype>)
location: class org.apache.torque.generator.configuration.UnitDescriptor

<https://builds.apache.org/job/Torque4-trunk/org.apache.torque$torque-templates/ws/src/test/java/org/apache/torque/templates/TestProcessing.java>:[104,28]
cannot find symbol
symbol  : constructor UnitDescriptor(org.apache.torque.generator.configuration.UnitDescriptor.Packaging,org.apache.torque.generator.configuration.paths.CustomProjectPaths,org.apache.torque.generator.configuration.paths.DefaultTorqueGeneratorPaths,<nulltype>,org.apache.torque.generator.source.SourceProvider,org.apache.torque.generator.configuration.option.MapOptionsConfiguration,<nulltype>)
location: class org.apache.torque.generator.configuration.UnitDescriptor

<https://builds.apache.org/job/Torque4-trunk/org.apache.torque$torque-templates/ws/src/test/java/org/apache/torque/templates/TestProcessing.java>:[127,28]
cannot find symbol
symbol  : constructor UnitDescriptor(org.apache.torque.generator.configuration.UnitDescriptor.Packaging,org.apache.torque.generator.configuration.paths.CustomProjectPaths,org.apache.torque.generator.configuration.paths.DefaultTorqueGeneratorPaths,<nulltype>,<nulltype>,org.apache.torque.generator.configuration.option.MapOptionsConfiguration,<nulltype>)
location: class org.apache.torque.generator.configuration.UnitDescriptor

<https://builds.apache.org/job/Torque4-trunk/org.apache.torque$torque-templates/ws/src/test/java/org/apache/torque/templates/TestProcessing.java>:[150,28]
cannot find symbol
symbol  : constructor UnitDescriptor(org.apache.torque.generator.configuration.UnitDescriptor.Packaging,org.apache.torque.generator.configuration.paths.CustomProjectPaths,org.apache.torque.generator.configuration.paths.DefaultTorqueGeneratorPaths,<nulltype>,<nulltype>,org.apache.torque.generator.configuration.option.MapOptionsConfiguration,<nulltype>)
location: class org.apache.torque.generator.configuration.UnitDescriptor

<https://builds.apache.org/job/Torque4-trunk/org.apache.torque$torque-templates/ws/src/test/java/org/apache/torque/templates/TestProcessing.java>:[173,28]
cannot find symbol
symbol  : constructor UnitDescriptor(org.apache.torque.generator.configuration.UnitDescriptor.Packaging,org.apache.torque.generator.configuration.paths.CustomProjectPaths,org.apache.torque.generator.configuration.paths.DefaultTorqueGeneratorPaths,<nulltype>,<nulltype>,org.apache.torque.generator.configuration.option.MapOptionsConfiguration,<nulltype>)
location: class org.apache.torque.generator.configuration.UnitDescriptor

<https://builds.apache.org/job/Torque4-trunk/org.apache.torque$torque-templates/ws/src/test/java/org/apache/torque/templates/TestProcessing.java>:[195,28]
cannot find symbol
symbol  : constructor UnitDescriptor(org.apache.torque.generator.configuration.UnitDescriptor.Packaging,org.apache.torque.generator.configuration.paths.CustomProjectPaths,org.apache.torque.generator.configuration.paths.DefaultTorqueGeneratorPaths,<nulltype>,<nulltype>,org.apache.torque.generator.configuration.option.MapOptionsConfiguration,<nulltype>)
location: class org.apache.torque.generator.configuration.UnitDescriptor

<https://builds.apache.org/job/Torque4-trunk/org.apache.torque$torque-templates/ws/src/test/java/org/apache/torque/templates/TestProcessing.java>:[217,28]
cannot find symbol
symbol  : constructor UnitDescriptor(org.apache.torque.generator.configuration.UnitDescriptor.Packaging,org.apache.torque.generator.configuration.paths.CustomProjectPaths,org.apache.torque.generator.configuration.paths.DefaultTorqueGeneratorPaths,<nulltype>,<nulltype>,org.apache.torque.generator.configuration.option.MapOptionsConfiguration,<nulltype>)
location: class org.apache.torque.generator.configuration.UnitDescriptor


[INFO] ------------------------------------------------------------------------
[INFO] For more information, run Maven with the -e switch
[INFO] ------------------------------------------------------------------------
[INFO] Total time: 7 minutes 54 seconds
[INFO] Finished at: Tue Jun 26 13:21:06 UTC 2012
[INFO] Final Memory: 87M/328M
[INFO] ------------------------------------------------------------------------
Maven failed with error.

---------------------------------------------------------------------
To unsubscribe, e-mail: torque-dev-unsubscribe@db.apache.org
For additional commands, e-mail: torque-dev-help@db.apache.org


Mime
View raw message