db-torque-dev mailing list archives

Site index · List index
Message view « Date » · « Thread »
Top « Date » · « Thread »
From Apache Jenkins Server <jenk...@builds.apache.org>
Subject Build failed in Jenkins: torque4-test-project-derby » Torque Test Project #177
Date Fri, 29 Jun 2012 04:24:01 GMT
See <https://builds.apache.org/job/torque4-test-project-derby/org.apache.torque$torque-test/177/>

------------------------------------------
[...truncated 2612 lines...]

[ERROR] <https://builds.apache.org/job/torque4-test-project-derby/org.apache.torque$torque-test/ws/src/test/java/org/apache/torque/generated/peer/DateTest.java>:[218,45]
cannot find symbol
symbol  : class DBOracle
location: class org.apache.torque.generated.peer.DateTest

[ERROR] <https://builds.apache.org/job/torque4-test-project-derby/org.apache.torque$torque-test/ws/src/test/java/org/apache/torque/generated/peer/DateTest.java>:[242,38]
cannot find symbol
symbol  : class DBMSSQL
location: class org.apache.torque.generated.peer.DateTest

[ERROR] <https://builds.apache.org/job/torque4-test-project-derby/org.apache.torque$torque-test/ws/src/test/java/org/apache/torque/generated/peer/DateTest.java>:[298,38]
cannot find symbol
symbol  : class DBMSSQL
location: class org.apache.torque.generated.peer.DateTest

[ERROR] <https://builds.apache.org/job/torque4-test-project-derby/org.apache.torque$torque-test/ws/src/test/java/org/apache/torque/generated/peer/DateTest.java>:[334,38]
cannot find symbol
symbol  : class DBMSSQL
location: class org.apache.torque.generated.peer.DateTest

[ERROR] <https://builds.apache.org/job/torque4-test-project-derby/org.apache.torque$torque-test/ws/src/test/java/org/apache/torque/generated/peer/DateTest.java>:[542,38]
cannot find symbol
symbol  : class DBMM
location: class org.apache.torque.generated.peer.DateTest

[ERROR] <https://builds.apache.org/job/torque4-test-project-derby/org.apache.torque$torque-test/ws/src/test/java/org/apache/torque/generated/peer/DateTest.java>:[546,38]
cannot find symbol
symbol  : class DBMSSQL
location: class org.apache.torque.generated.peer.DateTest

[INFO] 52 errors 
[INFO] -------------------------------------------------------------
[JENKINS] Archiving <https://builds.apache.org/job/torque4-test-project-derby/org.apache.torque$torque-test/ws/pom.xml>
to /home/hudson/hudson/jobs/torque4-test-project-derby/modules/org.apache.torque$torque-test/builds/2012-06-29_04-22-51/archive/org.apache.torque/torque-test/4.0-alpha1-SNAPSHOT/torque-test-4.0-alpha1-SNAPSHOT.pom
[INFO] ------------------------------------------------------------------------
[ERROR] BUILD FAILURE
[INFO] ------------------------------------------------------------------------
[INFO] Compilation failure

<https://builds.apache.org/job/torque4-test-project-derby/org.apache.torque$torque-test/ws/src/test/java/org/apache/torque/generated/peer/WhereClauseSubselectTest.java>:[12,32]
cannot find symbol
symbol  : class DB
location: package org.apache.torque.adapter

<https://builds.apache.org/job/torque4-test-project-derby/org.apache.torque$torque-test/ws/src/test/java/org/apache/torque/generated/peer/WhereClauseSubselectTest.java>:[13,32]
cannot find symbol
symbol  : class DBMM
location: package org.apache.torque.adapter

<https://builds.apache.org/job/torque4-test-project-derby/org.apache.torque$torque-test/ws/src/test/java/org/apache/torque/BaseDatabaseTestCase.java>:[27,32]
cannot find symbol
symbol  : class DB
location: package org.apache.torque.adapter

<https://builds.apache.org/job/torque4-test-project-derby/org.apache.torque$torque-test/ws/src/test/java/org/apache/torque/BaseDatabaseTestCase.java>:[28,32]
cannot find symbol
symbol  : class DBMM
location: package org.apache.torque.adapter

<https://builds.apache.org/job/torque4-test-project-derby/org.apache.torque$torque-test/ws/src/test/java/org/apache/torque/BaseDatabaseTestCase.java>:[51,21]
cannot find symbol
symbol  : class DB
location: class org.apache.torque.BaseDatabaseTestCase

<https://builds.apache.org/job/torque4-test-project-derby/org.apache.torque$torque-test/ws/src/test/java/org/apache/torque/generated/peer/JoinTest.java>:[11,32]
cannot find symbol
symbol  : class DBHsqldb
location: package org.apache.torque.adapter

<https://builds.apache.org/job/torque4-test-project-derby/org.apache.torque$torque-test/ws/src/test/java/org/apache/torque/datatypes/BitTest.java>:[9,32]
cannot find symbol
symbol  : class DBDerby
location: package org.apache.torque.adapter

<https://builds.apache.org/job/torque4-test-project-derby/org.apache.torque$torque-test/ws/src/test/java/org/apache/torque/datatypes/BitTest.java>:[10,32]
cannot find symbol
symbol  : class DBOracle
location: package org.apache.torque.adapter

<https://builds.apache.org/job/torque4-test-project-derby/org.apache.torque$torque-test/ws/src/test/java/org/apache/torque/DataTest.java>:[33,32]
cannot find symbol
symbol  : class DB
location: package org.apache.torque.adapter

<https://builds.apache.org/job/torque4-test-project-derby/org.apache.torque$torque-test/ws/src/test/java/org/apache/torque/DataTest.java>:[34,32]
cannot find symbol
symbol  : class DBMM
location: package org.apache.torque.adapter

<https://builds.apache.org/job/torque4-test-project-derby/org.apache.torque$torque-test/ws/src/test/java/org/apache/torque/DataTest.java>:[35,32]
cannot find symbol
symbol  : class DBMSSQL
location: package org.apache.torque.adapter

<https://builds.apache.org/job/torque4-test-project-derby/org.apache.torque$torque-test/ws/src/test/java/org/apache/torque/generated/peer/UseDefaultValueFromDatabaseTest.java>:[15,32]
cannot find symbol
symbol  : class DBDerby
location: package org.apache.torque.adapter

<https://builds.apache.org/job/torque4-test-project-derby/org.apache.torque$torque-test/ws/src/test/java/org/apache/torque/generated/peer/UseDefaultValueFromDatabaseTest.java>:[16,32]
cannot find symbol
symbol  : class DBHsqldb
location: package org.apache.torque.adapter

<https://builds.apache.org/job/torque4-test-project-derby/org.apache.torque$torque-test/ws/src/test/java/org/apache/torque/generated/peer/UseDefaultValueFromDatabaseTest.java>:[17,32]
cannot find symbol
symbol  : class DBMM
location: package org.apache.torque.adapter

<https://builds.apache.org/job/torque4-test-project-derby/org.apache.torque$torque-test/ws/src/test/java/org/apache/torque/generated/peer/UseDefaultValueFromDatabaseTest.java>:[18,32]
cannot find symbol
symbol  : class DBMSSQL
location: package org.apache.torque.adapter

<https://builds.apache.org/job/torque4-test-project-derby/org.apache.torque$torque-test/ws/src/test/java/org/apache/torque/generated/peer/UseDefaultValueFromDatabaseTest.java>:[19,32]
cannot find symbol
symbol  : class DBOracle
location: package org.apache.torque.adapter

<https://builds.apache.org/job/torque4-test-project-derby/org.apache.torque$torque-test/ws/src/test/java/org/apache/torque/generated/peer/UseDefaultValueFromDatabaseTest.java>:[20,32]
cannot find symbol
symbol  : class DBPostgres
location: package org.apache.torque.adapter

<https://builds.apache.org/job/torque4-test-project-derby/org.apache.torque$torque-test/ws/src/test/java/org/apache/torque/DocsTest.java>:[26,32]
cannot find symbol
symbol  : class DB
location: package org.apache.torque.adapter

<https://builds.apache.org/job/torque4-test-project-derby/org.apache.torque$torque-test/ws/src/test/java/org/apache/torque/DocsTest.java>:[27,32]
cannot find symbol
symbol  : class DBMM
location: package org.apache.torque.adapter

<https://builds.apache.org/job/torque4-test-project-derby/org.apache.torque$torque-test/ws/src/test/java/org/apache/torque/generated/peer/DateTest.java>:[33,32]
cannot find symbol
symbol  : class DBMM
location: package org.apache.torque.adapter

<https://builds.apache.org/job/torque4-test-project-derby/org.apache.torque$torque-test/ws/src/test/java/org/apache/torque/generated/peer/DateTest.java>:[34,32]
cannot find symbol
symbol  : class DBMSSQL
location: package org.apache.torque.adapter

<https://builds.apache.org/job/torque4-test-project-derby/org.apache.torque$torque-test/ws/src/test/java/org/apache/torque/generated/peer/DateTest.java>:[35,32]
cannot find symbol
symbol  : class DBOracle
location: package org.apache.torque.adapter

<https://builds.apache.org/job/torque4-test-project-derby/org.apache.torque$torque-test/ws/src/test/java/org/apache/torque/BaseDatabaseTestCase.java>:[78,8]
cannot find symbol
symbol  : class DB
location: class org.apache.torque.BaseDatabaseTestCase

<https://builds.apache.org/job/torque4-test-project-derby/org.apache.torque$torque-test/ws/src/test/java/org/apache/torque/BaseDatabaseTestCase.java>:[79,33]
cannot find symbol
symbol  : class DBMM
location: class org.apache.torque.BaseDatabaseTestCase

<https://builds.apache.org/job/torque4-test-project-derby/org.apache.torque$torque-test/ws/src/test/java/org/apache/torque/generated/peer/WhereClauseSubselectTest.java>:[270,8]
cannot find symbol
symbol  : class DB
location: class org.apache.torque.generated.peer.WhereClauseSubselectTest

<https://builds.apache.org/job/torque4-test-project-derby/org.apache.torque$torque-test/ws/src/test/java/org/apache/torque/generated/peer/WhereClauseSubselectTest.java>:[271,33]
cannot find symbol
symbol  : class DBMM
location: class org.apache.torque.generated.peer.WhereClauseSubselectTest

<https://builds.apache.org/job/torque4-test-project-derby/org.apache.torque$torque-test/ws/src/test/java/org/apache/torque/generated/peer/JoinTest.java>:[516,59]
cannot find symbol
symbol  : class DBHsqldb
location: class org.apache.torque.generated.peer.JoinTest

<https://builds.apache.org/job/torque4-test-project-derby/org.apache.torque$torque-test/ws/src/test/java/org/apache/torque/datatypes/BitTest.java>:[214,38]
cannot find symbol
symbol  : class DBOracle
location: class org.apache.torque.datatypes.BitTest

<https://builds.apache.org/job/torque4-test-project-derby/org.apache.torque$torque-test/ws/src/test/java/org/apache/torque/datatypes/BitTest.java>:[215,45]
cannot find symbol
symbol  : class DBDerby
location: class org.apache.torque.datatypes.BitTest

<https://builds.apache.org/job/torque4-test-project-derby/org.apache.torque$torque-test/ws/src/test/java/org/apache/torque/DataTest.java>:[751,8]
cannot find symbol
symbol  : class DB
location: class org.apache.torque.DataTest

<https://builds.apache.org/job/torque4-test-project-derby/org.apache.torque$torque-test/ws/src/test/java/org/apache/torque/DataTest.java>:[752,26]
cannot find symbol
symbol  : class DBMM
location: class org.apache.torque.DataTest

<https://builds.apache.org/job/torque4-test-project-derby/org.apache.torque$torque-test/ws/src/test/java/org/apache/torque/DataTest.java>:[753,33]
cannot find symbol
symbol  : class DBMSSQL
location: class org.apache.torque.DataTest

<https://builds.apache.org/job/torque4-test-project-derby/org.apache.torque$torque-test/ws/src/test/java/org/apache/torque/generated/peer/UseDefaultValueFromDatabaseTest.java>:[261,38]
cannot find symbol
symbol  : class DBOracle
location: class org.apache.torque.generated.peer.UseDefaultValueFromDatabaseTest

<https://builds.apache.org/job/torque4-test-project-derby/org.apache.torque$torque-test/ws/src/test/java/org/apache/torque/generated/peer/UseDefaultValueFromDatabaseTest.java>:[265,43]
cannot find symbol
symbol  : class DBDerby
location: class org.apache.torque.generated.peer.UseDefaultValueFromDatabaseTest

<https://builds.apache.org/job/torque4-test-project-derby/org.apache.torque$torque-test/ws/src/test/java/org/apache/torque/generated/peer/UseDefaultValueFromDatabaseTest.java>:[269,43]
cannot find symbol
symbol  : class DBHsqldb
location: class org.apache.torque.generated.peer.UseDefaultValueFromDatabaseTest

<https://builds.apache.org/job/torque4-test-project-derby/org.apache.torque$torque-test/ws/src/test/java/org/apache/torque/generated/peer/UseDefaultValueFromDatabaseTest.java>:[329,38]
cannot find symbol
symbol  : class DBMM
location: class org.apache.torque.generated.peer.UseDefaultValueFromDatabaseTest

<https://builds.apache.org/job/torque4-test-project-derby/org.apache.torque$torque-test/ws/src/test/java/org/apache/torque/generated/peer/UseDefaultValueFromDatabaseTest.java>:[330,45]
cannot find symbol
symbol  : class DBMSSQL
location: class org.apache.torque.generated.peer.UseDefaultValueFromDatabaseTest

<https://builds.apache.org/job/torque4-test-project-derby/org.apache.torque$torque-test/ws/src/test/java/org/apache/torque/generated/peer/UseDefaultValueFromDatabaseTest.java>:[342,38]
cannot find symbol
symbol  : class DBMM
location: class org.apache.torque.generated.peer.UseDefaultValueFromDatabaseTest

<https://builds.apache.org/job/torque4-test-project-derby/org.apache.torque$torque-test/ws/src/test/java/org/apache/torque/generated/peer/UseDefaultValueFromDatabaseTest.java>:[343,45]
cannot find symbol
symbol  : class DBOracle
location: class org.apache.torque.generated.peer.UseDefaultValueFromDatabaseTest

<https://builds.apache.org/job/torque4-test-project-derby/org.apache.torque$torque-test/ws/src/test/java/org/apache/torque/generated/peer/UseDefaultValueFromDatabaseTest.java>:[344,45]
cannot find symbol
symbol  : class DBMSSQL
location: class org.apache.torque.generated.peer.UseDefaultValueFromDatabaseTest

<https://builds.apache.org/job/torque4-test-project-derby/org.apache.torque$torque-test/ws/src/test/java/org/apache/torque/generated/peer/UseDefaultValueFromDatabaseTest.java>:[356,38]
cannot find symbol
symbol  : class DBMM
location: class org.apache.torque.generated.peer.UseDefaultValueFromDatabaseTest

<https://builds.apache.org/job/torque4-test-project-derby/org.apache.torque$torque-test/ws/src/test/java/org/apache/torque/generated/peer/UseDefaultValueFromDatabaseTest.java>:[368,38]
cannot find symbol
symbol  : class DBPostgres
location: class org.apache.torque.generated.peer.UseDefaultValueFromDatabaseTest

<https://builds.apache.org/job/torque4-test-project-derby/org.apache.torque$torque-test/ws/src/test/java/org/apache/torque/DocsTest.java>:[375,8]
cannot find symbol
symbol  : class DB
location: class org.apache.torque.DocsTest

<https://builds.apache.org/job/torque4-test-project-derby/org.apache.torque$torque-test/ws/src/test/java/org/apache/torque/DocsTest.java>:[376,31]
cannot find symbol
symbol  : class DBMM
location: class org.apache.torque.DocsTest

<https://builds.apache.org/job/torque4-test-project-derby/org.apache.torque$torque-test/ws/src/test/java/org/apache/torque/generated/peer/DateTest.java>:[192,38]
cannot find symbol
symbol  : class DBMSSQL
location: class org.apache.torque.generated.peer.DateTest

<https://builds.apache.org/job/torque4-test-project-derby/org.apache.torque$torque-test/ws/src/test/java/org/apache/torque/generated/peer/DateTest.java>:[217,38]
cannot find symbol
symbol  : class DBMSSQL
location: class org.apache.torque.generated.peer.DateTest

<https://builds.apache.org/job/torque4-test-project-derby/org.apache.torque$torque-test/ws/src/test/java/org/apache/torque/generated/peer/DateTest.java>:[218,45]
cannot find symbol
symbol  : class DBOracle
location: class org.apache.torque.generated.peer.DateTest

<https://builds.apache.org/job/torque4-test-project-derby/org.apache.torque$torque-test/ws/src/test/java/org/apache/torque/generated/peer/DateTest.java>:[242,38]
cannot find symbol
symbol  : class DBMSSQL
location: class org.apache.torque.generated.peer.DateTest

<https://builds.apache.org/job/torque4-test-project-derby/org.apache.torque$torque-test/ws/src/test/java/org/apache/torque/generated/peer/DateTest.java>:[298,38]
cannot find symbol
symbol  : class DBMSSQL
location: class org.apache.torque.generated.peer.DateTest

<https://builds.apache.org/job/torque4-test-project-derby/org.apache.torque$torque-test/ws/src/test/java/org/apache/torque/generated/peer/DateTest.java>:[334,38]
cannot find symbol
symbol  : class DBMSSQL
location: class org.apache.torque.generated.peer.DateTest

<https://builds.apache.org/job/torque4-test-project-derby/org.apache.torque$torque-test/ws/src/test/java/org/apache/torque/generated/peer/DateTest.java>:[542,38]
cannot find symbol
symbol  : class DBMM
location: class org.apache.torque.generated.peer.DateTest

<https://builds.apache.org/job/torque4-test-project-derby/org.apache.torque$torque-test/ws/src/test/java/org/apache/torque/generated/peer/DateTest.java>:[546,38]
cannot find symbol
symbol  : class DBMSSQL
location: class org.apache.torque.generated.peer.DateTest


[INFO] ------------------------------------------------------------------------
[INFO] For more information, run Maven with the -e switch
[INFO] ------------------------------------------------------------------------
[INFO] Total time: 38 seconds
[INFO] Finished at: Fri Jun 29 04:24:00 UTC 2012
[INFO] Final Memory: 53M/330M
[INFO] ------------------------------------------------------------------------

---------------------------------------------------------------------
To unsubscribe, e-mail: torque-dev-unsubscribe@db.apache.org
For additional commands, e-mail: torque-dev-help@db.apache.org


Mime
View raw message