db-torque-dev mailing list archives

Site index · List index
Message view « Date » · « Thread »
Top « Date » · « Thread »
From Apache Jenkins Server <jenk...@builds.apache.org>
Subject Build failed in Jenkins: torque4-test-project-hsqldb #1
Date Fri, 11 May 2012 03:47:40 GMT
See <https://builds.apache.org/job/torque4-test-project-hsqldb/1/>

------------------------------------------
Started by upstream project "Torque4-trunk" build number 123
Building remotely on ubuntu1 in workspace <https://builds.apache.org/job/torque4-test-project-hsqldb/ws/>
Checking out a fresh workspace because there's no workspace at <https://builds.apache.org/job/torque4-test-project-hsqldb/ws/>
Cleaning local Directory .
Checking out http://svn.apache.org/repos/asf/db/torque/torque4/trunk/torque-test
A         torque-gen.properties
AU        profiles.xml
A         src
A         src/test
A         src/test/sql
AU        src/test/sql/schema.sql.ref.xml
AU        src/test/sql/schema.sql
A         src/test/profile
A         src/test/profile/derbyEmbedded
A         src/test/profile/derbyEmbedded/notes.txt
A         src/test/profile/derbyEmbedded/Torque.properties
A         src/test/profile/mssql
A         src/test/profile/mssql/Torque.properties
A         src/test/profile/postgresql
AU        src/test/profile/postgresql/Torque.properties
A         src/test/profile/derby
A         src/test/profile/derby/notes.txt
AU        src/test/profile/derby/Torque.properties
A         src/test/profile/mysql
AU        src/test/profile/mysql/Torque.properties
A         src/test/profile/oracle
AU        src/test/profile/oracle/Torque.properties
A         src/test/profile/henning
AU        src/test/profile/henning/Torque.properties
A         src/test/profile/jmcnally
AU        src/test/profile/jmcnally/Torque.properties
A         src/test/profile/tv
A         src/test/profile/tv/Torque.properties
A         src/test/profile/hsqldb
AU        src/test/profile/hsqldb/Torque.properties
A         src/test/java
A         src/test/java/org
A         src/test/java/org/apache
A         src/test/java/org/apache/torque
A         src/test/java/org/apache/torque/test
AU        src/test/java/org/apache/torque/test/InheritanceClassnameTestChild1.java
AU        src/test/java/org/apache/torque/test/InheritanceClassnameTestChild2.java
AU        src/test/java/org/apache/torque/InitShutdownTest.java
A         src/test/java/org/apache/torque/adapter
AU        src/test/java/org/apache/torque/adapter/AdapterTest.java
A         src/test/java/org/apache/torque/avalon
AU        src/test/java/org/apache/torque/avalon/AvalonMapBuildersTest.java
AU        src/test/java/org/apache/torque/DataTest.java
AU        src/test/java/org/apache/torque/JndiConfigurationTest.java
AU        src/test/java/org/apache/torque/ForeignKeySchemaData.java
A         src/test/java/org/apache/torque/datatypes
AU        src/test/java/org/apache/torque/datatypes/BooleanIntCharTest.java
AU        src/test/java/org/apache/torque/datatypes/BitTest.java
A         src/test/java/org/apache/torque/generated
A         src/test/java/org/apache/torque/generated/dataobject
AU        src/test/java/org/apache/torque/generated/dataobject/ForeignKeyAdderTest.java
AU        src/test/java/org/apache/torque/generated/dataobject/ViewTest.java
AU        src/test/java/org/apache/torque/generated/dataobject/ForeignKeyGetterTest.java
AU        src/test/java/org/apache/torque/generated/dataobject/SaveTest.java
A         src/test/java/org/apache/torque/generated/peer
AU        src/test/java/org/apache/torque/generated/peer/JoinTest.java
AU        src/test/java/org/apache/torque/generated/peer/SelectTest.java
A         src/test/java/org/apache/torque/generated/peer/DefaultValueTest.java
AU        src/test/java/org/apache/torque/generated/peer/WhereClauseSubselectTest.java
AU        src/test/java/org/apache/torque/generated/peer/DeleteTest.java
AU        src/test/java/org/apache/torque/generated/peer/SaveMethodsInPeerTest.java
A         src/test/java/org/apache/torque/generated/peer/SelectFunctionTest.java
AU        src/test/java/org/apache/torque/generated/peer/SelectInTest.java
AU        src/test/java/org/apache/torque/generated/peer/UseDefaultValueFromDatabaseTest.java
AU        src/test/java/org/apache/torque/generated/peer/GetRelatedObjectsTest.java
AU        src/test/java/org/apache/torque/generated/peer/DateTest.java
AU        src/test/java/org/apache/torque/generated/peer/FillerTest.java
A         src/test/java/org/apache/torque/sql
AU        src/test/java/org/apache/torque/sql/DatabaseTools.java
AU        src/test/java/org/apache/torque/sql/SkipSqlTest.java
AU        src/test/java/org/apache/torque/PkSchemaData.java
AU        src/test/java/org/apache/torque/DocsTest.java
AU        src/test/java/org/apache/torque/BeanTestConditional.java
AU        src/test/java/org/apache/torque/BaseDatabaseTestCase.java
A         src/test/java/org/apache/torque/oid
AU        src/test/java/org/apache/torque/oid/IDBrokerTest.java
A         src/test/java/org/apache/torque/om
AU        src/test/java/org/apache/torque/om/OMByNameMethodsTest.java
A         src/test/java/org/apache/torque/map
AU        src/test/java/org/apache/torque/map/DatabaseMapTest.java
A         src/test/java/org/apache/torque/util
AU        src/test/java/org/apache/torque/util/BasePeerTest.java
AU        src/test/java/org/apache/torque/util/LargeSelectTest.java
AU        src/test/java/org/apache/torque/util/SummaryHelperTest.java
AU        src/test/java/org/apache/torque/util/CopyTestConditional.java
AU        src/test/java/org/apache/torque/ManagerTestConditional.java
A         src/test/resources
AU        src/test/resources/TestRoleConfig.xml
AU        src/test/resources/TestComponentConfig.xml
AU        src/test/resources/commons-logging.properties
AU        src/test/resources/log4j.properties
AU        src/test/resources/cache.ccf
AU        src/test/resources/TurbineResources.properties
A         src/main
A         src/main/schema
A         src/main/schema/types-schema.xml
A         src/main/schema/databaseMapInit-schema.xml
AU        src/main/schema/bookstore-schema.xml
A         src/main/schema/included-schema.xml
A         src/main/schema/index.xml
A         src/main/schema/save-method-in-peer-schema.xml
A         src/main/schema/pk-schema.xml
A         src/main/schema/included-from-included-schema.xml
A         src/main/schema/default-value-schema.xml
A         src/main/schema/foreign-key-schema.xml
AU        src/main/schema/test-schema.xml
AU        src/main/schema/ext-schema.xml
AU        src/main/schema/extext-schema.xml
AU        src/main/schema/id-table-schema.xml
A         src/main/java
A         src/main/java/org
A         src/main/java/org/apache
A         src/main/java/org/apache/torque
AU        src/main/java/org/apache/torque/TestInterface.java
A         src/main/torque-gen
A         src/main/torque-gen/outlets
A         src/main/torque-gen/outlets/peer.xml
A         src/main/torque-gen/conf
A         src/main/torque-gen/conf/control.xml
A         src/main/torque-gen/templates
A         src/main/torque-gen/templates/peer
A         src/main/torque-gen/templates/peer/base
A         src/main/torque-gen/templates/peer/base/classAnnotations.vm
AU        pom.xml
 U        .
At revision 1337021
Parsing POMs
ERROR: Failed to parse POMs
hudson.util.IOException2: remote file operation failed: <https://builds.apache.org/job/torque4-test-project-hsqldb/ws/>
at hudson.remoting.Channel@579f6dc7:ubuntu1
	at hudson.FilePath.act(FilePath.java:828)
	at hudson.FilePath.act(FilePath.java:814)
	at hudson.maven.MavenModuleSetBuild$RunnerImpl.parsePoms(MavenModuleSetBuild.java:910)
	at hudson.maven.MavenModuleSetBuild$RunnerImpl.doRun(MavenModuleSetBuild.java:654)
	at hudson.model.AbstractBuild$AbstractRunner.run(AbstractBuild.java:475)
	at hudson.model.Run.run(Run.java:1434)
	at hudson.maven.MavenModuleSetBuild.run(MavenModuleSetBuild.java:477)
	at hudson.model.ResourceController.execute(ResourceController.java:88)
	at hudson.model.Executor.run(Executor.java:239)
Caused by: hudson.remoting.ProxyException: hudson.maven.MavenModuleSetBuild$MavenExecutionException:
org.apache.maven.project.ProjectBuildingException: Some problems were encountered while processing
the POMs:
[ERROR] 'dependencies.dependency.artifactId' for ${torque.test.driver.groupId}:${torque.test.driver.artifactId}:jar
with value '${torque.test.driver.artifactId}' does not match a valid id pattern. @ line 66,
column 19
[ERROR] 'dependencies.dependency.groupId' for ${torque.test.driver.groupId}:${torque.test.driver.artifactId}:jar
with value '${torque.test.driver.groupId}' does not match a valid id pattern. @ line 67, column
16
[WARNING] 'dependencies.dependency.version' for ${torque.test.driver.groupId}:${torque.test.driver.artifactId}:jar
must be a valid version but is '${torque.test.driver.version}'. @ line 68, column 16
[ERROR] 'build.plugins.plugin[org.apache.torque:maven-torque-generator-plugin].dependencies.dependency.artifactId'
for ${torque.test.driver.groupId}:${torque.test.driver.artifactId}:jar with value '${torque.test.driver.artifactId}'
does not match a valid id pattern. @ line 310, column 25
[ERROR] 'build.plugins.plugin[org.apache.torque:maven-torque-generator-plugin].dependencies.dependency.groupId'
for ${torque.test.driver.groupId}:${torque.test.driver.artifactId}:jar with value '${torque.test.driver.groupId}'
does not match a valid id pattern. @ line 309, column 22
[WARNING] 'build.plugins.plugin[org.apache.torque:maven-torque-generator-plugin].dependencies.dependency.version'
for ${torque.test.driver.groupId}:${torque.test.driver.artifactId}:jar must be a valid version
but is '${torque.test.driver.version}'. @ line 311, column 22
[ERROR] 'build.plugins.plugin[org.codehaus.mojo:sql-maven-plugin].dependencies.dependency.artifactId'
for ${torque.test.driver.groupId}:${torque.test.driver.artifactId}:jar with value '${torque.test.driver.artifactId}'
does not match a valid id pattern. @ line 393, column 25
[ERROR] 'build.plugins.plugin[org.codehaus.mojo:sql-maven-plugin].dependencies.dependency.groupId'
for ${torque.test.driver.groupId}:${torque.test.driver.artifactId}:jar with value '${torque.test.driver.groupId}'
does not match a valid id pattern. @ line 392, column 22
[WARNING] 'build.plugins.plugin[org.codehaus.mojo:sql-maven-plugin].dependencies.dependency.version'
for ${torque.test.driver.groupId}:${torque.test.driver.artifactId}:jar must be a valid version
but is '${torque.test.driver.version}'. @ line 394, column 22
[WARNING] 'reporting.plugins.plugin.version' for org.apache.rat:apache-rat-plugin is missing.
@ org.apache.torque:torque-maven-parent:4.0-alpha1-SNAPSHOT, /home/jenkins/jenkins-slave/maven-repositories/1/org/apache/torque/torque-maven-parent/4.0-alpha1-SNAPSHOT/torque-maven-parent-4.0-alpha1-SNAPSHOT.pom,
line 478, column 15

	at hudson.maven.MavenModuleSetBuild$PomParser.invoke(MavenModuleSetBuild.java:1278)
	at hudson.maven.MavenModuleSetBuild$PomParser.invoke(MavenModuleSetBuild.java:1045)
	at hudson.FilePath$FileCallableWrapper.call(FilePath.java:2154)
	at hudson.remoting.UserRequest.perform(UserRequest.java:118)
	at hudson.remoting.UserRequest.perform(UserRequest.java:48)
	at hudson.remoting.Request$2.run(Request.java:287)
	at hudson.remoting.InterceptingExecutorService$1.call(InterceptingExecutorService.java:72)
	at java.util.concurrent.FutureTask$Sync.innerRun(FutureTask.java:334)
	at java.util.concurrent.FutureTask.run(FutureTask.java:166)
	at java.util.concurrent.ThreadPoolExecutor.runWorker(ThreadPoolExecutor.java:1110)
	at java.util.concurrent.ThreadPoolExecutor$Worker.run(ThreadPoolExecutor.java:603)
	at java.lang.Thread.run(Thread.java:679)
Caused by: hudson.remoting.ProxyException: org.apache.maven.project.ProjectBuildingException:
Some problems were encountered while processing the POMs:
[ERROR] 'dependencies.dependency.artifactId' for ${torque.test.driver.groupId}:${torque.test.driver.artifactId}:jar
with value '${torque.test.driver.artifactId}' does not match a valid id pattern. @ line 66,
column 19
[ERROR] 'dependencies.dependency.groupId' for ${torque.test.driver.groupId}:${torque.test.driver.artifactId}:jar
with value '${torque.test.driver.groupId}' does not match a valid id pattern. @ line 67, column
16
[WARNING] 'dependencies.dependency.version' for ${torque.test.driver.groupId}:${torque.test.driver.artifactId}:jar
must be a valid version but is '${torque.test.driver.version}'. @ line 68, column 16
[ERROR] 'build.plugins.plugin[org.apache.torque:maven-torque-generator-plugin].dependencies.dependency.artifactId'
for ${torque.test.driver.groupId}:${torque.test.driver.artifactId}:jar with value '${torque.test.driver.artifactId}'
does not match a valid id pattern. @ line 310, column 25
[ERROR] 'build.plugins.plugin[org.apache.torque:maven-torque-generator-plugin].dependencies.dependency.groupId'
for ${torque.test.driver.groupId}:${torque.test.driver.artifactId}:jar with value '${torque.test.driver.groupId}'
does not match a valid id pattern. @ line 309, column 22
[WARNING] 'build.plugins.plugin[org.apache.torque:maven-torque-generator-plugin].dependencies.dependency.version'
for ${torque.test.driver.groupId}:${torque.test.driver.artifactId}:jar must be a valid version
but is '${torque.test.driver.version}'. @ line 311, column 22
[ERROR] 'build.plugins.plugin[org.codehaus.mojo:sql-maven-plugin].dependencies.dependency.artifactId'
for ${torque.test.driver.groupId}:${torque.test.driver.artifactId}:jar with value '${torque.test.driver.artifactId}'
does not match a valid id pattern. @ line 393, column 25
[ERROR] 'build.plugins.plugin[org.codehaus.mojo:sql-maven-plugin].dependencies.dependency.groupId'
for ${torque.test.driver.groupId}:${torque.test.driver.artifactId}:jar with value '${torque.test.driver.groupId}'
does not match a valid id pattern. @ line 392, column 22
[WARNING] 'build.plugins.plugin[org.codehaus.mojo:sql-maven-plugin].dependencies.dependency.version'
for ${torque.test.driver.groupId}:${torque.test.driver.artifactId}:jar must be a valid version
but is '${torque.test.driver.version}'. @ line 394, column 22
[WARNING] 'reporting.plugins.plugin.version' for org.apache.rat:apache-rat-plugin is missing.
@ org.apache.torque:torque-maven-parent:4.0-alpha1-SNAPSHOT, /home/jenkins/jenkins-slave/maven-repositories/1/org/apache/torque/torque-maven-parent/4.0-alpha1-SNAPSHOT/torque-maven-parent-4.0-alpha1-SNAPSHOT.pom,
line 478, column 15

	at org.apache.maven.project.DefaultProjectBuilder.build(DefaultProjectBuilder.java:363)
	at hudson.maven.MavenEmbedder.buildProjects(MavenEmbedder.java:361)
	at hudson.maven.MavenEmbedder.readProjects(MavenEmbedder.java:331)
	at hudson.maven.MavenEmbedder.readProject(MavenEmbedder.java:322)
	at hudson.maven.MavenModuleSetBuild$PomParser.invoke(MavenModuleSetBuild.java:1234)
	... 11 more

---------------------------------------------------------------------
To unsubscribe, e-mail: torque-dev-unsubscribe@db.apache.org
For additional commands, e-mail: torque-dev-help@db.apache.org


Mime
View raw message