db-torque-dev mailing list archives

Site index · List index
Message view « Date » · « Thread »
Top « Date » · « Thread »
From Apache Jenkins Server <jenk...@builds.apache.org>
Subject Build failed in Jenkins: torque4-test-project-derby #81
Date Fri, 11 May 2012 02:25:01 GMT
See <https://builds.apache.org/job/torque4-test-project-derby/81/changes>

Changes:

[tfischer] TORQUE-177: Tests for function re-works

------------------------------------------
[...truncated 2563 lines...]
symbol  : class Sum
location: class org.apache.torque.util.SummaryHelperTest

[ERROR] <https://builds.apache.org/job/torque4-test-project-derby/ws/src/test/java/org/apache/torque/util/SummaryHelperTest.java>:[127,47]
cannot find symbol
symbol  : class Avg
location: class org.apache.torque.util.SummaryHelperTest

[ERROR] <https://builds.apache.org/job/torque4-test-project-derby/ws/src/test/java/org/apache/torque/util/SummaryHelperTest.java>:[130,47]
cannot find symbol
symbol  : class Min
location: class org.apache.torque.util.SummaryHelperTest

[ERROR] <https://builds.apache.org/job/torque4-test-project-derby/ws/src/test/java/org/apache/torque/util/SummaryHelperTest.java>:[133,47]
cannot find symbol
symbol  : class Max
location: class org.apache.torque.util.SummaryHelperTest

[ERROR] <https://builds.apache.org/job/torque4-test-project-derby/ws/src/test/java/org/apache/torque/util/SummaryHelperTest.java>:[136,47]
cannot find symbol
symbol  : class Sum
location: class org.apache.torque.util.SummaryHelperTest

[ERROR] <https://builds.apache.org/job/torque4-test-project-derby/ws/src/test/java/org/apache/torque/util/SummaryHelperTest.java>:[191,47]
cannot find symbol
symbol  : class Count
location: class org.apache.torque.util.SummaryHelperTest

[ERROR] <https://builds.apache.org/job/torque4-test-project-derby/ws/src/test/java/org/apache/torque/util/SummaryHelperTest.java>:[194,45]
cannot find symbol
symbol  : class Avg
location: class org.apache.torque.util.SummaryHelperTest

[ERROR] <https://builds.apache.org/job/torque4-test-project-derby/ws/src/test/java/org/apache/torque/util/SummaryHelperTest.java>:[197,45]
cannot find symbol
symbol  : class Min
location: class org.apache.torque.util.SummaryHelperTest

[ERROR] <https://builds.apache.org/job/torque4-test-project-derby/ws/src/test/java/org/apache/torque/util/SummaryHelperTest.java>:[200,45]
cannot find symbol
symbol  : class Max
location: class org.apache.torque.util.SummaryHelperTest

[ERROR] <https://builds.apache.org/job/torque4-test-project-derby/ws/src/test/java/org/apache/torque/util/SummaryHelperTest.java>:[203,45]
cannot find symbol
symbol  : class Sum
location: class org.apache.torque.util.SummaryHelperTest

[ERROR] <https://builds.apache.org/job/torque4-test-project-derby/ws/src/test/java/org/apache/torque/util/SummaryHelperTest.java>:[206,47]
cannot find symbol
symbol  : class Avg
location: class org.apache.torque.util.SummaryHelperTest

[ERROR] <https://builds.apache.org/job/torque4-test-project-derby/ws/src/test/java/org/apache/torque/util/SummaryHelperTest.java>:[209,47]
cannot find symbol
symbol  : class Min
location: class org.apache.torque.util.SummaryHelperTest

[ERROR] <https://builds.apache.org/job/torque4-test-project-derby/ws/src/test/java/org/apache/torque/util/SummaryHelperTest.java>:[212,47]
cannot find symbol
symbol  : class Max
location: class org.apache.torque.util.SummaryHelperTest

[ERROR] <https://builds.apache.org/job/torque4-test-project-derby/ws/src/test/java/org/apache/torque/util/SummaryHelperTest.java>:[215,47]
cannot find symbol
symbol  : class Sum
location: class org.apache.torque.util.SummaryHelperTest

[INFO] 44 errors 
[INFO] -------------------------------------------------------------
[JENKINS] Archiving <https://builds.apache.org/job/torque4-test-project-derby/ws/pom.xml>
to /home/hudson/hudson/jobs/torque4-test-project-derby/modules/org.apache.torque$torque-test/builds/2012-05-11_02-23-58/archive/org.apache.torque/torque-test/4.0-alpha1-SNAPSHOT/torque-test-4.0-alpha1-SNAPSHOT.pom
[INFO] ------------------------------------------------------------------------
[ERROR] BUILD FAILURE
[INFO] ------------------------------------------------------------------------
[INFO] Compilation failure

<https://builds.apache.org/job/torque4-test-project-derby/ws/src/test/java/org/apache/torque/generated/peer/SelectFunctionTest.java>:[28,39]
cannot find symbol
symbol  : class Avg
location: package org.apache.torque.util.functions

<https://builds.apache.org/job/torque4-test-project-derby/ws/src/test/java/org/apache/torque/generated/peer/SelectFunctionTest.java>:[29,39]
cannot find symbol
symbol  : class Count
location: package org.apache.torque.util.functions

<https://builds.apache.org/job/torque4-test-project-derby/ws/src/test/java/org/apache/torque/generated/peer/SelectFunctionTest.java>:[30,39]
cannot find symbol
symbol  : class Max
location: package org.apache.torque.util.functions

<https://builds.apache.org/job/torque4-test-project-derby/ws/src/test/java/org/apache/torque/generated/peer/SelectFunctionTest.java>:[31,39]
cannot find symbol
symbol  : class Min
location: package org.apache.torque.util.functions

<https://builds.apache.org/job/torque4-test-project-derby/ws/src/test/java/org/apache/torque/generated/peer/SelectFunctionTest.java>:[32,39]
cannot find symbol
symbol  : class Sum
location: package org.apache.torque.util.functions

<https://builds.apache.org/job/torque4-test-project-derby/ws/src/test/java/org/apache/torque/util/SummaryHelperTest.java>:[33,39]
cannot find symbol
symbol  : class Avg
location: package org.apache.torque.util.functions

<https://builds.apache.org/job/torque4-test-project-derby/ws/src/test/java/org/apache/torque/util/SummaryHelperTest.java>:[34,39]
cannot find symbol
symbol  : class Count
location: package org.apache.torque.util.functions

<https://builds.apache.org/job/torque4-test-project-derby/ws/src/test/java/org/apache/torque/util/SummaryHelperTest.java>:[35,39]
cannot find symbol
symbol  : class Max
location: package org.apache.torque.util.functions

<https://builds.apache.org/job/torque4-test-project-derby/ws/src/test/java/org/apache/torque/util/SummaryHelperTest.java>:[36,39]
cannot find symbol
symbol  : class Min
location: package org.apache.torque.util.functions

<https://builds.apache.org/job/torque4-test-project-derby/ws/src/test/java/org/apache/torque/util/SummaryHelperTest.java>:[37,39]
cannot find symbol
symbol  : class Sum
location: package org.apache.torque.util.functions

<https://builds.apache.org/job/torque4-test-project-derby/ws/src/test/java/org/apache/torque/generated/peer/SelectFunctionTest.java>:[71,20]
cannot find symbol
symbol  : class Avg
location: class org.apache.torque.generated.peer.SelectFunctionTest

<https://builds.apache.org/job/torque4-test-project-derby/ws/src/test/java/org/apache/torque/generated/peer/SelectFunctionTest.java>:[72,30]
cannot find symbol
symbol  : method doSelectSingleRecord(org.apache.torque.criteria.Criteria,org.apache.torque.om.mapper.IntegerMapper,org.apache.torque.map.TableMap)
location: class org.apache.torque.util.BasePeer

<https://builds.apache.org/job/torque4-test-project-derby/ws/src/test/java/org/apache/torque/generated/peer/SelectFunctionTest.java>:[88,20]
cannot find symbol
symbol  : class Avg
location: class org.apache.torque.generated.peer.SelectFunctionTest

<https://builds.apache.org/job/torque4-test-project-derby/ws/src/test/java/org/apache/torque/generated/peer/SelectFunctionTest.java>:[89,30]
cannot find symbol
symbol  : method doSelectSingleRecord(org.apache.torque.criteria.Criteria,org.apache.torque.om.mapper.IntegerMapper,org.apache.torque.map.TableMap)
location: class org.apache.torque.util.BasePeer

<https://builds.apache.org/job/torque4-test-project-derby/ws/src/test/java/org/apache/torque/generated/peer/SelectFunctionTest.java>:[104,63]
cannot find symbol
symbol  : class Count
location: class org.apache.torque.generated.peer.SelectFunctionTest

<https://builds.apache.org/job/torque4-test-project-derby/ws/src/test/java/org/apache/torque/generated/peer/SelectFunctionTest.java>:[105,32]
cannot find symbol
symbol  : method doSelectSingleRecord(org.apache.torque.criteria.Criteria,org.apache.torque.om.mapper.IntegerMapper,org.apache.torque.map.TableMap)
location: class org.apache.torque.util.BasePeer

<https://builds.apache.org/job/torque4-test-project-derby/ws/src/test/java/org/apache/torque/generated/peer/SelectFunctionTest.java>:[121,20]
cannot find symbol
symbol  : class Count
location: class org.apache.torque.generated.peer.SelectFunctionTest

<https://builds.apache.org/job/torque4-test-project-derby/ws/src/test/java/org/apache/torque/generated/peer/SelectFunctionTest.java>:[122,32]
cannot find symbol
symbol  : method doSelectSingleRecord(org.apache.torque.criteria.Criteria,org.apache.torque.om.mapper.IntegerMapper,org.apache.torque.map.TableMap)
location: class org.apache.torque.util.BasePeer

<https://builds.apache.org/job/torque4-test-project-derby/ws/src/test/java/org/apache/torque/generated/peer/SelectFunctionTest.java>:[138,20]
cannot find symbol
symbol  : class Min
location: class org.apache.torque.generated.peer.SelectFunctionTest

<https://builds.apache.org/job/torque4-test-project-derby/ws/src/test/java/org/apache/torque/generated/peer/SelectFunctionTest.java>:[139,30]
cannot find symbol
symbol  : method doSelectSingleRecord(org.apache.torque.criteria.Criteria,org.apache.torque.om.mapper.IntegerMapper,org.apache.torque.map.TableMap)
location: class org.apache.torque.util.BasePeer

<https://builds.apache.org/job/torque4-test-project-derby/ws/src/test/java/org/apache/torque/generated/peer/SelectFunctionTest.java>:[155,20]
cannot find symbol
symbol  : class Max
location: class org.apache.torque.generated.peer.SelectFunctionTest

<https://builds.apache.org/job/torque4-test-project-derby/ws/src/test/java/org/apache/torque/generated/peer/SelectFunctionTest.java>:[156,30]
cannot find symbol
symbol  : method doSelectSingleRecord(org.apache.torque.criteria.Criteria,org.apache.torque.om.mapper.IntegerMapper,org.apache.torque.map.TableMap)
location: class org.apache.torque.util.BasePeer

<https://builds.apache.org/job/torque4-test-project-derby/ws/src/test/java/org/apache/torque/generated/peer/SelectFunctionTest.java>:[172,19]
cannot find symbol
symbol  : class Sum
location: class org.apache.torque.generated.peer.SelectFunctionTest

<https://builds.apache.org/job/torque4-test-project-derby/ws/src/test/java/org/apache/torque/generated/peer/SelectFunctionTest.java>:[173,29]
cannot find symbol
symbol  : method doSelectSingleRecord(org.apache.torque.criteria.Criteria,org.apache.torque.om.mapper.IntegerMapper,org.apache.torque.map.TableMap)
location: class org.apache.torque.util.BasePeer

<https://builds.apache.org/job/torque4-test-project-derby/ws/src/test/java/org/apache/torque/generated/peer/SelectFunctionTest.java>:[189,19]
cannot find symbol
symbol  : class Sum
location: class org.apache.torque.generated.peer.SelectFunctionTest

<https://builds.apache.org/job/torque4-test-project-derby/ws/src/test/java/org/apache/torque/generated/peer/SelectFunctionTest.java>:[190,29]
cannot find symbol
symbol  : method doSelectSingleRecord(org.apache.torque.criteria.Criteria,org.apache.torque.om.mapper.IntegerMapper,org.apache.torque.map.TableMap)
location: class org.apache.torque.util.BasePeer

<https://builds.apache.org/job/torque4-test-project-derby/ws/src/test/java/org/apache/torque/util/SummaryHelperTest.java>:[112,47]
cannot find symbol
symbol  : class Count
location: class org.apache.torque.util.SummaryHelperTest

<https://builds.apache.org/job/torque4-test-project-derby/ws/src/test/java/org/apache/torque/util/SummaryHelperTest.java>:[115,45]
cannot find symbol
symbol  : class Avg
location: class org.apache.torque.util.SummaryHelperTest

<https://builds.apache.org/job/torque4-test-project-derby/ws/src/test/java/org/apache/torque/util/SummaryHelperTest.java>:[118,45]
cannot find symbol
symbol  : class Min
location: class org.apache.torque.util.SummaryHelperTest

<https://builds.apache.org/job/torque4-test-project-derby/ws/src/test/java/org/apache/torque/util/SummaryHelperTest.java>:[121,45]
cannot find symbol
symbol  : class Max
location: class org.apache.torque.util.SummaryHelperTest

<https://builds.apache.org/job/torque4-test-project-derby/ws/src/test/java/org/apache/torque/util/SummaryHelperTest.java>:[124,45]
cannot find symbol
symbol  : class Sum
location: class org.apache.torque.util.SummaryHelperTest

<https://builds.apache.org/job/torque4-test-project-derby/ws/src/test/java/org/apache/torque/util/SummaryHelperTest.java>:[127,47]
cannot find symbol
symbol  : class Avg
location: class org.apache.torque.util.SummaryHelperTest

<https://builds.apache.org/job/torque4-test-project-derby/ws/src/test/java/org/apache/torque/util/SummaryHelperTest.java>:[130,47]
cannot find symbol
symbol  : class Min
location: class org.apache.torque.util.SummaryHelperTest

<https://builds.apache.org/job/torque4-test-project-derby/ws/src/test/java/org/apache/torque/util/SummaryHelperTest.java>:[133,47]
cannot find symbol
symbol  : class Max
location: class org.apache.torque.util.SummaryHelperTest

<https://builds.apache.org/job/torque4-test-project-derby/ws/src/test/java/org/apache/torque/util/SummaryHelperTest.java>:[136,47]
cannot find symbol
symbol  : class Sum
location: class org.apache.torque.util.SummaryHelperTest

<https://builds.apache.org/job/torque4-test-project-derby/ws/src/test/java/org/apache/torque/util/SummaryHelperTest.java>:[191,47]
cannot find symbol
symbol  : class Count
location: class org.apache.torque.util.SummaryHelperTest

<https://builds.apache.org/job/torque4-test-project-derby/ws/src/test/java/org/apache/torque/util/SummaryHelperTest.java>:[194,45]
cannot find symbol
symbol  : class Avg
location: class org.apache.torque.util.SummaryHelperTest

<https://builds.apache.org/job/torque4-test-project-derby/ws/src/test/java/org/apache/torque/util/SummaryHelperTest.java>:[197,45]
cannot find symbol
symbol  : class Min
location: class org.apache.torque.util.SummaryHelperTest

<https://builds.apache.org/job/torque4-test-project-derby/ws/src/test/java/org/apache/torque/util/SummaryHelperTest.java>:[200,45]
cannot find symbol
symbol  : class Max
location: class org.apache.torque.util.SummaryHelperTest

<https://builds.apache.org/job/torque4-test-project-derby/ws/src/test/java/org/apache/torque/util/SummaryHelperTest.java>:[203,45]
cannot find symbol
symbol  : class Sum
location: class org.apache.torque.util.SummaryHelperTest

<https://builds.apache.org/job/torque4-test-project-derby/ws/src/test/java/org/apache/torque/util/SummaryHelperTest.java>:[206,47]
cannot find symbol
symbol  : class Avg
location: class org.apache.torque.util.SummaryHelperTest

<https://builds.apache.org/job/torque4-test-project-derby/ws/src/test/java/org/apache/torque/util/SummaryHelperTest.java>:[209,47]
cannot find symbol
symbol  : class Min
location: class org.apache.torque.util.SummaryHelperTest

<https://builds.apache.org/job/torque4-test-project-derby/ws/src/test/java/org/apache/torque/util/SummaryHelperTest.java>:[212,47]
cannot find symbol
symbol  : class Max
location: class org.apache.torque.util.SummaryHelperTest

<https://builds.apache.org/job/torque4-test-project-derby/ws/src/test/java/org/apache/torque/util/SummaryHelperTest.java>:[215,47]
cannot find symbol
symbol  : class Sum
location: class org.apache.torque.util.SummaryHelperTest


[INFO] ------------------------------------------------------------------------
[INFO] For more information, run Maven with the -e switch
[INFO] ------------------------------------------------------------------------
[INFO] Total time: 37 seconds
[INFO] Finished at: Fri May 11 02:24:59 UTC 2012
[INFO] Final Memory: 47M/338M
[INFO] ------------------------------------------------------------------------
Sending e-mails to: torque-dev@db.apache.org
channel stopped

---------------------------------------------------------------------
To unsubscribe, e-mail: torque-dev-unsubscribe@db.apache.org
For additional commands, e-mail: torque-dev-help@db.apache.org


Mime
View raw message