db-torque-dev mailing list archives

Site index · List index
Message view « Date » · « Thread »
Top « Date » · « Thread »
From Thomas Fox <Thomas....@seitenbau.net>
Subject RE: [GUMP@vmgump]: Project db-torque-runtime-test (in module db-torque) failed
Date Wed, 18 Apr 2012 11:35:26 GMT
Now that we have the jenkins build running (ahem.. failing at the
moment...) IMHO the time has come to diable gump, as discussed months ago.
Does anybody know how to do this ? Just remove the *gump.xml files ?

     Thomas

> Von:
>
> general@gump.apache.org
>
> An:
>
> torque-dev@db.apache.org
>
> Datum:
>
> 18.04.2012 10:54
>
> Betreff:
>
> [GUMP@vmgump]: Project db-torque-runtime-test (in module db-torque)
failed
>
> To whom it may engage...
>
> This is an automated request, but not an unsolicited one. For
> more information please visit http://gump.apache.org/nagged.html,
> and/or contact the folk at general@gump.apache.org.
>
> Project db-torque-runtime-test has an issue affecting its community
> integration.
> This issue affects 1 projects,
>  and has been outstanding for 2 runs.
> The current state of this project is 'Failed', with reason 'Build
Failed'.
> For reference only, the following projects are affected by this:
>     - db-torque-runtime-test :  Persistence Layer
>
>
> Full details are available at:
>     http://vmgump.apache.org/gump/public/db-torque/db-torque-
> runtime-test/index.html
>
> That said, some information snippets are provided here.
>
> The following annotations (debug/informational/warning/error
> messages) were provided:
>  -WARNING- Overriding Maven settings: [/srv/gump/public/workspace/
> db-torque/torque-runtime/gump_mvn_settings.xml]
>  -DEBUG- (Apache Gump generated) Apache Maven Settings in: /srv/
> gump/public/workspace/db-torque/torque-runtime/gump_mvn_settings.xml
>  -INFO- Failed with reason build failed
>  -DEBUG- Maven POM in: /srv/gump/public/workspace/db-torque/torque-
> runtime/pom.xml
>  -INFO- Project Reports in: /srv/gump/public/workspace/db-torque/
> torque-runtime/target/surefire-reports
>
>
>
> The following work was performed:
> http://vmgump.apache.org/gump/public/db-torque/db-torque-runtime-
> test/gump_work/build_db-torque_db-torque-runtime-test.html
> Work Name: build_db-torque_db-torque-runtime-test (Type: Build)
> Work ended in a state of : Failed
> Elapsed: 18 secs
> Command Line: /opt/maven2/bin/mvn --batch-mode --settings /srv/gump/
> public/workspace/db-torque/torque-runtime/gump_mvn_settings.xml install
> [Working Directory: /srv/gump/public/workspace/db-torque/torque-runtime]
> M2_HOME: /opt/maven2
> ---------------------------------------------
> [DEBUG] Initializable.initialize() for TorqueComponent
> [DEBUG] initialize()
> [DEBUG] YAAFI Avalon Service Container is up and running
> [INFO] YaffiContainer ready.
> [DEBUG] Located the service 'org.apache.torque.avalon.Torque' in the
> local container
> [DEBUG] Disposing of container...
> [DEBUG] Disposing all services
> [DEBUG] Decommision the service TorqueComponent
> [DEBUG] Decommisioning the service TorqueComponent
> [DEBUG] Disposable.dispose() for TorqueComponent
> [DEBUG] dispose()
> [DEBUG] Disposing the service TorqueComponent
> [DEBUG] All services are disposed
> [INFO] YaffiContainer has been disposed.
> Tests run: 2, Failures: 0, Errors: 0, Skipped: 0, Time elapsed: 0.354 sec
> Running org.apache.torque.util.BasePeerImplTest
> Tests run: 2, Failures: 0, Errors: 0, Skipped: 0, Time elapsed: 0.823 sec
> Running org.apache.torque.map.ColumnMapTest
> Tests run: 3, Failures: 0, Errors: 0, Skipped: 0, Time elapsed: 0.19 sec
> Running org.apache.torque.TorqueRuntimeExceptionTest
> Tests run: 1, Failures: 0, Errors: 0, Skipped: 0, Time elapsed: 0.179 sec
> Running org.apache.torque.criteria.CriterionTest
> Tests run: 3, Failures: 0, Errors: 0, Skipped: 0, Time elapsed: 0.199 sec
> Running org.apache.torque.ColumnImplTest
> Tests run: 41, Failures: 0, Errors: 0, Skipped: 0, Time elapsed: 0.444
sec
> Running org.apache.torque.criteria.JoinTest
> Tests run: 2, Failures: 0, Errors: 0, Skipped: 0, Time elapsed: 0.193 sec
> Running org.apache.torque.sql.SqlBuilderTest
> Tests run: 86, Failures: 1, Errors: 0, Skipped: 0, Time elapsed: 0.
> 938 sec <<< FAILURE!
>
> Results :
>
> Failed tests:
>   testCriterionInLargeArray(org.apache.torque.sql.SqlBuilderTest)
>
> Tests run: 223, Failures: 1, Errors: 0, Skipped: 0
>
> [INFO]
> ------------------------------------------------------------------------
> [ERROR] BUILD FAILURE
> [INFO]
> ------------------------------------------------------------------------
> [INFO] There are test failures.
>
> Please refer to /srv/gump/public/workspace/db-torque/torque-runtime/
> target/surefire-reports for the individual test results.
> [INFO]
> ------------------------------------------------------------------------
> [INFO] For more information, run Maven with the -e switch
> [INFO]
> ------------------------------------------------------------------------
> [INFO] Total time: 17 seconds
> [INFO] Finished at: Wed Apr 18 08:53:40 UTC 2012
> [INFO] Final Memory: 27M/66M
> [INFO]
> ------------------------------------------------------------------------
> ---------------------------------------------
>
> To subscribe to this information via syndicated feeds:
> - RSS: http://vmgump.apache.org/gump/public/db-torque/db-torque-
> runtime-test/rss.xml
> - Atom: http://vmgump.apache.org/gump/public/db-torque/db-torque-
> runtime-test/atom.xml
>
> ============================== Gump Tracking Only ===
> Produced by Apache Gump(TM) version 2.3.
> Gump Run 14000018042012, vmgump.apache.org:vmgump:14000018042012
> Gump E-mail Identifier (unique within run) #61.
>
> --
> Apache Gump
> http://gump.apache.org/ [Instance: vmgump]
>
> ---------------------------------------------------------------------
> To unsubscribe, e-mail: torque-dev-unsubscribe@db.apache.org
> For additional commands, e-mail: torque-dev-help@db.apache.org
>


---------------------------------------------------------------------
To unsubscribe, e-mail: torque-dev-unsubscribe@db.apache.org
For additional commands, e-mail: torque-dev-help@db.apache.org


Mime
View raw message