db-torque-dev mailing list archives

Site index · List index
Message view « Date » · « Thread »
Top « Date » · « Thread »
From gene...@gump.apache.org
Subject [GUMP@vmgump]: Project db-torque-templates-test (in module db-torque) failed
Date Mon, 20 Feb 2012 03:36:46 GMT
To whom it may engage...
        
This is an automated request, but not an unsolicited one. For 
more information please visit http://gump.apache.org/nagged.html, 
and/or contact the folk at general@gump.apache.org.

Project db-torque-templates-test has an issue affecting its community integration.
This issue affects 1 projects,
 and has been outstanding for 7 runs.
The current state of this project is 'Failed', with reason 'Build Failed'.
For reference only, the following projects are affected by this:
    - db-torque-templates-test :  Persistence Layer


Full details are available at:
    http://vmgump.apache.org/gump/public/db-torque/db-torque-templates-test/index.html

That said, some information snippets are provided here.

The following annotations (debug/informational/warning/error messages) were provided:
 -WARNING- Overriding Maven settings: [/srv/gump/public/workspace/db-torque/torque-templates/gump_mvn_settings.xml]
 -DEBUG- (Apache Gump generated) Apache Maven Settings in: /srv/gump/public/workspace/db-torque/torque-templates/gump_mvn_settings.xml
 -INFO- Failed with reason build failed
 -DEBUG- Maven POM in: /srv/gump/public/workspace/db-torque/torque-templates/pom.xml
 -INFO- Project Reports in: /srv/gump/public/workspace/db-torque/torque-templates/target/surefire-reports



The following work was performed:
http://vmgump.apache.org/gump/public/db-torque/db-torque-templates-test/gump_work/build_db-torque_db-torque-templates-test.html
Work Name: build_db-torque_db-torque-templates-test (Type: Build)
Work ended in a state of : Failed
Elapsed: 19 secs
Command Line: /opt/maven2/bin/mvn --batch-mode --settings /srv/gump/public/workspace/db-torque/torque-templates/gump_mvn_settings.xml
test 
[Working Directory: /srv/gump/public/workspace/db-torque/torque-templates]
M2_HOME: /opt/maven2
---------------------------------------------
	at org.apache.torque.generator.control.action.ApplyAction.execute(ApplyAction.java:137)
	at org.apache.torque.generator.outlet.OutletImpl.mergepoint(OutletImpl.java:330)
	at org.apache.torque.generator.template.velocity.TorqueGenVelocity.mergepoint(TorqueGenVelocity.java:90)
	at sun.reflect.GeneratedMethodAccessor3.invoke(Unknown Source)
	at sun.reflect.DelegatingMethodAccessorImpl.invoke(DelegatingMethodAccessorImpl.java:43)
	at java.lang.reflect.Method.invoke(Method.java:616)
	at org.apache.velocity.util.introspection.UberspectImpl$VelMethodImpl.doInvoke(UberspectImpl.java:395)
	at org.apache.velocity.util.introspection.UberspectImpl$VelMethodImpl.invoke(UberspectImpl.java:384)
	at org.apache.velocity.runtime.parser.node.ASTMethod.execute(ASTMethod.java:173)
	... 78 more
Caused by: org.apache.torque.generator.configuration.ConfigurationException: template file
/srv/gump/public/workspace/db-torque/torque-templates/src/main/resources/org/apache/torque/templates/sql/templates/ddl/mysql/tableCreateOptions.vm
not found
	at org.apache.torque.generator.configuration.DirectoryConfigurationProvider.getInputStream(DirectoryConfigurationProvider.java:180)
	at org.apache.torque.generator.configuration.DirectoryConfigurationProvider.getTemplateInputStream(DirectoryConfigurationProvider.java:105)
	at org.apache.torque.generator.template.TemplateOutletImpl.getContent(TemplateOutletImpl.java:137)
	at org.apache.torque.generator.template.velocity.VelocityOutlet.execute(VelocityOutlet.java:251)
	... 87 more
Caused by: java.io.FileNotFoundException: /srv/gump/public/workspace/db-torque/torque-templates/src/main/resources/org/apache/torque/templates/sql/templates/ddl/mysql/tableCreateOptions.vm
(No such file or directory)
	at java.io.FileInputStream.open(Native Method)
	at java.io.FileInputStream.<init>(FileInputStream.java:137)
	at org.apache.torque.generator.configuration.DirectoryConfigurationProvider.getInputStream(DirectoryConfigurationProvider.java:176)
	... 90 more
Tests run: 1, Failures: 0, Errors: 1, Skipped: 0, Time elapsed: 7.08 sec <<< FAILURE!
Running org.apache.torque.templates.jdbc2schema.Jdbc2SchemaTest
INFO  org.apache.torque.generator.control.Controller - readConfiguration() : Starting to read
configuration files
INFO  org.apache.torque.generator.control.Controller - readConfiguration() : Configuration
read.
INFO  org.apache.torque.generator.control.Controller - Processing output torque.jdbc2schema
INFO  org.apache.torque.generator.control.Controller - Processing source JdbcMetadataSource
using url jdbc:derby:memory:myDb;create=true
INFO  org.apache.torque.generator.control.Controller - Start generation of File /srv/gump/public/workspace/db-torque/torque-templates/target/generated-schema/schema.xml
Tests run: 1, Failures: 0, Errors: 0, Skipped: 0, Time elapsed: 2.996 sec

Results :

Tests in error: 
  testProcessSchemaXml(org.apache.torque.templates.TestProcessing)

Tests run: 2, Failures: 0, Errors: 1, Skipped: 0

[INFO] ------------------------------------------------------------------------
[ERROR] BUILD FAILURE
[INFO] ------------------------------------------------------------------------
[INFO] There are test failures.

Please refer to /srv/gump/public/workspace/db-torque/torque-templates/target/surefire-reports
for the individual test results.
[INFO] ------------------------------------------------------------------------
[INFO] For more information, run Maven with the -e switch
[INFO] ------------------------------------------------------------------------
[INFO] Total time: 17 seconds
[INFO] Finished at: Mon Feb 20 03:36:46 UTC 2012
[INFO] Final Memory: 26M/62M
[INFO] ------------------------------------------------------------------------
---------------------------------------------

To subscribe to this information via syndicated feeds:
- RSS: http://vmgump.apache.org/gump/public/db-torque/db-torque-templates-test/rss.xml
- Atom: http://vmgump.apache.org/gump/public/db-torque/db-torque-templates-test/atom.xml

============================== Gump Tracking Only ===
Produced by Apache Gump(TM) version 2.3.
Gump Run 12000020022012, vmgump.apache.org:vmgump:12000020022012
Gump E-mail Identifier (unique within run) #28.

--
Apache Gump
http://gump.apache.org/ [Instance: vmgump]

---------------------------------------------------------------------
To unsubscribe, e-mail: torque-dev-unsubscribe@db.apache.org
For additional commands, e-mail: torque-dev-help@db.apache.org


Mime
View raw message