db-torque-dev mailing list archives

Site index · List index
Message view « Date » · « Thread »
Top « Date » · « Thread »
From gene...@gump.apache.org
Subject [GUMP@vmgump]: Project db-torque-templates (in module db-torque) failed
Date Thu, 24 Nov 2011 04:31:33 GMT
To whom it may engage...
        
This is an automated request, but not an unsolicited one. For 
more information please visit http://gump.apache.org/nagged.html, 
and/or contact the folk at general@gump.apache.org.

Project db-torque-templates has an issue affecting its community integration.
This issue affects 2 projects,
 and has been outstanding for 3 runs.
The current state of this project is 'Failed', with reason 'Build Failed'.
For reference only, the following projects are affected by this:
    - db-torque-templates :  Persistence Layer
    - db-torque-templates-test :  Persistence Layer


Full details are available at:
    http://vmgump.apache.org/gump/public/db-torque/db-torque-templates/index.html

That said, some information snippets are provided here.

The following annotations (debug/informational/warning/error messages) were provided:
 -DEBUG- (Apache Gump generated) Apache Maven Settings in: /srv/gump/public/workspace/db-torque/torque-templates/gump_mvn_settings.xml
 -INFO- Failed with reason build failed
 -DEBUG- Maven POM in: /srv/gump/public/workspace/db-torque/torque-templates/pom.xml
 -INFO- Failed to extract fallback artifacts from Gump Repository



The following work was performed:
http://vmgump.apache.org/gump/public/db-torque/db-torque-templates/gump_work/build_db-torque_db-torque-templates.html
Work Name: build_db-torque_db-torque-templates (Type: Build)
Work ended in a state of : Failed
Elapsed: 14 secs
Command Line: /opt/maven2/bin/mvn --batch-mode -DskipTests=true --settings /srv/gump/public/workspace/db-torque/torque-templates/gump_mvn_settings.xml
install 
[Working Directory: /srv/gump/public/workspace/db-torque/torque-templates]
M2_HOME: /opt/maven2
---------------------------------------------
[INFO] Building Torque Templates
[INFO]    task-segment: [install]
[INFO] ------------------------------------------------------------------------
[INFO] Setting property: classpath.resource.loader.class => 'org.codehaus.plexus.velocity.ContextClassLoaderResourceLoader'.
[INFO] Setting property: velocimacro.messages.on => 'false'.
[INFO] Setting property: resource.loader => 'classpath'.
[INFO] Setting property: resource.manager.logwhenfound => 'false'.
[INFO] [remote-resources:process {execution: default}]
[INFO] snapshot org.apache.torque:torque-generator:4.0-alpha1-SNAPSHOT: checking for updates
from apache.snapshots
Downloading: http://localhost:8192/maven2/xmlunit/xmlunit/1.3/xmlunit-1.3.pom

Downloading: http://localhost:8192/maven2/xmlunit/xmlunit/1.3/xmlunit-1.3.jar
195K downloaded  (xmlunit-1.3.jar)
[INFO] [resources:resources {execution: default-resources}]
[INFO] Using 'ISO-8859-1' encoding to copy filtered resources.
[INFO] Copying 236 resources
[INFO] Copying 3 resources
[INFO] [compiler:compile {execution: default-compile}]
[INFO] Compiling 62 source files to /srv/gump/public/workspace/db-torque/torque-templates/target/classes
[INFO] [resources:testResources {execution: default-testResources}]
[INFO] Using 'ISO-8859-1' encoding to copy filtered resources.
[INFO] Copying 2 resources
[INFO] Copying 3 resources
[INFO] [compiler:testCompile {execution: default-testCompile}]
[INFO] Compiling 2 source files to /srv/gump/public/workspace/db-torque/torque-templates/target/test-classes
[INFO] -------------------------------------------------------------
[ERROR] COMPILATION ERROR : 
[INFO] -------------------------------------------------------------
[ERROR] /srv/gump/public/workspace/db-torque/torque-templates/src/test/java/org/apache/torque/templates/TestProcessing.java:[100,18]
cannot find symbol
symbol  : constructor FileSourceProvider(<nulltype>,org.apache.torque.generator.file.Fileset)
location: class org.apache.torque.generator.source.stream.FileSourceProvider

[INFO] 1error
[INFO] -------------------------------------------------------------
[INFO] ------------------------------------------------------------------------
[ERROR] BUILD FAILURE
[INFO] ------------------------------------------------------------------------
[INFO] Compilation failure
/srv/gump/public/workspace/db-torque/torque-templates/src/test/java/org/apache/torque/templates/TestProcessing.java:[100,18]
cannot find symbol
symbol  : constructor FileSourceProvider(<nulltype>,org.apache.torque.generator.file.Fileset)
location: class org.apache.torque.generator.source.stream.FileSourceProvider


[INFO] ------------------------------------------------------------------------
[INFO] For more information, run Maven with the -e switch
[INFO] ------------------------------------------------------------------------
[INFO] Total time: 12 seconds
[INFO] Finished at: Thu Nov 24 04:31:32 UTC 2011
[INFO] Final Memory: 28M/68M
[INFO] ------------------------------------------------------------------------
---------------------------------------------

To subscribe to this information via syndicated feeds:
- RSS: http://vmgump.apache.org/gump/public/db-torque/db-torque-templates/rss.xml
- Atom: http://vmgump.apache.org/gump/public/db-torque/db-torque-templates/atom.xml

============================== Gump Tracking Only ===
Produced by Apache Gump(TM) version 2.3.
Gump Run 11000024112011, vmgump.apache.org:vmgump:11000024112011
Gump E-mail Identifier (unique within run) #28.

--
Apache Gump
http://gump.apache.org/ [Instance: vmgump]

---------------------------------------------------------------------
To unsubscribe, e-mail: torque-dev-unsubscribe@db.apache.org
For additional commands, e-mail: torque-dev-help@db.apache.org


Mime
View raw message