db-torque-dev mailing list archives

Site index · List index
Message view « Date » · « Thread »
Top « Date » · « Thread »
From gene...@gump.apache.org
Subject [GUMP@vmgump]: Project db-torque-templates-test (in module db-torque) failed
Date Sun, 23 Oct 2011 10:00:03 GMT
To whom it may engage...
        
This is an automated request, but not an unsolicited one. For 
more information please visit http://gump.apache.org/nagged.html, 
and/or contact the folk at general@gump.apache.org.

Project db-torque-templates-test has an issue affecting its community integration.
This issue affects 1 projects,
 and has been outstanding for 308 runs.
The current state of this project is 'Failed', with reason 'Build Failed'.
For reference only, the following projects are affected by this:
    - db-torque-templates-test :  Persistence Layer


Full details are available at:
    http://vmgump.apache.org/gump/public/db-torque/db-torque-templates-test/index.html

That said, some information snippets are provided here.

The following annotations (debug/informational/warning/error messages) were provided:
 -WARNING- Overriding Maven settings: [/srv/gump/public/workspace/db-torque/torque-templates/gump_mvn_settings.xml]
 -DEBUG- (Apache Gump generated) Apache Maven Settings in: /srv/gump/public/workspace/db-torque/torque-templates/gump_mvn_settings.xml
 -INFO- Failed with reason build failed
 -DEBUG- Maven POM in: /srv/gump/public/workspace/db-torque/torque-templates/pom.xml
 -INFO- Project Reports in: /srv/gump/public/workspace/db-torque/torque-templates/target/surefire-reports



The following work was performed:
http://vmgump.apache.org/gump/public/db-torque/db-torque-templates-test/gump_work/build_db-torque_db-torque-templates-test.html
Work Name: build_db-torque_db-torque-templates-test (Type: Build)
Work ended in a state of : Failed
Elapsed: 18 secs
Command Line: /opt/maven2/bin/mvn --batch-mode --settings /srv/gump/public/workspace/db-torque/torque-templates/gump_mvn_settings.xml
test 
[Working Directory: /srv/gump/public/workspace/db-torque/torque-templates]
M2_HOME: /opt/maven2
---------------------------------------------
INFO  org.apache.torque.generator.control.Controller - Processing source /srv/gump/public/workspace/db-torque/torque-templates/src/test/schema/./ext-schema.xml
INFO  org.apache.torque.generator.control.Controller - Start generation of File target/generated-sql/ext-schema-idtable-init.sql
INFO  org.apache.torque.generator.control.Controller - Processing source /srv/gump/public/workspace/db-torque/torque-templates/src/test/schema/./schema.xml
INFO  org.apache.torque.generator.control.Controller - Start generation of File target/generated-sql/schema-idtable-init.sql
INFO  org.apache.torque.generator.control.Controller - Processing source /srv/gump/public/workspace/db-torque/torque-templates/src/test/schema/./extext-schema.xml
INFO  org.apache.torque.generator.control.Controller - Start generation of File target/generated-docs/datamodel.css
INFO  org.apache.torque.generator.control.Controller - Processing source /srv/gump/public/workspace/db-torque/torque-templates/src/test/schema/./ext-schema.xml
INFO  org.apache.torque.generator.control.Controller - Start generation of File target/generated-docs/datamodel.css
INFO  org.apache.torque.generator.control.Controller - Processing source /srv/gump/public/workspace/db-torque/torque-templates/src/test/schema/./schema.xml
INFO  org.apache.torque.generator.control.Controller - Start generation of File target/generated-docs/datamodel.css
INFO  org.apache.torque.generator.control.Controller - Processing source /srv/gump/public/workspace/db-torque/torque-templates/src/test/schema/./extext-schema.xml
INFO  org.apache.torque.generator.control.Controller - Start generation of File target/generated-docs/extext-schema.html
INFO  org.apache.torque.generator.control.Controller - Processing source /srv/gump/public/workspace/db-torque/torque-templates/src/test/schema/./ext-schema.xml
INFO  org.apache.torque.generator.control.Controller - Start generation of File target/generated-docs/ext-schema.html
INFO  org.apache.torque.generator.control.Controller - Processing source /srv/gump/public/workspace/db-torque/torque-templates/src/test/schema/./schema.xml
INFO  org.apache.torque.generator.control.Controller - Start generation of File target/generated-docs/schema.html
INFO  org.apache.torque.generator.control.Controller - Processing source /srv/gump/public/workspace/db-torque/torque-templates/src/test/schema/./extext-schema.xml
INFO  org.apache.torque.generator.control.Controller - Start generation of File target/generated-xdocs/datamodel.xml
INFO  org.apache.torque.generator.control.Controller - Processing source /srv/gump/public/workspace/db-torque/torque-templates/src/test/schema/./ext-schema.xml
INFO  org.apache.torque.generator.control.Controller - Start generation of File target/generated-xdocs/datamodel.xml
INFO  org.apache.torque.generator.control.Controller - Processing source /srv/gump/public/workspace/db-torque/torque-templates/src/test/schema/./schema.xml
INFO  org.apache.torque.generator.control.Controller - Start generation of File target/generated-xdocs/datamodel.xml
Tests run: 1, Failures: 0, Errors: 0, Skipped: 0, Time elapsed: 6.772 sec
Running org.apache.torque.templates.jdbc2schema.Jdbc2SchemaTest
INFO  org.apache.torque.generator.control.Controller - readConfiguration() : Starting to read
configuration files
INFO  org.apache.torque.generator.control.Controller - readConfiguration() : Configuration
read.
INFO  org.apache.torque.generator.control.Controller - Processing source JdbcMetadataSource
using url jdbc:derby:memory:myDb;create=true
INFO  org.apache.torque.generator.control.Controller - Start generation of File target/generated-schema/schema.xml
Tests run: 1, Failures: 0, Errors: 1, Skipped: 0, Time elapsed: 3.304 sec <<< FAILURE!

Results :

Tests in error: 
  testExecute(org.apache.torque.templates.jdbc2schema.Jdbc2SchemaTest)

Tests run: 2, Failures: 0, Errors: 1, Skipped: 0

[INFO] ------------------------------------------------------------------------
[ERROR] BUILD FAILURE
[INFO] ------------------------------------------------------------------------
[INFO] There are test failures.

Please refer to /srv/gump/public/workspace/db-torque/torque-templates/target/surefire-reports
for the individual test results.
[INFO] ------------------------------------------------------------------------
[INFO] For more information, run Maven with the -e switch
[INFO] ------------------------------------------------------------------------
[INFO] Total time: 17 seconds
[INFO] Finished at: Sun Oct 23 10:00:02 UTC 2011
[INFO] Final Memory: 24M/58M
[INFO] ------------------------------------------------------------------------
---------------------------------------------

To subscribe to this information via syndicated feeds:
- RSS: http://vmgump.apache.org/gump/public/db-torque/db-torque-templates-test/rss.xml
- Atom: http://vmgump.apache.org/gump/public/db-torque/db-torque-templates-test/atom.xml

============================== Gump Tracking Only ===
Produced by Apache Gump(TM) version 2.3.
Gump Run 05000623102011, vmgump.apache.org:vmgump:05000623102011
Gump E-mail Identifier (unique within run) #26.

--
Apache Gump
http://gump.apache.org/ [Instance: vmgump]

---------------------------------------------------------------------
To unsubscribe, e-mail: torque-dev-unsubscribe@db.apache.org
For additional commands, e-mail: torque-dev-help@db.apache.org


Mime
View raw message