db-torque-dev mailing list archives

Site index · List index
Message view « Date » · « Thread »
Top « Date » · « Thread »
From gene...@gump.apache.org
Subject [GUMP@vmgump]: Project db-torque-runtime (in module db-torque) failed
Date Fri, 05 Aug 2011 12:30:03 GMT
To whom it may engage...
        
This is an automated request, but not an unsolicited one. For 
more information please visit http://gump.apache.org/nagged.html, 
and/or contact the folk at general@gump.apache.org.

Project db-torque-runtime has an issue affecting its community integration.
This issue affects 2 projects,
 and has been outstanding for 32 runs.
The current state of this project is 'Failed', with reason 'Build Failed'.
For reference only, the following projects are affected by this:
    - db-torque-runtime :  Persistence Layer
    - db-torque-runtime-test :  Persistence Layer


Full details are available at:
    http://vmgump.apache.org/gump/public/db-torque/db-torque-runtime/index.html

That said, some information snippets are provided here.

The following annotations (debug/informational/warning/error messages) were provided:
 -DEBUG- (Apache Gump generated) Apache Maven Settings in: /srv/gump/public/workspace/db-torque/torque-runtime/gump_mvn_settings.xml
 -INFO- Failed with reason build failed
 -DEBUG- Maven POM in: /srv/gump/public/workspace/db-torque/torque-runtime/pom.xml
 -INFO- Failed to extract fallback artifacts from Gump Repository



The following work was performed:
http://vmgump.apache.org/gump/public/db-torque/db-torque-runtime/gump_work/build_db-torque_db-torque-runtime.html
Work Name: build_db-torque_db-torque-runtime (Type: Build)
Work ended in a state of : Failed
Elapsed: 20 secs
Command Line: /opt/maven2/bin/mvn --batch-mode -DskipTests=true --settings /srv/gump/public/workspace/db-torque/torque-runtime/gump_mvn_settings.xml
install 
[Working Directory: /srv/gump/public/workspace/db-torque/torque-runtime]
M2_HOME: /opt/maven2
---------------------------------------------


Downloading: http://localhost:8192/maven2/avalon-framework/avalon-framework-impl/4.3/avalon-framework-impl-4.3.jar
Downloading: http://localhost:8192/maven2/geronimo-spec/geronimo-spec-jms/1.1-rc4/geronimo-spec-jms-1.1-rc4.jar


[INFO] [resources:resources {execution: default-resources}]
[INFO] Using 'ISO-8859-1' encoding to copy filtered resources.
[INFO] skip non existing resourceDirectory /srv/gump/public/workspace/db-torque/torque-runtime/src/main/resources
[INFO] Copying 3 resources
[WARNING] While downloading xml-apis:xml-apis:2.0.2
  This artifact has been relocated to xml-apis:xml-apis:1.0.b2.


[INFO] [compiler:compile {execution: default-compile}]
[INFO] Compiling 93 source files to /srv/gump/public/workspace/db-torque/torque-runtime/target/classes
[INFO] -------------------------------------------------------------
[ERROR] COMPILATION ERROR : 
[INFO] -------------------------------------------------------------
[ERROR] /srv/gump/public/workspace/db-torque/torque-runtime/src/main/java/org/apache/torque/manager/MethodResultCache.java:[127,28]
cannot find symbol
symbol  : method putInGroup(org.apache.torque.manager.MethodCacheKey,java.lang.String,java.lang.Object)
location: class org.apache.jcs.access.GroupCacheAccess

[ERROR] /srv/gump/public/workspace/db-torque/torque-runtime/src/main/java/org/apache/torque/manager/AbstractBaseManager.java:[334,25]
cannot find symbol
symbol  : method put(java.io.Serializable,org.apache.torque.om.Persistent)
location: class org.apache.jcs.access.GroupCacheAccess

[INFO] 2 errors 
[INFO] -------------------------------------------------------------
[INFO] ------------------------------------------------------------------------
[ERROR] BUILD FAILURE
[INFO] ------------------------------------------------------------------------
[INFO] Compilation failure

/srv/gump/public/workspace/db-torque/torque-runtime/src/main/java/org/apache/torque/manager/MethodResultCache.java:[127,28]
cannot find symbol
symbol  : method putInGroup(org.apache.torque.manager.MethodCacheKey,java.lang.String,java.lang.Object)
location: class org.apache.jcs.access.GroupCacheAccess

/srv/gump/public/workspace/db-torque/torque-runtime/src/main/java/org/apache/torque/manager/AbstractBaseManager.java:[334,25]
cannot find symbol
symbol  : method put(java.io.Serializable,org.apache.torque.om.Persistent)
location: class org.apache.jcs.access.GroupCacheAccess


[INFO] ------------------------------------------------------------------------
[INFO] For more information, run Maven with the -e switch
[INFO] ------------------------------------------------------------------------
[INFO] Total time: 18 seconds
[INFO] Finished at: Fri Aug 05 12:30:02 UTC 2011
[INFO] Final Memory: 26M/62M
[INFO] ------------------------------------------------------------------------
---------------------------------------------

To subscribe to this information via syndicated feeds:
- RSS: http://vmgump.apache.org/gump/public/db-torque/db-torque-runtime/rss.xml
- Atom: http://vmgump.apache.org/gump/public/db-torque/db-torque-runtime/atom.xml

============================== Gump Tracking Only ===
Produced by Apache Gump(TM) version 2.3.
Gump Run 05000605082011, vmgump.apache.org:vmgump:05000605082011
Gump E-mail Identifier (unique within run) #40.

--
Apache Gump
http://gump.apache.org/ [Instance: vmgump]

---------------------------------------------------------------------
To unsubscribe, e-mail: torque-dev-unsubscribe@db.apache.org
For additional commands, e-mail: torque-dev-help@db.apache.org


Mime
View raw message