db-torque-dev mailing list archives

Site index · List index
Message view « Date » · « Thread »
Top « Date » · « Thread »
From gene...@gump.apache.org
Subject [GUMP@vmgump]: Project db-torque-runtime (in module db-torque) failed
Date Mon, 01 Aug 2011 12:32:18 GMT
To whom it may engage...
        
This is an automated request, but not an unsolicited one. For 
more information please visit http://gump.apache.org/nagged.html, 
and/or contact the folk at general@gump.apache.org.

Project db-torque-runtime has an issue affecting its community integration.
This issue affects 2 projects,
 and has been outstanding for 24 runs.
The current state of this project is 'Failed', with reason 'Build Failed'.
For reference only, the following projects are affected by this:
    - db-torque-runtime :  Persistence Layer
    - db-torque-runtime-test :  Persistence Layer


Full details are available at:
    http://vmgump.apache.org/gump/public/db-torque/db-torque-runtime/index.html

That said, some information snippets are provided here.

The following annotations (debug/informational/warning/error messages) were provided:
 -INFO- Optional dependency jakarta-turbine-jcs failed with reason build failed
 -DEBUG- (Apache Gump generated) Apache Maven Settings in: /srv/gump/public/workspace/db-torque/torque-runtime/gump_mvn_settings.xml
 -INFO- Failed with reason build failed
 -DEBUG- Maven POM in: /srv/gump/public/workspace/db-torque/torque-runtime/pom.xml
 -INFO- Failed to extract fallback artifacts from Gump Repository



The following work was performed:
http://vmgump.apache.org/gump/public/db-torque/db-torque-runtime/gump_work/build_db-torque_db-torque-runtime.html
Work Name: build_db-torque_db-torque-runtime (Type: Build)
Work ended in a state of : Failed
Elapsed: 24 secs
Command Line: /opt/maven2/bin/mvn --batch-mode -DskipTests=true --settings /srv/gump/public/workspace/db-torque/torque-runtime/gump_mvn_settings.xml
install 
[Working Directory: /srv/gump/public/workspace/db-torque/torque-runtime]
M2_HOME: /opt/maven2
---------------------------------------------
[INFO] -------------------------------------------------------------
[ERROR] COMPILATION ERROR : 
[INFO] -------------------------------------------------------------
[ERROR] /srv/gump/public/workspace/db-torque/torque-runtime/src/test/java/org/apache/torque/util/CriteriaTest.java:[507,9]
cannot find symbol
symbol  : method setCascade(boolean)
location: class org.apache.torque.util.Criteria

[ERROR] /srv/gump/public/workspace/db-torque/torque-runtime/src/test/java/org/apache/torque/util/CriteriaTest.java:[541,33]
cannot find symbol
symbol  : method isCascade()
location: class org.apache.torque.util.Criteria

[ERROR] /srv/gump/public/workspace/db-torque/torque-runtime/src/test/java/org/apache/torque/util/CriteriaTest.java:[542,22]
cannot find symbol
symbol  : method isCascade()
location: class org.apache.torque.util.Criteria

[ERROR] /srv/gump/public/workspace/db-torque/torque-runtime/src/test/java/org/apache/torque/util/CriteriaTest.java:[542,42]
cannot find symbol
symbol  : method isCascade()
location: class org.apache.torque.util.Criteria

[INFO] 4 errors 
[INFO] -------------------------------------------------------------
[INFO] ------------------------------------------------------------------------
[ERROR] BUILD FAILURE
[INFO] ------------------------------------------------------------------------
[INFO] Compilation failure

/srv/gump/public/workspace/db-torque/torque-runtime/src/test/java/org/apache/torque/util/CriteriaTest.java:[507,9]
cannot find symbol
symbol  : method setCascade(boolean)
location: class org.apache.torque.util.Criteria

/srv/gump/public/workspace/db-torque/torque-runtime/src/test/java/org/apache/torque/util/CriteriaTest.java:[541,33]
cannot find symbol
symbol  : method isCascade()
location: class org.apache.torque.util.Criteria

/srv/gump/public/workspace/db-torque/torque-runtime/src/test/java/org/apache/torque/util/CriteriaTest.java:[542,22]
cannot find symbol
symbol  : method isCascade()
location: class org.apache.torque.util.Criteria

/srv/gump/public/workspace/db-torque/torque-runtime/src/test/java/org/apache/torque/util/CriteriaTest.java:[542,42]
cannot find symbol
symbol  : method isCascade()
location: class org.apache.torque.util.Criteria


[INFO] ------------------------------------------------------------------------
[INFO] For more information, run Maven with the -e switch
[INFO] ------------------------------------------------------------------------
[INFO] Total time: 23 seconds
[INFO] Finished at: Mon Aug 01 12:32:17 UTC 2011
[INFO] Final Memory: 31M/75M
[INFO] ------------------------------------------------------------------------
---------------------------------------------

To subscribe to this information via syndicated feeds:
- RSS: http://vmgump.apache.org/gump/public/db-torque/db-torque-runtime/rss.xml
- Atom: http://vmgump.apache.org/gump/public/db-torque/db-torque-runtime/atom.xml

============================== Gump Tracking Only ===
Produced by Apache Gump(TM) version 2.3.
Gump Run 05000601082011, vmgump.apache.org:vmgump:05000601082011
Gump E-mail Identifier (unique within run) #42.

--
Apache Gump
http://gump.apache.org/ [Instance: vmgump]

---------------------------------------------------------------------
To unsubscribe, e-mail: torque-dev-unsubscribe@db.apache.org
For additional commands, e-mail: torque-dev-help@db.apache.org


Mime
View raw message