db-torque-dev mailing list archives

Site index · List index
Message view « Date » · « Thread »
Top « Date » · « Thread »
From gene...@gump.apache.org
Subject [GUMP@vmgump]: Project db-torque-templates (in module db-torque) failed
Date Mon, 13 Sep 2010 04:01:36 GMT
To whom it may engage...
        
This is an automated request, but not an unsolicited one. For 
more information please visit http://gump.apache.org/nagged.html, 
and/or contact the folk at general@gump.apache.org.

Project db-torque-templates has an issue affecting its community integration.
This issue affects 1 projects,
 and has been outstanding for 5 runs.
The current state of this project is 'Failed', with reason 'Build Failed'.
For reference only, the following projects are affected by this:
    - db-torque-templates :  Persistence Layer


Full details are available at:
    http://vmgump.apache.org/gump/public/db-torque/db-torque-templates/index.html

That said, some information snippets are provided here.

The following annotations (debug/informational/warning/error messages) were provided:
 -DEBUG- (Gump generated) Maven2 Settings in: /srv/gump/public/workspace/db-torque/torque-templates/gump_mvn_settings.xml
 -INFO- Failed with reason build failed
 -DEBUG- Maven POM in: /srv/gump/public/workspace/db-torque/torque-templates/pom.xml
 -DEBUG- Extracted fallback artifacts from Gump Repository



The following work was performed:
http://vmgump.apache.org/gump/public/db-torque/db-torque-templates/gump_work/build_db-torque_db-torque-templates.html
Work Name: build_db-torque_db-torque-templates (Type: Build)
Work ended in a state of : Failed
Elapsed: 19 secs
Command Line: mvn --batch-mode --settings /srv/gump/public/workspace/db-torque/torque-templates/gump_mvn_settings.xml
install 
[Working Directory: /srv/gump/public/workspace/db-torque/torque-templates]
---------------------------------------------
[INFO] [resources:resources {execution: default-resources}]
[INFO] Using 'ISO-8859-1' encoding to copy filtered resources.
[INFO] Copying 191 resources
Downloading: http://localhost:8192/maven2/org/apache/derby/derbyclient/10.5.3.0_1/derbyclient-10.5.3.0_1.pom

[INFO] [compiler:compile {execution: default-compile}]
[INFO] Compiling 58 source files to /srv/gump/public/workspace/db-torque/torque-templates/target/classes
[INFO] [resources:testResources {execution: default-testResources}]
[INFO] Using 'ISO-8859-1' encoding to copy filtered resources.
[INFO] Copying 2 resources
Downloading: http://localhost:8192/maven2/org/apache/derby/derbyclient/10.5.3.0_1/derbyclient-10.5.3.0_1.jar

[INFO] [compiler:testCompile {execution: default-testCompile}]
[INFO] Compiling 2 source files to /srv/gump/public/workspace/db-torque/torque-templates/target/test-classes
[INFO] [surefire:test {execution: default-test}]
[INFO] Surefire report directory: /srv/gump/public/workspace/db-torque/torque-templates/target/surefire-reports

-------------------------------------------------------
 T E S T S
-------------------------------------------------------
Running org.apache.torque.templates.TestProcessing
INFO  org.apache.torque.generator.control.Controller - run() : Starting to read configuration
files
Tests run: 1, Failures: 0, Errors: 1, Skipped: 0, Time elapsed: 0.778 sec <<< FAILURE!
Running org.apache.torque.templates.jdbc2schema.Jdbc2SchemaTest
INFO  org.apache.torque.generator.control.Controller - run() : Starting to read configuration
files
INFO  org.apache.torque.generator.control.Controller - run() : Configuration read.
INFO  org.apache.torque.generator.control.Controller - Processing source JdbcMetadataSource
using url jdbc:derby:memory:myDb;create=true
INFO  org.apache.torque.generator.control.Controller - Start generation of File target/generated-schema/schema.xml
Tests run: 1, Failures: 0, Errors: 0, Skipped: 0, Time elapsed: 2.69 sec

Results :

Tests in error: 
  testProcessSchemaXml(org.apache.torque.templates.TestProcessing)

Tests run: 2, Failures: 0, Errors: 1, Skipped: 0

[INFO] ------------------------------------------------------------------------
[ERROR] BUILD FAILURE
[INFO] ------------------------------------------------------------------------
[INFO] There are test failures.

Please refer to /srv/gump/public/workspace/db-torque/torque-templates/target/surefire-reports
for the individual test results.
[INFO] ------------------------------------------------------------------------
[INFO] For more information, run Maven with the -e switch
[INFO] ------------------------------------------------------------------------
[INFO] Total time: 18 seconds
[INFO] Finished at: Mon Sep 13 04:01:36 UTC 2010
[INFO] Final Memory: 37M/88M
[INFO] ------------------------------------------------------------------------
---------------------------------------------

To subscribe to this information via syndicated feeds:
- RSS: http://vmgump.apache.org/gump/public/db-torque/db-torque-templates/rss.xml
- Atom: http://vmgump.apache.org/gump/public/db-torque/db-torque-templates/atom.xml

============================== Gump Tracking Only ===
Produced by Gump version 2.3.
Gump Run 07000013092010, vmgump.apache.org:vmgump:07000013092010
Gump E-mail Identifier (unique within run) #17.

--
Apache Gump
http://gump.apache.org/ [Instance: vmgump]

---------------------------------------------------------------------
To unsubscribe, e-mail: torque-dev-unsubscribe@db.apache.org
For additional commands, e-mail: torque-dev-help@db.apache.org


Mime
View raw message