db-torque-dev mailing list archives

Site index · List index
Message view « Date » · « Thread »
Top « Date » · « Thread »
From gene...@gump.apache.org
Subject [GUMP@vmgump]: Project db-torque-runtime-test (in module db-torque) failed
Date Fri, 22 Jan 2010 09:19:34 GMT
To whom it may engage...
        
This is an automated request, but not an unsolicited one. For 
more information please visit http://gump.apache.org/nagged.html, 
and/or contact the folk at general@gump.apache.org.

Project db-torque-runtime-test has an issue affecting its community integration.
This issue affects 1 projects,
 and has been outstanding for 57 runs.
The current state of this project is 'Failed', with reason 'Build Failed'.
For reference only, the following projects are affected by this:
    - db-torque-runtime-test :  Persistence Layer


Full details are available at:
    http://vmgump.apache.org/gump/public/db-torque/db-torque-runtime-test/index.html

That said, some information snippets are provided here.

The following annotations (debug/informational/warning/error messages) were provided:
 -WARNING- Overriding Maven2 settings: [/srv/gump/public/workspace/db-torque/torque-runtime/gump_mvn_settings.xml]
 -DEBUG- (Gump generated) Maven2 Settings in: /srv/gump/public/workspace/db-torque/torque-runtime/gump_mvn_settings.xml
 -INFO- Failed with reason build failed
 -DEBUG- Maven POM in: /srv/gump/public/workspace/db-torque/torque-runtime/pom.xml
 -INFO- Project Reports in: /srv/gump/public/workspace/db-torque/torque-runtime/target/surefire-reports



The following work was performed:
http://vmgump.apache.org/gump/public/db-torque/db-torque-runtime-test/gump_work/build_db-torque_db-torque-runtime-test.html
Work Name: build_db-torque_db-torque-runtime-test (Type: Build)
Work ended in a state of : Failed
Elapsed: 23 secs
Command Line: mvn --batch-mode --settings /srv/gump/public/workspace/db-torque/torque-runtime/gump_mvn_settings.xml
install 
[Working Directory: /srv/gump/public/workspace/db-torque/torque-runtime]
CLASSPATH: /usr/lib/jvm/java-6-sun/lib/tools.jar:/srv/gump/public/workspace/db-torque/torque-runtime/target/torque-runtime-4.0-alpha1-SNAPSHOT.jar
---------------------------------------------
Tests run: 5, Failures: 0, Errors: 0, Skipped: 0, Time elapsed: 0.789 sec
Running org.apache.torque.util.QueryTest
Tests run: 2, Failures: 0, Errors: 0, Skipped: 0, Time elapsed: 0.107 sec
Running org.apache.torque.adapter.DBOracleTest
Tests run: 1, Failures: 0, Errors: 0, Skipped: 0, Time elapsed: 0.118 sec
Running org.apache.torque.om.NumberKeyTest
Tests run: 6, Failures: 0, Errors: 0, Skipped: 0, Time elapsed: 0.098 sec
Running org.apache.torque.TorqueRuntimeExceptionTest
log4j:WARN No appenders could be found for logger (org.apache.torque.TorqueInstance).
log4j:WARN Please initialize the log4j system properly.
log4j:WARN See http://logging.apache.org/log4j/1.2/faq.html#noconfig for more info.
Tests run: 1, Failures: 0, Errors: 0, Skipped: 0, Time elapsed: 0.51 sec
Running org.apache.torque.util.CriteriaTest
log4j:WARN No appenders could be found for logger (org.apache.torque.TorqueInstance).
log4j:WARN Please initialize the log4j system properly.
log4j:WARN See http://logging.apache.org/log4j/1.2/faq.html#noconfig for more info.
Tests run: 19, Failures: 0, Errors: 0, Skipped: 0, Time elapsed: 0.782 sec
Running org.apache.torque.util.SqlExpressionTest
large buildIn took 76 milliseconds
Tests run: 5, Failures: 0, Errors: 0, Skipped: 0, Time elapsed: 0.336 sec
Running org.apache.torque.avalon.AvalonTest
[DEBUG] Starting container...
[DEBUG] Loading the service container class org.apache.fulcrum.yaafi.framework.container.ServiceContainerImpl
[DEBUG] Instantiating the service container class org.apache.fulcrum.yaafi.framework.container.ServiceContainerImpl
Tests run: 1, Failures: 0, Errors: 1, Skipped: 0, Time elapsed: 0.14 sec <<< FAILURE!
Running org.apache.torque.util.SqlBuilderTest
log4j:WARN No appenders could be found for logger (org.apache.torque.TorqueInstance).
log4j:WARN Please initialize the log4j system properly.
log4j:WARN See http://logging.apache.org/log4j/1.2/faq.html#noconfig for more info.
Tests run: 1, Failures: 0, Errors: 0, Skipped: 0, Time elapsed: 0.5 sec

Results :

Tests in error: 

Tests run: 52, Failures: 0, Errors: 1, Skipped: 0

[INFO] ------------------------------------------------------------------------
[ERROR] BUILD FAILURE
[INFO] ------------------------------------------------------------------------
[INFO] There are test failures.

Please refer to /srv/gump/public/workspace/db-torque/torque-runtime/target/surefire-reports
for the individual test results.
[INFO] ------------------------------------------------------------------------
[INFO] For more information, run Maven with the -e switch
[INFO] ------------------------------------------------------------------------
[INFO] Total time: 22 seconds
[INFO] Finished at: Fri Jan 22 09:19:33 PST 2010
[INFO] Final Memory: 9M/17M
[INFO] ------------------------------------------------------------------------
---------------------------------------------

To subscribe to this information via syndicated feeds:
- RSS: http://vmgump.apache.org/gump/public/db-torque/db-torque-runtime-test/rss.xml
- Atom: http://vmgump.apache.org/gump/public/db-torque/db-torque-runtime-test/atom.xml

============================== Gump Tracking Only ===
Produced by Gump version 2.3.
Gump Run 05000022012010, vmgump:vmgump-public:05000022012010
Gump E-mail Identifier (unique within run) #65.

--
Apache Gump
http://gump.apache.org/ [Instance: vmgump]

---------------------------------------------------------------------
To unsubscribe, e-mail: torque-dev-unsubscribe@db.apache.org
For additional commands, e-mail: torque-dev-help@db.apache.org


Mime
View raw message