db-torque-dev mailing list archives

Site index · List index
Message view « Date » · « Thread »
Top « Date » · « Thread »
From Thomas Fischer <tfisc...@apache.org>
Subject Re: Current trunk fails runtime tests
Date Sun, 07 Aug 2005 10:34:21 GMT
Hi Henning,

this was my fault. This error came in with the support for distributing 
the generated sources into several subpackage. I fixed this error locally 
but it seems I forgot to check it in.

The bug should be fixed now in svn

    Thomas

On Fri, 5 Aug 2005, Henning P. Schmiedehausen wrote:

> Hi,
>
> sorry to say but I did break something and I can't seem to find it. :-(
>
> This is with my profile (henning.profile) and PostgreSQL (7.4.8) and
> the current jpackage driver (which is from 8.0). The error is:
>
> BUILD FAILED
> File...... /home/henning/scratch/torque-svn/db-torque/maven.xml
> Element... ant
> Line...... 130
> Column.... 29
> Exception thrown by 'strings.getPackageAsPath'. For more information consult the velocity
log, or invoke ant with the -debug flag.
> com.werken.werkz.UnattainableGoalException: Unable to obtain goal [runtime:test] -- /home/henning/scratch/torque-svn/db-torque/maven.xml:130:29:
<ant> Exception thrown by 'strings.getPackageAsPath'. For more information consult the
velocity log, or invoke ant with the -debug flag.
> 	at com.werken.werkz.Goal.fire(Goal.java:646)
> 	at com.werken.werkz.Goal.attain(Goal.java:575)
> 	at org.apache.maven.plugin.PluginManager.attainGoals(PluginManager.java:671)
> 	at org.apache.maven.MavenSession.attainGoals(MavenSession.java:263)
> 	at org.apache.maven.cli.App.doMain(App.java:488)
> 	at org.apache.maven.cli.App.main(App.java:1239)
> 	at sun.reflect.NativeMethodAccessorImpl.invoke0(Native Method)
> 	at sun.reflect.NativeMethodAccessorImpl.invoke(NativeMethodAccessorImpl.java:39)
> 	at sun.reflect.DelegatingMethodAccessorImpl.invoke(DelegatingMethodAccessorImpl.java:25)
> 	at java.lang.reflect.Method.invoke(Method.java:324)
> 	at com.werken.forehead.Forehead.run(Forehead.java:551)
> 	at com.werken.forehead.Forehead.main(Forehead.java:581)
> org.apache.commons.jelly.JellyTagException: /home/henning/scratch/torque-svn/db-torque/maven.xml:130:29:
<ant> Exception thrown by 'strings.getPackageAsPath'. For more information consult the
velocity log, or invoke ant with the -debug flag.
> 	at org.apache.commons.jelly.impl.TagScript.handleException(TagScript.java:683)
> 	at org.apache.commons.jelly.impl.TagScript.run(TagScript.java:288)
> 	at org.apache.commons.jelly.impl.ScriptBlock.run(ScriptBlock.java:135)
> 	at org.apache.maven.jelly.tags.werkz.MavenGoalTag.runBodyTag(MavenGoalTag.java:79)
> 	at org.apache.maven.jelly.tags.werkz.MavenGoalTag$MavenGoalAction.performAction(MavenGoalTag.java:110)
> 	at com.werken.werkz.Goal.fire(Goal.java:639)
> 	at com.werken.werkz.Goal.attain(Goal.java:575)
> 	at org.apache.maven.plugin.PluginManager.attainGoals(PluginManager.java:671)
> 	at org.apache.maven.MavenSession.attainGoals(MavenSession.java:263)
> 	at org.apache.maven.cli.App.doMain(App.java:488)
> 	at org.apache.maven.cli.App.main(App.java:1239)
> 	at sun.reflect.NativeMethodAccessorImpl.invoke0(Native Method)
> 	at sun.reflect.NativeMethodAccessorImpl.invoke(NativeMethodAccessorImpl.java:39)
> 	at sun.reflect.DelegatingMethodAccessorImpl.invoke(DelegatingMethodAccessorImpl.java:25)
> 	at java.lang.reflect.Method.invoke(Method.java:324)
> 	at com.werken.forehead.Forehead.run(Forehead.java:551)
> 	at com.werken.forehead.Forehead.main(Forehead.java:581)
> Caused by: file:/home/henning/scratch/torque-svn/db-torque/target/test/rttest/build-torque.xml:520:
Exception thrown by 'strings.getPackageAsPath'. For more information consult the velocity
log, or invoke ant with the -debug flag.
> 	at org.apache.velocity.texen.ant.TexenTask.execute(TexenTask.java:564)
> 	at org.apache.tools.ant.Task.perform(Task.java:341)
> 	at org.apache.tools.ant.Target.execute(Target.java:309)
> 	at org.apache.tools.ant.Target.performTasks(Target.java:336)
> 	at org.apache.tools.ant.Project.executeTarget(Project.java:1339)
> 	at org.apache.tools.ant.taskdefs.Ant.execute(Ant.java:397)
> 	at org.apache.tools.ant.taskdefs.CallTarget.execute(CallTarget.java:143)
> 	at org.apache.tools.ant.Task.perform(Task.java:341)
> 	at org.apache.tools.ant.Target.execute(Target.java:309)
> 	at org.apache.tools.ant.Target.performTasks(Target.java:336)
> 	at org.apache.tools.ant.Project.executeTarget(Project.java:1339)
> 	at org.apache.tools.ant.taskdefs.Ant.execute(Ant.java:397)
> 	at org.apache.tools.ant.Task.perform(Task.java:341)
> 	at org.apache.tools.ant.Target.execute(Target.java:309)
> 	at org.apache.tools.ant.Target.performTasks(Target.java:336)
> 	at org.apache.tools.ant.Project.executeTarget(Project.java:1339)
> 	at org.apache.tools.ant.taskdefs.Ant.execute(Ant.java:397)
> 	at org.apache.tools.ant.taskdefs.CallTarget.execute(CallTarget.java:143)
> 	at org.apache.tools.ant.Task.perform(Task.java:341)
> 	at org.apache.tools.ant.Target.execute(Target.java:309)
> 	at org.apache.tools.ant.Target.performTasks(Target.java:336)
> 	at org.apache.tools.ant.Project.executeTarget(Project.java:1339)
> 	at org.apache.tools.ant.taskdefs.Ant.execute(Ant.java:397)
> 	at org.apache.tools.ant.taskdefs.CallTarget.execute(CallTarget.java:143)
> 	at org.apache.tools.ant.Task.perform(Task.java:341)
> 	at org.apache.tools.ant.Target.execute(Target.java:309)
> 	at org.apache.tools.ant.Target.performTasks(Target.java:336)
> 	at org.apache.tools.ant.Project.executeTarget(Project.java:1339)
> 	at org.apache.tools.ant.taskdefs.Ant.execute(Ant.java:397)
> 	at org.apache.tools.ant.Task.perform(Task.java:341)
> 	at org.apache.commons.jelly.tags.ant.AntTag.doTag(AntTag.java:185)
> 	at org.apache.commons.jelly.impl.TagScript.run(TagScript.java:279)
> 	... 15 more
> Caused by: java.lang.NullPointerException
> 	at org.apache.velocity.util.StringUtils.getPackageAsPath(StringUtils.java:120)
> 	at sun.reflect.NativeMethodAccessorImpl.invoke0(Native Method)
> 	at sun.reflect.NativeMethodAccessorImpl.invoke(NativeMethodAccessorImpl.java:39)
> 	at sun.reflect.DelegatingMethodAccessorImpl.invoke(DelegatingMethodAccessorImpl.java:25)
> 	at java.lang.reflect.Method.invoke(Method.java:324)
> 	at org.apache.velocity.runtime.parser.node.ASTMethod.execute(ASTMethod.java:260)
> 	at org.apache.velocity.runtime.parser.node.ASTReference.execute(ASTReference.java:207)
> 	at org.apache.velocity.runtime.parser.node.ASTReference.value(ASTReference.java:357)
> 	at org.apache.velocity.runtime.parser.node.ASTSetDirective.render(ASTSetDirective.java:135)
> 	at org.apache.velocity.runtime.parser.node.ASTBlock.render(ASTBlock.java:94)
> 	at org.apache.velocity.runtime.directive.Foreach.render(Foreach.java:344)
> 	at org.apache.velocity.runtime.parser.node.ASTDirective.render(ASTDirective.java:153)
> 	at org.apache.velocity.runtime.parser.node.SimpleNode.render(SimpleNode.java:271)
> 	at org.apache.velocity.Template.merge(Template.java:296)
> 	at org.apache.velocity.texen.Generator.parse(Generator.java:451)
> 	at org.apache.velocity.texen.ant.TexenTask.execute(TexenTask.java:552)
> 	... 46 more
> Root cause
> file:/home/henning/scratch/torque-svn/db-torque/target/test/rttest/build-torque.xml:520:
Exception thrown by 'strings.getPackageAsPath'. For more information consult the velocity
log, or invoke ant with the -debug flag.
> 	at org.apache.velocity.texen.ant.TexenTask.execute(TexenTask.java:564)
> 	at org.apache.tools.ant.Task.perform(Task.java:341)
> 	at org.apache.tools.ant.Target.execute(Target.java:309)
> 	at org.apache.tools.ant.Target.performTasks(Target.java:336)
> 	at org.apache.tools.ant.Project.executeTarget(Project.java:1339)
> 	at org.apache.tools.ant.taskdefs.Ant.execute(Ant.java:397)
> 	at org.apache.tools.ant.taskdefs.CallTarget.execute(CallTarget.java:143)
> 	at org.apache.tools.ant.Task.perform(Task.java:341)
> 	at org.apache.tools.ant.Target.execute(Target.java:309)
> 	at org.apache.tools.ant.Target.performTasks(Target.java:336)
> 	at org.apache.tools.ant.Project.executeTarget(Project.java:1339)
> 	at org.apache.tools.ant.taskdefs.Ant.execute(Ant.java:397)
> 	at org.apache.tools.ant.Task.perform(Task.java:341)
> 	at org.apache.tools.ant.Target.execute(Target.java:309)
> 	at org.apache.tools.ant.Target.performTasks(Target.java:336)
> 	at org.apache.tools.ant.Project.executeTarget(Project.java:1339)
> 	at org.apache.tools.ant.taskdefs.Ant.execute(Ant.java:397)
> 	at org.apache.tools.ant.taskdefs.CallTarget.execute(CallTarget.java:143)
> 	at org.apache.tools.ant.Task.perform(Task.java:341)
> 	at org.apache.tools.ant.Target.execute(Target.java:309)
> 	at org.apache.tools.ant.Target.performTasks(Target.java:336)
> 	at org.apache.tools.ant.Project.executeTarget(Project.java:1339)
> 	at org.apache.tools.ant.taskdefs.Ant.execute(Ant.java:397)
> 	at org.apache.tools.ant.taskdefs.CallTarget.execute(CallTarget.java:143)
> 	at org.apache.tools.ant.Task.perform(Task.java:341)
> 	at org.apache.tools.ant.Target.execute(Target.java:309)
> 	at org.apache.tools.ant.Target.performTasks(Target.java:336)
> 	at org.apache.tools.ant.Project.executeTarget(Project.java:1339)
> 	at org.apache.tools.ant.taskdefs.Ant.execute(Ant.java:397)
> 	at org.apache.tools.ant.Task.perform(Task.java:341)
> 	at org.apache.commons.jelly.tags.ant.AntTag.doTag(AntTag.java:185)
> 	at org.apache.commons.jelly.impl.TagScript.run(TagScript.java:279)
> 	at org.apache.commons.jelly.impl.ScriptBlock.run(ScriptBlock.java:135)
> 	at org.apache.maven.jelly.tags.werkz.MavenGoalTag.runBodyTag(MavenGoalTag.java:79)
> 	at org.apache.maven.jelly.tags.werkz.MavenGoalTag$MavenGoalAction.performAction(MavenGoalTag.java:110)
> 	at com.werken.werkz.Goal.fire(Goal.java:639)
> 	at com.werken.werkz.Goal.attain(Goal.java:575)
> 	at org.apache.maven.plugin.PluginManager.attainGoals(PluginManager.java:671)
> 	at org.apache.maven.MavenSession.attainGoals(MavenSession.java:263)
> 	at org.apache.maven.cli.App.doMain(App.java:488)
> 	at org.apache.maven.cli.App.main(App.java:1239)
> 	at sun.reflect.NativeMethodAccessorImpl.invoke0(Native Method)
> 	at sun.reflect.NativeMethodAccessorImpl.invoke(NativeMethodAccessorImpl.java:39)
> 	at sun.reflect.DelegatingMethodAccessorImpl.invoke(DelegatingMethodAccessorImpl.java:25)
> 	at java.lang.reflect.Method.invoke(Method.java:324)
> 	at com.werken.forehead.Forehead.run(Forehead.java:551)
> 	at com.werken.forehead.Forehead.main(Forehead.java:581)
> Caused by: java.lang.NullPointerException
> 	at org.apache.velocity.util.StringUtils.getPackageAsPath(StringUtils.java:120)
> 	at sun.reflect.NativeMethodAccessorImpl.invoke0(Native Method)
> 	at sun.reflect.NativeMethodAccessorImpl.invoke(NativeMethodAccessorImpl.java:39)
> 	at sun.reflect.DelegatingMethodAccessorImpl.invoke(DelegatingMethodAccessorImpl.java:25)
> 	at java.lang.reflect.Method.invoke(Method.java:324)
> 	at org.apache.velocity.runtime.parser.node.ASTMethod.execute(ASTMethod.java:260)
> 	at org.apache.velocity.runtime.parser.node.ASTReference.execute(ASTReference.java:207)
> 	at org.apache.velocity.runtime.parser.node.ASTReference.value(ASTReference.java:357)
> 	at org.apache.velocity.runtime.parser.node.ASTSetDirective.render(ASTSetDirective.java:135)
> 	at org.apache.velocity.runtime.parser.node.ASTBlock.render(ASTBlock.java:94)
> 	at org.apache.velocity.runtime.directive.Foreach.render(Foreach.java:344)
> 	at org.apache.velocity.runtime.parser.node.ASTDirective.render(ASTDirective.java:153)
> 	at org.apache.velocity.runtime.parser.node.SimpleNode.render(SimpleNode.java:271)
> 	at org.apache.velocity.Template.merge(Template.java:296)
> 	at org.apache.velocity.texen.Generator.parse(Generator.java:451)
> 	at org.apache.velocity.texen.ant.TexenTask.execute(TexenTask.java:552)
> 	... 46 more
> --- Nested Exception ---
> java.lang.NullPointerException
> 	at org.apache.velocity.util.StringUtils.getPackageAsPath(StringUtils.java:120)
> 	at sun.reflect.NativeMethodAccessorImpl.invoke0(Native Method)
> 	at sun.reflect.NativeMethodAccessorImpl.invoke(NativeMethodAccessorImpl.java:39)
> 	at sun.reflect.DelegatingMethodAccessorImpl.invoke(DelegatingMethodAccessorImpl.java:25)
> 	at java.lang.reflect.Method.invoke(Method.java:324)
> 	at org.apache.velocity.runtime.parser.node.ASTMethod.execute(ASTMethod.java:260)
> 	at org.apache.velocity.runtime.parser.node.ASTReference.execute(ASTReference.java:207)
> 	at org.apache.velocity.runtime.parser.node.ASTReference.value(ASTReference.java:357)
> 	at org.apache.velocity.runtime.parser.node.ASTSetDirective.render(ASTSetDirective.java:135)
> 	at org.apache.velocity.runtime.parser.node.ASTBlock.render(ASTBlock.java:94)
> 	at org.apache.velocity.runtime.directive.Foreach.render(Foreach.java:344)
> 	at org.apache.velocity.runtime.parser.node.ASTDirective.render(ASTDirective.java:153)
> 	at org.apache.velocity.runtime.parser.node.SimpleNode.render(SimpleNode.java:271)
> 	at org.apache.velocity.Template.merge(Template.java:296)
> 	at org.apache.velocity.texen.Generator.parse(Generator.java:451)
> 	at org.apache.velocity.texen.ant.TexenTask.execute(TexenTask.java:552)
> 	at org.apache.tools.ant.Task.perform(Task.java:341)
> 	at org.apache.tools.ant.Target.execute(Target.java:309)
> 	at org.apache.tools.ant.Target.performTasks(Target.java:336)
> 	at org.apache.tools.ant.Project.executeTarget(Project.java:1339)
> 	at org.apache.tools.ant.taskdefs.Ant.execute(Ant.java:397)
> 	at org.apache.tools.ant.taskdefs.CallTarget.execute(CallTarget.java:143)
> 	at org.apache.tools.ant.Task.perform(Task.java:341)
> 	at org.apache.tools.ant.Target.execute(Target.java:309)
> 	at org.apache.tools.ant.Target.performTasks(Target.java:336)
> 	at org.apache.tools.ant.Project.executeTarget(Project.java:1339)
> 	at org.apache.tools.ant.taskdefs.Ant.execute(Ant.java:397)
> 	at org.apache.tools.ant.Task.perform(Task.java:341)
> 	at org.apache.tools.ant.Target.execute(Target.java:309)
> 	at org.apache.tools.ant.Target.performTasks(Target.java:336)
> 	at org.apache.tools.ant.Project.executeTarget(Project.java:1339)
> 	at org.apache.tools.ant.taskdefs.Ant.execute(Ant.java:397)
> 	at org.apache.tools.ant.taskdefs.CallTarget.execute(CallTarget.java:143)
> 	at org.apache.tools.ant.Task.perform(Task.java:341)
> 	at org.apache.tools.ant.Target.execute(Target.java:309)
> 	at org.apache.tools.ant.Target.performTasks(Target.java:336)
> 	at org.apache.tools.ant.Project.executeTarget(Project.java:1339)
> 	at org.apache.tools.ant.taskdefs.Ant.execute(Ant.java:397)
> 	at org.apache.tools.ant.taskdefs.CallTarget.execute(CallTarget.java:143)
> 	at org.apache.tools.ant.Task.perform(Task.java:341)
> 	at org.apache.tools.ant.Target.execute(Target.java:309)
> 	at org.apache.tools.ant.Target.performTasks(Target.java:336)
> 	at org.apache.tools.ant.Project.executeTarget(Project.java:1339)
> 	at org.apache.tools.ant.taskdefs.Ant.execute(Ant.java:397)
> 	at org.apache.tools.ant.Task.perform(Task.java:341)
> 	at org.apache.commons.jelly.tags.ant.AntTag.doTag(AntTag.java:185)
> 	at org.apache.commons.jelly.impl.TagScript.run(TagScript.java:279)
> 	at org.apache.commons.jelly.impl.ScriptBlock.run(ScriptBlock.java:135)
> 	at org.apache.maven.jelly.tags.werkz.MavenGoalTag.runBodyTag(MavenGoalTag.java:79)
> 	at org.apache.maven.jelly.tags.werkz.MavenGoalTag$MavenGoalAction.performAction(MavenGoalTag.java:110)
> 	at com.werken.werkz.Goal.fire(Goal.java:639)
> 	at com.werken.werkz.Goal.attain(Goal.java:575)
> 	at org.apache.maven.plugin.PluginManager.attainGoals(PluginManager.java:671)
> 	at org.apache.maven.MavenSession.attainGoals(MavenSession.java:263)
> 	at org.apache.maven.cli.App.doMain(App.java:488)
> 	at org.apache.maven.cli.App.main(App.java:1239)
> 	at sun.reflect.NativeMethodAccessorImpl.invoke0(Native Method)
> 	at sun.reflect.NativeMethodAccessorImpl.invoke(NativeMethodAccessorImpl.java:39)
> 	at sun.reflect.DelegatingMethodAccessorImpl.invoke(DelegatingMethodAccessorImpl.java:25)
> 	at java.lang.reflect.Method.invoke(Method.java:324)
> 	at com.werken.forehead.Forehead.run(Forehead.java:551)
> 	at com.werken.forehead.Forehead.main(Forehead.java:581)
> Root cause
> file:/home/henning/scratch/torque-svn/db-torque/target/test/rttest/build-torque.xml:520:
Exception thrown by 'strings.getPackageAsPath'. For more information consult the velocity
log, or invoke ant with the -debug flag.
> 	at org.apache.velocity.texen.ant.TexenTask.execute(TexenTask.java:564)
> 	at org.apache.tools.ant.Task.perform(Task.java:341)
> 	at org.apache.tools.ant.Target.execute(Target.java:309)
> 	at org.apache.tools.ant.Target.performTasks(Target.java:336)
> 	at org.apache.tools.ant.Project.executeTarget(Project.java:1339)
> 	at org.apache.tools.ant.taskdefs.Ant.execute(Ant.java:397)
> 	at org.apache.tools.ant.taskdefs.CallTarget.execute(CallTarget.java:143)
> 	at org.apache.tools.ant.Task.perform(Task.java:341)
> 	at org.apache.tools.ant.Target.execute(Target.java:309)
> 	at org.apache.tools.ant.Target.performTasks(Target.java:336)
> 	at org.apache.tools.ant.Project.executeTarget(Project.java:1339)
> 	at org.apache.tools.ant.taskdefs.Ant.execute(Ant.java:397)
> 	at org.apache.tools.ant.Task.perform(Task.java:341)
> 	at org.apache.tools.ant.Target.execute(Target.java:309)
> 	at org.apache.tools.ant.Target.performTasks(Target.java:336)
> 	at org.apache.tools.ant.Project.executeTarget(Project.java:1339)
> 	at org.apache.tools.ant.taskdefs.Ant.execute(Ant.java:397)
> 	at org.apache.tools.ant.taskdefs.CallTarget.execute(CallTarget.java:143)
> 	at org.apache.tools.ant.Task.perform(Task.java:341)
> 	at org.apache.tools.ant.Target.execute(Target.java:309)
> 	at org.apache.tools.ant.Target.performTasks(Target.java:336)
> 	at org.apache.tools.ant.Project.executeTarget(Project.java:1339)
> 	at org.apache.tools.ant.taskdefs.Ant.execute(Ant.java:397)
> 	at org.apache.tools.ant.taskdefs.CallTarget.execute(CallTarget.java:143)
> 	at org.apache.tools.ant.Task.perform(Task.java:341)
> 	at org.apache.tools.ant.Target.execute(Target.java:309)
> 	at org.apache.tools.ant.Target.performTasks(Target.java:336)
> 	at org.apache.tools.ant.Project.executeTarget(Project.java:1339)
> 	at org.apache.tools.ant.taskdefs.Ant.execute(Ant.java:397)
> 	at org.apache.tools.ant.Task.perform(Task.java:341)
> 	at org.apache.commons.jelly.tags.ant.AntTag.doTag(AntTag.java:185)
> 	at org.apache.commons.jelly.impl.TagScript.run(TagScript.java:279)
> 	at org.apache.commons.jelly.impl.ScriptBlock.run(ScriptBlock.java:135)
> 	at org.apache.maven.jelly.tags.werkz.MavenGoalTag.runBodyTag(MavenGoalTag.java:79)
> 	at org.apache.maven.jelly.tags.werkz.MavenGoalTag$MavenGoalAction.performAction(MavenGoalTag.java:110)
> 	at com.werken.werkz.Goal.fire(Goal.java:639)
> 	at com.werken.werkz.Goal.attain(Goal.java:575)
> 	at org.apache.maven.plugin.PluginManager.attainGoals(PluginManager.java:671)
> 	at org.apache.maven.MavenSession.attainGoals(MavenSession.java:263)
> 	at org.apache.maven.cli.App.doMain(App.java:488)
> 	at org.apache.maven.cli.App.main(App.java:1239)
> 	at sun.reflect.NativeMethodAccessorImpl.invoke0(Native Method)
> 	at sun.reflect.NativeMethodAccessorImpl.invoke(NativeMethodAccessorImpl.java:39)
> 	at sun.reflect.DelegatingMethodAccessorImpl.invoke(DelegatingMethodAccessorImpl.java:25)
> 	at java.lang.reflect.Method.invoke(Method.java:324)
> 	at com.werken.forehead.Forehead.run(Forehead.java:551)
> 	at com.werken.forehead.Forehead.main(Forehead.java:581)
> Caused by: java.lang.NullPointerException
> 	at org.apache.velocity.util.StringUtils.getPackageAsPath(StringUtils.java:120)
> 	at sun.reflect.NativeMethodAccessorImpl.invoke0(Native Method)
> 	at sun.reflect.NativeMethodAccessorImpl.invoke(NativeMethodAccessorImpl.java:39)
> 	at sun.reflect.DelegatingMethodAccessorImpl.invoke(DelegatingMethodAccessorImpl.java:25)
> 	at java.lang.reflect.Method.invoke(Method.java:324)
> 	at org.apache.velocity.runtime.parser.node.ASTMethod.execute(ASTMethod.java:260)
> 	at org.apache.velocity.runtime.parser.node.ASTReference.execute(ASTReference.java:207)
> 	at org.apache.velocity.runtime.parser.node.ASTReference.value(ASTReference.java:357)
> 	at org.apache.velocity.runtime.parser.node.ASTSetDirective.render(ASTSetDirective.java:135)
> 	at org.apache.velocity.runtime.parser.node.ASTBlock.render(ASTBlock.java:94)
> 	at org.apache.velocity.runtime.directive.Foreach.render(Foreach.java:344)
> 	at org.apache.velocity.runtime.parser.node.ASTDirective.render(ASTDirective.java:153)
> 	at org.apache.velocity.runtime.parser.node.SimpleNode.render(SimpleNode.java:271)
> 	at org.apache.velocity.Template.merge(Template.java:296)
> 	at org.apache.velocity.texen.Generator.parse(Generator.java:451)
> 	at org.apache.velocity.texen.ant.TexenTask.execute(TexenTask.java:552)
> 	... 46 more
> --- Nested Exception ---
> java.lang.NullPointerException
> 	at org.apache.velocity.util.StringUtils.getPackageAsPath(StringUtils.java:120)
> 	at sun.reflect.NativeMethodAccessorImpl.invoke0(Native Method)
> 	at sun.reflect.NativeMethodAccessorImpl.invoke(NativeMethodAccessorImpl.java:39)
> 	at sun.reflect.DelegatingMethodAccessorImpl.invoke(DelegatingMethodAccessorImpl.java:25)
> 	at java.lang.reflect.Method.invoke(Method.java:324)
> 	at org.apache.velocity.runtime.parser.node.ASTMethod.execute(ASTMethod.java:260)
> 	at org.apache.velocity.runtime.parser.node.ASTReference.execute(ASTReference.java:207)
> 	at org.apache.velocity.runtime.parser.node.ASTReference.value(ASTReference.java:357)
> 	at org.apache.velocity.runtime.parser.node.ASTSetDirective.render(ASTSetDirective.java:135)
> 	at org.apache.velocity.runtime.parser.node.ASTBlock.render(ASTBlock.java:94)
> 	at org.apache.velocity.runtime.directive.Foreach.render(Foreach.java:344)
> 	at org.apache.velocity.runtime.parser.node.ASTDirective.render(ASTDirective.java:153)
> 	at org.apache.velocity.runtime.parser.node.SimpleNode.render(SimpleNode.java:271)
> 	at org.apache.velocity.Template.merge(Template.java:296)
> 	at org.apache.velocity.texen.Generator.parse(Generator.java:451)
> 	at org.apache.velocity.texen.ant.TexenTask.execute(TexenTask.java:552)
> 	at org.apache.tools.ant.Task.perform(Task.java:341)
> 	at org.apache.tools.ant.Target.execute(Target.java:309)
> 	at org.apache.tools.ant.Target.performTasks(Target.java:336)
> 	at org.apache.tools.ant.Project.executeTarget(Project.java:1339)
> 	at org.apache.tools.ant.taskdefs.Ant.execute(Ant.java:397)
> 	at org.apache.tools.ant.taskdefs.CallTarget.execute(CallTarget.java:143)
> 	at org.apache.tools.ant.Task.perform(Task.java:341)
> 	at org.apache.tools.ant.Target.execute(Target.java:309)
> 	at org.apache.tools.ant.Target.performTasks(Target.java:336)
> 	at org.apache.tools.ant.Project.executeTarget(Project.java:1339)
> 	at org.apache.tools.ant.taskdefs.Ant.execute(Ant.java:397)
> 	at org.apache.tools.ant.Task.perform(Task.java:341)
> 	at org.apache.tools.ant.Target.execute(Target.java:309)
> 	at org.apache.tools.ant.Target.performTasks(Target.java:336)
> 	at org.apache.tools.ant.Project.executeTarget(Project.java:1339)
> 	at org.apache.tools.ant.taskdefs.Ant.execute(Ant.java:397)
> 	at org.apache.tools.ant.taskdefs.CallTarget.execute(CallTarget.java:143)
> 	at org.apache.tools.ant.Task.perform(Task.java:341)
> 	at org.apache.tools.ant.Target.execute(Target.java:309)
> 	at org.apache.tools.ant.Target.performTasks(Target.java:336)
> 	at org.apache.tools.ant.Project.executeTarget(Project.java:1339)
> 	at org.apache.tools.ant.taskdefs.Ant.execute(Ant.java:397)
> 	at org.apache.tools.ant.taskdefs.CallTarget.execute(CallTarget.java:143)
> 	at org.apache.tools.ant.Task.perform(Task.java:341)
> 	at org.apache.tools.ant.Target.execute(Target.java:309)
> 	at org.apache.tools.ant.Target.performTasks(Target.java:336)
> 	at org.apache.tools.ant.Project.executeTarget(Project.java:1339)
> 	at org.apache.tools.ant.taskdefs.Ant.execute(Ant.java:397)
> 	at org.apache.tools.ant.Task.perform(Task.java:341)
> 	at org.apache.commons.jelly.tags.ant.AntTag.doTag(AntTag.java:185)
> 	at org.apache.commons.jelly.impl.TagScript.run(TagScript.java:279)
> 	at org.apache.commons.jelly.impl.ScriptBlock.run(ScriptBlock.java:135)
> 	at org.apache.maven.jelly.tags.werkz.MavenGoalTag.runBodyTag(MavenGoalTag.java:79)
> 	at org.apache.maven.jelly.tags.werkz.MavenGoalTag$MavenGoalAction.performAction(MavenGoalTag.java:110)
> 	at com.werken.werkz.Goal.fire(Goal.java:639)
> 	at com.werken.werkz.Goal.attain(Goal.java:575)
> 	at org.apache.maven.plugin.PluginManager.attainGoals(PluginManager.java:671)
> 	at org.apache.maven.MavenSession.attainGoals(MavenSession.java:263)
> 	at org.apache.maven.cli.App.doMain(App.java:488)
> 	at org.apache.maven.cli.App.main(App.java:1239)
> 	at sun.reflect.NativeMethodAccessorImpl.invoke0(Native Method)
> 	at sun.reflect.NativeMethodAccessorImpl.invoke(NativeMethodAccessorImpl.java:39)
> 	at sun.reflect.DelegatingMethodAccessorImpl.invoke(DelegatingMethodAccessorImpl.java:25)
> 	at java.lang.reflect.Method.invoke(Method.java:324)
> 	at com.werken.forehead.Forehead.run(Forehead.java:551)
> 	at com.werken.forehead.Forehead.main(Forehead.java:581)
> Final Memory: 24M/43M
> Total time: 2 minutes 39 seconds
> Finished at: Fri Aug 05 12:01:54 CEST 2005
>
> I noticed that the rttest does not copy the "torque-gen-templates" jar
> into the rttest/lib directory. Is this intentional?
>
> 	Best Regards
> 		Henning
>
> -- 
> Dipl.-Inf. (Univ.) Henning P. Schmiedehausen          INTERMETA GmbH
> hps@intermeta.de        +49 9131 50 654 0   http://www.intermeta.de/
>
> RedHat Certified Engineer -- Jakarta Turbine Development  -- hero for hire
>   Linux, Java, perl, Solaris -- Consulting, Training, Development
>
> 		      4 - 8 - 15 - 16 - 23 - 42
>
> ---------------------------------------------------------------------
> To unsubscribe, e-mail: torque-dev-unsubscribe@db.apache.org
> For additional commands, e-mail: torque-dev-help@db.apache.org
>
>

---------------------------------------------------------------------
To unsubscribe, e-mail: torque-dev-unsubscribe@db.apache.org
For additional commands, e-mail: torque-dev-help@db.apache.org


Mime
View raw message