db-ojb-dev mailing list archives

Site index · List index
Message view « Date » · « Thread »
Top « Date » · « Thread »
From "Matthew Baird" <Matthew.Ba...@motiva.com>
Subject State of the Union
Date Fri, 20 Dec 2002 02:16:09 GMT
with PersistentFieldDefaultImpl

junit-no-compile-no-prepare:
    [junit] Running org.apache.ojb.broker.AllTests
    [junit] [BOOT] INFO: OJB.properties: file:/C:/eclipse/workspace/jakarta-ojb/target/test/ojb/OJB.properties
    [junit] Tests run: 163, Failures: 1, Errors: 0, Time elapsed: 9.281 sec
    [junit] TEST org.apache.ojb.broker.AllTests FAILED
    [junit] Running org.apache.ojb.odmg.AllTests
    [junit] [BOOT] INFO: OJB.properties: file:/C:/eclipse/workspace/jakarta-ojb/target/test/ojb/OJB.properties
    [junit] Tests run: 144, Failures: 0, Errors: 2, Time elapsed: 13.156 sec
    [junit] TEST org.apache.ojb.odmg.AllTests FAILED
    [junit] Running org.apache.ojb.soda.AllTests
    [junit] [BOOT] INFO: OJB.properties: file:/C:/eclipse/workspace/jakarta-ojb/target/test/ojb/OJB.properties
    [junit] Tests run: 3, Failures: 3, Errors: 0, Time elapsed: 4.437 sec
    [junit] TEST org.apache.ojb.soda.AllTests FAILED

with PersistentFieldPropertyImpl

junit-no-compile-no-prepare:
    [junit] Running org.apache.ojb.broker.AllTests
    [junit] [BOOT] INFO: OJB.properties: file:/C:/eclipse/workspace/jakarta-ojb/target/test/ojb/OJB.properties
    [junit] Tests run: 163, Failures: 2, Errors: 2, Time elapsed: 9.281 sec
    [junit] TEST org.apache.ojb.broker.AllTests FAILED
    [junit] Running org.apache.ojb.odmg.AllTests
    [junit] [BOOT] INFO: OJB.properties: file:/C:/eclipse/workspace/jakarta-ojb/target/test/ojb/OJB.properties
    [junit] Tests run: 144, Failures: 0, Errors: 5, Time elapsed: 13.156 sec
    [junit] TEST org.apache.ojb.odmg.AllTests FAILED
    [junit] Running org.apache.ojb.soda.AllTests
    [junit] [BOOT] INFO: OJB.properties: file:/C:/eclipse/workspace/jakarta-ojb/target/test/ojb/OJB.properties
    [junit] Tests run: 3, Failures: 3, Errors: 0, Time elapsed: 4.437 sec
    [junit] TEST org.apache.ojb.soda.AllTests FAILED

I'm curious as to why these results are different?

[org.apache.ojb.broker.accesslayer.JdbcAccess] ERROR: SQLException during the execution of
the delete (for a org.apache.ojb.broker.BidirectionalAssociationObjectA): Integrity constraint
violation: BIDIR_B_FK_1 table: BIDIR_B in statement [DELETE FROM BIDIR_A WHERE pk = 'A1040350973596'
]
Integrity constraint violation: BIDIR_B_FK_1 table: BIDIR_B in statement [DELETE FROM BIDIR_A
WHERE pk = 'A1040350973596' ]

seems to be mostly related to the bidirectional association tests.

I'm looking into it, but would appreciate any help

Mime
View raw message