db-jdo-dev mailing list archives

Site index · List index
Message view « Date » · « Thread »
Top « Date » · « Thread »
From "Andy Jefferson (JIRA)" <j...@apache.org>
Subject [jira] Updated: (JDO-559) JPOX fails to throw JDOUserException on some illegal arguments to pm.newInstance()
Date Tue, 04 Dec 2007 11:05:44 GMT

     [ https://issues.apache.org/jira/browse/JDO-559?page=com.atlassian.jira.plugin.system.issuetabpanels:all-tabpanel
]

Andy Jefferson updated JDO-559:
-------------------------------

        Fix Version/s: JDO 2 maintenance release 1
    Affects Version/s:     (was: JDO 2 maintenance release 1)

> JPOX fails to throw JDOUserException on some illegal arguments to pm.newInstance()
> ----------------------------------------------------------------------------------
>
>                 Key: JDO-559
>                 URL: https://issues.apache.org/jira/browse/JDO-559
>             Project: JDO
>          Issue Type: Bug
>          Components: tck2
>            Reporter: Michelle Caisse
>            Assignee: Andy Jefferson
>             Fix For: JDO 2 maintenance release 1
>
>
> For tests NewInstance (in pm.conf) and NewInstanceBadMapping (in newInstanceBadMapping.conf),
a number of test failures:
> 1) testNewInstanceInterfaceBad(org.apache.jdo.tck.api.persistencemanager.NewInstance)junit.framework.AssertionFailedError:
Expected JDOUserException but no exception thrown.  Interface contains method not declared
as persistent property.
> 	at org.apache.jdo.tck.api.persistencemanager.NewInstance.testNewInstanceInterfaceBad(NewInstance.java:99)
> 	at sun.reflect.NativeMethodAccessorImpl.invoke0(Native Method)
> 	at sun.reflect.NativeMethodAccessorImpl.invoke(NativeMethodAccessorImpl.java:39)
> 	at sun.reflect.DelegatingMethodAccessorImpl.invoke(DelegatingMethodAccessorImpl.java:25)
> 	at org.apache.jdo.tck.JDO_Test.runBare(JDO_Test.java:254)
> 	at org.apache.jdo.tck.util.BatchTestRunner.doRun(BatchTestRunner.java:108)
> 	at org.apache.jdo.tck.util.BatchTestRunner.start(BatchTestRunner.java:148)
> 	at org.apache.jdo.tck.util.BatchTestRunner.main(BatchTestRunner.java:123)
> 2) testNewInstanceAbstractClassBad(org.apache.jdo.tck.api.persistencemanager.NewInstance)junit.framework.AssertionFailedError:
Expected JDOUserException but no exception thrown.  Abstract class contains abstract method
not declared as persistent property.
> 	at org.apache.jdo.tck.api.persistencemanager.NewInstance.testNewInstanceAbstractClassBad(NewInstance.java:115)
> 	at sun.reflect.NativeMethodAccessorImpl.invoke0(Native Method)
> 	at sun.reflect.NativeMethodAccessorImpl.invoke(NativeMethodAccessorImpl.java:39)
> 	at sun.reflect.DelegatingMethodAccessorImpl.invoke(DelegatingMethodAccessorImpl.java:25)
> 	at org.apache.jdo.tck.JDO_Test.runBare(JDO_Test.java:254)
> 	at org.apache.jdo.tck.util.BatchTestRunner.doRun(BatchTestRunner.java:108)
> 	at org.apache.jdo.tck.util.BatchTestRunner.start(BatchTestRunner.java:148)
> 	at org.apache.jdo.tck.util.BatchTestRunner.main(BatchTestRunner.java:123)
> RUN NewInstanceBadMapping.testNewInstanceInterface	   FAILURE
> RUN NewInstanceBadMapping.testNewInstanceAbstractClass	   FAILURE
> RUN NewInstanceBadMapping.testNewInstanceClass	   FAILURE
> Description: All pm tests with standard mapping, no testdata.
> Time: 003
> There were 3 failures:
> 1) testNewInstanceInterface(org.apache.jdo.tck.api.persistencemanager.NewInstanceBadMapping)junit.framework.AssertionFailedError:
Expected JDOUserException but no exception thrown.  Persistent property is not mapped.
> 	at org.apache.jdo.tck.api.persistencemanager.NewInstanceBadMapping.testNewInstanceInterface(NewInstanceBadMapping.java:66)
> 	at sun.reflect.NativeMethodAccessorImpl.invoke0(Native Method)
> 	at sun.reflect.NativeMethodAccessorImpl.invoke(NativeMethodAccessorImpl.java:39)
> 	at sun.reflect.DelegatingMethodAccessorImpl.invoke(DelegatingMethodAccessorImpl.java:25)
> 	at org.apache.jdo.tck.JDO_Test.runBare(JDO_Test.java:254)
> 	at org.apache.jdo.tck.util.BatchTestRunner.doRun(BatchTestRunner.java:108)
> 	at org.apache.jdo.tck.util.BatchTestRunner.start(BatchTestRunner.java:148)
> 	at org.apache.jdo.tck.util.BatchTestRunner.main(BatchTestRunner.java:123)
> 2) testNewInstanceAbstractClass(org.apache.jdo.tck.api.persistencemanager.NewInstanceBadMapping)junit.framework.AssertionFailedError:
Expected JDOUserException but no exception thrown.  Persistent property is not mapped.
> 	at org.apache.jdo.tck.api.persistencemanager.NewInstanceBadMapping.testNewInstanceAbstractClass(NewInstanceBadMapping.java:81)
> 	at sun.reflect.NativeMethodAccessorImpl.invoke0(Native Method)
> 	at sun.reflect.NativeMethodAccessorImpl.invoke(NativeMethodAccessorImpl.java:39)
> 	at sun.reflect.DelegatingMethodAccessorImpl.invoke(DelegatingMethodAccessorImpl.java:25)
> 	at org.apache.jdo.tck.JDO_Test.runBare(JDO_Test.java:254)
> 	at org.apache.jdo.tck.util.BatchTestRunner.doRun(BatchTestRunner.java:108)
> 	at org.apache.jdo.tck.util.BatchTestRunner.start(BatchTestRunner.java:148)
> 	at org.apache.jdo.tck.util.BatchTestRunner.main(BatchTestRunner.java:123)
> 3) testNewInstanceClass(org.apache.jdo.tck.api.persistencemanager.NewInstanceBadMapping)junit.framework.AssertionFailedError:
Expected JDOUserException but no exception thrown.  Persistent property is not mapped.
> 	at org.apache.jdo.tck.api.persistencemanager.NewInstanceBadMapping.testNewInstanceClass(NewInstanceBadMapping.java:96)
> 	at sun.reflect.NativeMethodAccessorImpl.invoke0(Native Method)
> 	at sun.reflect.NativeMethodAccessorImpl.invoke(NativeMethodAccessorImpl.java:39)
> 	at sun.reflect.DelegatingMethodAccessorImpl.invoke(DelegatingMethodAccessorImpl.java:25)
> 	at org.apache.jdo.tck.JDO_Test.runBare(JDO_Test.java:254)
> 	at org.apache.jdo.tck.util.BatchTestRunner.doRun(BatchTestRunner.java:108)
> 	at org.apache.jdo.tck.util.BatchTestRunner.start(BatchTestRunner.java:148)
> 	at org.apache.jdo.tck.util.BatchTestRunner.main(BatchTestRunner.java:123)

-- 
This message is automatically generated by JIRA.
-
You can reply to this email to add a comment to the issue online.


Mime
View raw message