db-derby-dev mailing list archives

Site index · List index
Message view « Date » · « Thread »
Top « Date » · « Thread »
From Apache Jenkins Server <jenk...@builds.apache.org>
Subject Build failed in Jenkins: Derby-trunk #2529
Date Wed, 17 Jan 2018 23:48:33 GMT
See <https://builds.apache.org/job/Derby-trunk/2529/display/redirect>

------------------------------------------
[...truncated 480.46 KB...]
AU        java/testing/org/apache/derbyTesting/functionTests/tests/lang/dcl_emc2l.jar
AU        java/testing/org/apache/derbyTesting/functionTests/tests/lang/desc_index_app.properties
AU        java/testing/org/apache/derbyTesting/functionTests/tests/lang/SQLAuthorizationPropTest.java
AU        java/testing/org/apache/derbyTesting/functionTests/tests/lang/MixedCaseExpressionTest.java
AU        java/testing/org/apache/derbyTesting/functionTests/tests/lang/UniqueConstraintSetNullTest.java
AU        java/testing/org/apache/derbyTesting/functionTests/tests/lang/CollationTest.java
AU        java/testing/org/apache/derbyTesting/functionTests/tests/lang/RoutineTest.java
A         java/testing/org/apache/derbyTesting/functionTests/tests/lang/ConsistencyCheckerTest.java
AU        java/testing/org/apache/derbyTesting/functionTests/tests/lang/DatabaseClassLoadingTest.java
AU        java/testing/org/apache/derbyTesting/functionTests/tests/lang/_Suite.java
AU        java/testing/org/apache/derbyTesting/functionTests/tests/lang/ArithmeticTest.java
AU        java/testing/org/apache/derbyTesting/functionTests/tests/lang/LuceneCoarseAuthorizationTest.java
AU        java/testing/org/apache/derbyTesting/functionTests/tests/lang/ModeAggregate.java
AU        java/testing/org/apache/derbyTesting/functionTests/tests/lang/triggerRecursion_derby.properties
AU        java/testing/org/apache/derbyTesting/functionTests/tests/lang/refActions3.sql
AU        java/testing/org/apache/derbyTesting/functionTests/tests/lang/RenameIndexTest.java
AU        java/testing/org/apache/derbyTesting/functionTests/tests/lang/OffsetFetchNextTest.java
AU        java/testing/org/apache/derbyTesting/functionTests/tests/lang/json.dat
AU        java/testing/org/apache/derbyTesting/functionTests/tests/lang/LuceneBackupTest.java
AU        java/testing/org/apache/derbyTesting/functionTests/tests/lang/ScrollCursors2Test.java
AU        java/testing/org/apache/derbyTesting/functionTests/tests/lang/subquery2_derby.properties
AU        java/testing/org/apache/derbyTesting/functionTests/tests/lang/UDTPermsTest.java
AU        java/testing/org/apache/derbyTesting/functionTests/tests/lang/DeclareGlobalTempTableJavaJDBC30Test.java
AU        java/testing/org/apache/derbyTesting/functionTests/tests/lang/OrderByAndOffsetFetchInSubqueries.java
AU        java/testing/org/apache/derbyTesting/functionTests/tests/lang/TableVTI.java
AU        java/testing/org/apache/derbyTesting/functionTests/tests/lang/cursorerrors_derby.properties
AU        java/testing/org/apache/derbyTesting/functionTests/tests/lang/SecurityPolicyReloadingTest.java
A         java/testing/org/apache/derbyTesting/functionTests/tests/lang/Derby6131.java
AU        java/testing/org/apache/derbyTesting/functionTests/tests/lang/LobMode.java
AU        java/testing/org/apache/derbyTesting/functionTests/tests/lang/maxMemPerTab.java
AU        java/testing/org/apache/derbyTesting/functionTests/tests/lang/HoldCursorTest.java
AU        java/testing/org/apache/derbyTesting/functionTests/tests/lang/orderby.sql
AU        java/testing/org/apache/derbyTesting/functionTests/tests/lang/outparams_app.properties
AU        java/testing/org/apache/derbyTesting/functionTests/tests/lang/wisconsin_app.properties
AU        java/testing/org/apache/derbyTesting/functionTests/tests/lang/Permission.java
AU        java/testing/org/apache/derbyTesting/functionTests/tests/lang/PredicatePushdownTest.java
AU        java/testing/org/apache/derbyTesting/functionTests/tests/lang/FakeByteArray.java
AU        java/testing/org/apache/derbyTesting/functionTests/tests/lang/NullsTest.java
AU        java/testing/org/apache/derbyTesting/functionTests/tests/lang/dcl_java.jar
AU        java/testing/org/apache/derbyTesting/functionTests/tests/lang/FullName.java
AU        java/testing/org/apache/derbyTesting/functionTests/tests/lang/StatementPlanCacheTest.java
AU        java/testing/org/apache/derbyTesting/functionTests/tests/lang/PrepareExecuteDDL.java
AU        java/testing/org/apache/derbyTesting/functionTests/tests/lang/OptionalToolsTest.java
AU        java/testing/org/apache/derbyTesting/functionTests/tests/lang/subqueryFlattening.sql
AU        java/testing/org/apache/derbyTesting/functionTests/tests/lang/dcl_id.jar
AU        java/testing/org/apache/derbyTesting/functionTests/tests/lang/triggerRefClause.sql
AU        java/testing/org/apache/derbyTesting/functionTests/tests/lang/GetPropertyInfoTest_app.properties
AU        java/testing/org/apache/derbyTesting/functionTests/tests/lang/SynonymTest.java
AU        java/testing/org/apache/derbyTesting/functionTests/tests/lang/orderbyElimination.sql
AU        java/testing/org/apache/derbyTesting/functionTests/tests/lang/CursorTest.java
AU        java/testing/org/apache/derbyTesting/functionTests/tests/lang/CoalesceTest.java
AU        java/testing/org/apache/derbyTesting/functionTests/tests/lang/bit2.sql
AU        java/testing/org/apache/derbyTesting/functionTests/tests/lang/LuceneSupportPermsTest.java
AU        java/testing/org/apache/derbyTesting/functionTests/tests/lang/Derby5005Test.java
AU        java/testing/org/apache/derbyTesting/functionTests/tests/lang/userDefMethods.java
AU        java/testing/org/apache/derbyTesting/functionTests/tests/lang/langUnitTests.sql
AU        java/testing/org/apache/derbyTesting/functionTests/tests/lang/ColumnDefaultsTest.java
AU        java/testing/org/apache/derbyTesting/functionTests/tests/lang/GrantRevokeTest.java
AU        java/testing/org/apache/derbyTesting/functionTests/tests/lang/CastingTest.java
AU        java/testing/org/apache/derbyTesting/functionTests/tests/lang/isolationLevels.sql
AU        java/testing/org/apache/derbyTesting/functionTests/tests/lang/RestrictedVTITest.java
AU        java/testing/org/apache/derbyTesting/functionTests/tests/lang/select.sql
AU        java/testing/org/apache/derbyTesting/functionTests/tests/lang/default_app.properties
AU        java/testing/org/apache/derbyTesting/functionTests/tests/lang/joins.sql
AU        java/testing/org/apache/derbyTesting/functionTests/tests/lang/TimeHandlingTest.java
A         java/testing/org/apache/derbyTesting/functionTests/tests/lang/CurrentSchemaTest.java
A         java/testing/org/apache/derbyTesting/functionTests/tests/lang/scrollCursors1_sed.properties
AU        java/testing/org/apache/derbyTesting/functionTests/tests/lang/LuceneJarLoadingTest.java
AU        java/testing/org/apache/derbyTesting/functionTests/tests/lang/NativeAuthenticationServiceTest.java
AU        java/testing/org/apache/derbyTesting/functionTests/tests/lang/MathTrigFunctionsTest.java
AU        java/testing/org/apache/derbyTesting/functionTests/tests/lang/aggregateOptimization.sql
AU        java/testing/org/apache/derbyTesting/functionTests/tests/lang/Derby5866TriggerOrderTest.java
AU        java/testing/org/apache/derbyTesting/functionTests/tests/lang/compressTable_app.properties
AU        java/testing/org/apache/derbyTesting/functionTests/tests/lang/sys_vti_test_derby.tstlog
AU        java/testing/org/apache/derbyTesting/functionTests/tests/lang/median_uda.jar
AU        java/testing/org/apache/derbyTesting/functionTests/tests/lang/t_5494.sh
AU        java/testing/org/apache/derbyTesting/functionTests/tests/lang/wisconsin_sed.properties
AU        java/testing/org/apache/derbyTesting/functionTests/tests/lang/supersimple_app.properties
A         java/testing/org/apache/derbyTesting/functionTests/tests/demo
AU        java/testing/org/apache/derbyTesting/functionTests/tests/demo/build.xml
AU        java/testing/org/apache/derbyTesting/functionTests/tests/demo/CheckToursDBTest.java
AU        java/testing/org/apache/derbyTesting/functionTests/tests/demo/_Suite.java
A         java/testing/org/apache/derbyTesting/functionTests/tests/largedata
AU        java/testing/org/apache/derbyTesting/functionTests/tests/largedata/LobLimitsLiteTest.java
AU        java/testing/org/apache/derbyTesting/functionTests/tests/largedata/LobLimitsClientTest.java
AU        java/testing/org/apache/derbyTesting/functionTests/tests/largedata/LobLimitsTest.java
AU        java/testing/org/apache/derbyTesting/functionTests/tests/largedata/build.xml
AU        java/testing/org/apache/derbyTesting/functionTests/tests/largedata/Derby6884Test.java
A         java/testing/org/apache/derbyTesting/functionTests/tests/largedata/Derby5624Test.java
A         java/testing/org/apache/derbyTesting/functionTests/tests/largedata/Derby6317Test.java
AU        java/testing/org/apache/derbyTesting/functionTests/tests/largedata/_Suite.java
A         java/testing/org/apache/derbyTesting/functionTests/tests/jdbc4
AU        java/testing/org/apache/derbyTesting/functionTests/tests/jdbc4/PreparedStatementTest.java
AU        java/testing/org/apache/derbyTesting/functionTests/tests/jdbc4/LobStreamTest.java
AU        java/testing/org/apache/derbyTesting/functionTests/tests/jdbc4/_Suite.java
AU        java/testing/org/apache/derbyTesting/functionTests/tests/jdbc4/StatementEventsTest.java
AU        java/testing/org/apache/derbyTesting/functionTests/tests/jdbc4/noAbortPermission.policy
AU        java/testing/org/apache/derbyTesting/functionTests/tests/jdbc4/default_app.properties
AU        java/testing/org/apache/derbyTesting/functionTests/tests/jdbc4/BlobClobTestSetup.java
AU        java/testing/org/apache/derbyTesting/functionTests/tests/jdbc4/Driver40Test.java
AU        java/testing/org/apache/derbyTesting/functionTests/tests/jdbc4/Wrapper41DataSource.java
AU        java/testing/org/apache/derbyTesting/functionTests/tests/jdbc4/Wrapper41Driver.java
AU        java/testing/org/apache/derbyTesting/functionTests/tests/jdbc4/StreamTruncationTest.java
AU        java/testing/org/apache/derbyTesting/functionTests/tests/jdbc4/Wrapper41Conn.java
AU        java/testing/org/apache/derbyTesting/functionTests/tests/jdbc4/CallableStatementTestSetup.java
AU        java/testing/org/apache/derbyTesting/functionTests/tests/jdbc4/XA40Test.java
AU        java/testing/org/apache/derbyTesting/functionTests/tests/jdbc4/LoginTimeoutTest.java
AU        java/testing/org/apache/derbyTesting/functionTests/tests/jdbc4/README.html
AU        java/testing/org/apache/derbyTesting/functionTests/tests/jdbc4/ParameterMetaDataWrapperTest.java
AU        java/testing/org/apache/derbyTesting/functionTests/tests/jdbc4/UnsupportedVetter.java
AU        java/testing/org/apache/derbyTesting/functionTests/tests/jdbc4/ConnectionMethodsTest.java
AU        java/testing/org/apache/derbyTesting/functionTests/tests/jdbc4/Derby3650Test.java
AU        java/testing/org/apache/derbyTesting/functionTests/tests/jdbc4/LobSortTest.java
AU        java/testing/org/apache/derbyTesting/functionTests/tests/jdbc4/Wrapper41.java
AU        java/testing/org/apache/derbyTesting/functionTests/tests/jdbc4/Wrapper41Test.java
AU        java/testing/org/apache/derbyTesting/functionTests/tests/jdbc4/TestDbMetaData.java
AU        java/testing/org/apache/derbyTesting/functionTests/tests/jdbc4/RowIdNotImplementedTest.java
AU        java/testing/org/apache/derbyTesting/functionTests/tests/jdbc4/DataSourceTest.java
AU        java/testing/org/apache/derbyTesting/functionTests/tests/jdbc4/ResultSetTest.java
AU        java/testing/org/apache/derbyTesting/functionTests/tests/jdbc4/JDBC4FromJDBC3DataSourceTest.java
AU        java/testing/org/apache/derbyTesting/functionTests/tests/jdbc4/SetObjectUnsupportedTest.java
AU        java/testing/org/apache/derbyTesting/functionTests/tests/jdbc4/ResultSetMetaDataTest.java
AU        java/testing/org/apache/derbyTesting/functionTests/tests/jdbc4/PreparedStatementTest42.java
AU        java/testing/org/apache/derbyTesting/functionTests/tests/jdbc4/copyfiles.ant
AU        java/testing/org/apache/derbyTesting/functionTests/tests/jdbc4/Driver40UnbootedTest.java
AU        java/testing/org/apache/derbyTesting/functionTests/tests/jdbc4/ConnectionTest.java
AU        java/testing/org/apache/derbyTesting/functionTests/tests/jdbc4/StatementTest.java
AU        java/testing/org/apache/derbyTesting/functionTests/tests/jdbc4/AbortTest.java
AU        java/testing/org/apache/derbyTesting/functionTests/tests/jdbc4/VerifySignatures.java
AU        java/testing/org/apache/derbyTesting/functionTests/tests/jdbc4/build.xml
AU        java/testing/org/apache/derbyTesting/functionTests/tests/jdbc4/BlobTest.java
AU        java/testing/org/apache/derbyTesting/functionTests/tests/jdbc4/BlobSetMethodsTest.java
AU        java/testing/org/apache/derbyTesting/functionTests/tests/jdbc4/Derby2017LayerBTest.java
AU        java/testing/org/apache/derbyTesting/functionTests/tests/jdbc4/ClobTest.java
AU        java/testing/org/apache/derbyTesting/functionTests/tests/jdbc4/CallableStatementTest.java
AU        java/testing/org/apache/derbyTesting/functionTests/tests/jdbc4/TestJDBC40Exception.java
AU        java/testing/org/apache/derbyTesting/functionTests/tests/jdbc4/StatementTestSetup.java
A         java/testing/org/apache/derbyTesting/functionTests/tests/multi
AU        java/testing/org/apache/derbyTesting/functionTests/tests/multi/StressMulti10x1.java
AU        java/testing/org/apache/derbyTesting/functionTests/tests/multi/StressMulti50x59.java
AU        java/testing/org/apache/derbyTesting/functionTests/tests/multi/StressMultiTest.java
AU        java/testing/org/apache/derbyTesting/functionTests/tests/multi/build.xml
A         java/testing/org/apache/derbyTesting/functionTests/tests/replicationTests
AU        java/testing/org/apache/derbyTesting/functionTests/tests/replicationTests/KillMaster.java
AU        java/testing/org/apache/derbyTesting/functionTests/tests/replicationTests/TestPreStoppedSlaveServer.java
AU        java/testing/org/apache/derbyTesting/functionTests/tests/replicationTests/ShutdownSlaveDb.java
AU        java/testing/org/apache/derbyTesting/functionTests/tests/replicationTests/ReplicationRun_Local_StateTest_part2.java
AU        java/testing/org/apache/derbyTesting/functionTests/tests/replicationTests/ReplicationTestRun_Verify.java
AU        java/testing/org/apache/derbyTesting/functionTests/tests/replicationTests/ReplicationSuite.java
AU        java/testing/org/apache/derbyTesting/functionTests/tests/replicationTests/StandardTests.java
AU        java/testing/org/apache/derbyTesting/functionTests/tests/replicationTests/Derby5937SlaveShutdownTest.java
AU        java/testing/org/apache/derbyTesting/functionTests/tests/replicationTests/KillSlave.java
AU        java/testing/org/apache/derbyTesting/functionTests/tests/replicationTests/TestPreStartedMaster.java
AU        java/testing/org/apache/derbyTesting/functionTests/tests/replicationTests/ReplicationRun_Local_3_p1.java
AU        java/testing/org/apache/derbyTesting/functionTests/tests/replicationTests/DestroySlaveDB.java
AU        java/testing/org/apache/derbyTesting/functionTests/tests/replicationTests/TestPostStartedMasterAndSlave_Failover.java
AU        java/testing/org/apache/derbyTesting/functionTests/tests/replicationTests/ReplicationRun_Local_3_p5.java
AU        java/testing/org/apache/derbyTesting/functionTests/tests/replicationTests/ReplicationRun.java
AU        java/testing/org/apache/derbyTesting/functionTests/tests/replicationTests/ReplicationRun_Distributed.java
AU        java/testing/org/apache/derbyTesting/functionTests/tests/replicationTests/ReplicationRun_Local_StateTest_part1_3.java
AU        java/testing/org/apache/dERROR: Failed to check out https://svn.apache.org/repos/asf/db/derby/code/trunk
org.tmatesoft.svn.core.SVNException: svn: E200030: There are unfinished transactions detected
in '<https://builds.apache.org/job/Derby-trunk/ws/trunk'>
	at org.tmatesoft.svn.core.internal.wc.SVNErrorManager.error(SVNErrorManager.java:70)
	at org.tmatesoft.svn.core.internal.wc.SVNErrorManager.error(SVNErrorManager.java:57)
	at org.tmatesoft.svn.core.internal.wc17.db.SVNWCDbRoot.ensureNoUnfinishedTransactions(SVNWCDbRoot.java:177)
	at org.tmatesoft.svn.core.internal.wc17.db.SVNWCDb.ensureNoUnfinishedTransactions(SVNWCDb.java:212)
	at org.tmatesoft.svn.core.internal.wc17.SVNWCContext.ensureNoUnfinishedTransactions(SVNWCContext.java:5179)
	at org.tmatesoft.svn.core.wc2.SvnOperationFactory.releaseWcContext(SvnOperationFactory.java:1259)
	at org.tmatesoft.svn.core.wc2.SvnOperationFactory.run(SvnOperationFactory.java:1249)
	at org.tmatesoft.svn.core.wc2.SvnOperation.run(SvnOperation.java:294)
	at hudson.scm.subversion.CheckoutUpdater$1.perform(CheckoutUpdater.java:120)
	at hudson.scm.subversion.WorkspaceUpdater$UpdateTask.delegateTo(WorkspaceUpdater.java:168)
	at hudson.scm.subversion.WorkspaceUpdater$UpdateTask.delegateTo(WorkspaceUpdater.java:176)
	at hudson.scm.subversion.UpdateUpdater$TaskImpl.perform(UpdateUpdater.java:186)
	at hudson.scm.subversion.WorkspaceUpdater$UpdateTask.delegateTo(WorkspaceUpdater.java:168)
	at hudson.scm.SubversionSCM$CheckOutTask.perform(SubversionSCM.java:1030)
	at hudson.scm.SubversionSCM$CheckOutTask.invoke(SubversionSCM.java:1006)
	at hudson.scm.SubversionSCM$CheckOutTask.invoke(SubversionSCM.java:979)
	at hudson.FilePath$FileCallableWrapper.call(FilePath.java:2760)
	at hudson.remoting.UserRequest.perform(UserRequest.java:207)
	at hudson.remoting.UserRequest.perform(UserRequest.java:53)
	at hudson.remoting.Request$2.run(Request.java:358)
	at hudson.remoting.InterceptingExecutorService$1.call(InterceptingExecutorService.java:72)
	at java.util.concurrent.FutureTask.run(FutureTask.java:266)
	at java.util.concurrent.ThreadPoolExecutor.runWorker(ThreadPoolExecutor.java:1142)
	at java.util.concurrent.ThreadPoolExecutor$Worker.run(ThreadPoolExecutor.java:617)
	at java.lang.Thread.run(Thread.java:748)
erbyTesting/functionTests/tests/replicationTests/Derby5937SlaveShutdownTest.policy
org.tmatesoft.svn.core.SVNException: svn: E200030: There are unfinished transactions detected
in '<https://builds.apache.org/job/Derby-trunk/ws/trunk'>
	at org.tmatesoft.svn.core.internal.wc.SVNErrorManager.error(SVNErrorManager.java:70)
	at org.tmatesoft.svn.core.internal.wc.SVNErrorManager.error(SVNErrorManager.java:57)
	at org.tmatesoft.svn.core.internal.wc17.db.SVNWCDbRoot.ensureNoUnfinishedTransactions(SVNWCDbRoot.java:177)
	at org.tmatesoft.svn.core.internal.wc17.db.SVNWCDb.ensureNoUnfinishedTransactions(SVNWCDb.java:212)
	at org.tmatesoft.svn.core.internal.wc17.SVNWCContext.ensureNoUnfinishedTransactions(SVNWCContext.java:5179)
	at org.tmatesoft.svn.core.wc2.SvnOperationFactory.releaseWcContext(SvnOperationFactory.java:1259)
	at org.tmatesoft.svn.core.wc2.SvnOperationFactory.run(SvnOperationFactory.java:1249)
	at org.tmatesoft.svn.core.wc2.SvnOperation.run(SvnOperation.java:294)
	at hudson.scm.subversion.CheckoutUpdater$1.perform(CheckoutUpdater.java:120)
Also:   hudson.remoting.Channel$CallSiteStackTrace: Remote call to H24
		at hudson.remoting.Channel.attachCallSiteStackTrace(Channel.java:1693)
		at hudson.remoting.UserResponse.retrieve(UserRequest.java:310)
		at hudson.remoting.Channel.call(Channel.java:908)
		at hudson.FilePath.act(FilePath.java:986)
		at hudson.FilePath.act(FilePath.java:975)
		at hudson.scm.SubversionSCM.checkout(SubversionSCM.java:928)
		at hudson.scm.SubversionSCM.checkout(SubversionSCM.java:864)
		at hudson.scm.SCM.checkout(SCM.java:495)
		at hudson.model.AbstractProject.checkout(AbstractProject.java:1202)
		at hudson.model.AbstractBuild$AbstractBuildExecution.defaultCheckout(AbstractBuild.java:574)
		at jenkins.scm.SCMCheckoutStrategy.checkout(SCMCheckoutStrategy.java:86)
		at hudson.model.AbstractBuild$AbstractBuildExecution.run(AbstractBuild.java:499)
		at hudson.model.Run.execute(Run.java:1724)
		at hudson.model.FreeStyleBuild.run(FreeStyleBuild.java:43)
		at hudson.model.ResourceController.execute(ResourceController.java:97)
		at hudson.model.Executor.run(Executor.java:421)
Caused: java.io.IOException: Failed to check out https://svn.apache.org/repos/asf/db/derby/code/trunk
	at hudson.scm.subversion.CheckoutUpdater$1.perform(CheckoutUpdater.java:131)
	at hudson.scm.subversion.WorkspaceUpdater$UpdateTask.delegateTo(WorkspaceUpdater.java:168)
	at hudson.scm.subversion.WorkspaceUpdater$UpdateTask.delegateTo(WorkspaceUpdater.java:176)
	at hudson.scm.subversion.UpdateUpdater$TaskImpl.perform(UpdateUpdater.java:186)
	at hudson.scm.subversion.WorkspaceUpdater$UpdateTask.delegateTo(WorkspaceUpdater.java:168)
	at hudson.scm.SubversionSCM$CheckOutTask.perform(SubversionSCM.java:1030)
	at hudson.scm.SubversionSCM$CheckOutTask.invoke(SubversionSCM.java:1006)
	at hudson.scm.SubversionSCM$CheckOutTask.invoke(SubversionSCM.java:979)
	at hudson.FilePath$FileCallableWrapper.call(FilePath.java:2760)
	at hudson.remoting.UserRequest.perform(UserRequest.java:207)
	at hudson.remoting.UserRequest.perform(UserRequest.java:53)
	at hudson.remoting.Request$2.run(Request.java:358)
	at hudson.remoting.InterceptingExecutorService$1.call(InterceptingExecutorService.java:72)
	at java.util.concurrent.FutureTask.run(FutureTask.java:266)
	at java.util.concurrent.ThreadPoolExecutor.runWorker(ThreadPoolExecutor.java:1142)
	at java.util.concurrent.ThreadPoolExecutor$Worker.run(ThreadPoolExecutor.java:617)
	at java.lang.Thread.run(Thread.java:748)
Caused: java.io.IOException: remote file operation failed: <https://builds.apache.org/job/Derby-trunk/ws/>
at hudson.remoting.Channel@39efde6:H24
	at hudson.FilePath.act(FilePath.java:993)
	at hudson.FilePath.act(FilePath.java:975)
	at hudson.scm.SubversionSCM.checkout(SubversionSCM.java:928)
	at hudson.scm.SubversionSCM.checkout(SubversionSCM.java:864)
	at hudson.scm.SCM.checkout(SCM.java:495)
	at hudson.model.AbstractProject.checkout(AbstractProject.java:1202)
	at hudson.model.AbstractBuild$AbstractBuildExecution.defaultCheckout(AbstractBuild.java:574)
	at jenkins.scm.SCMCheckoutStrategy.checkout(SCMCheckoutStrategy.java:86)
	at hudson.model.AbstractBuild$AbstractBuildExecution.run(AbstractBuild.java:499)
	at hudson.model.Run.execute(Run.java:1724)
	at hudson.model.FreeStyleBuild.run(FreeStyleBuild.java:43)
	at hudson.model.ResourceController.execute(ResourceController.java:97)
	at hudson.model.Executor.run(Executor.java:421)
[WARNINGS] Skipping publisher since build result is FAILURE
Archiving artifacts

Mime
View raw message