db-derby-dev mailing list archives

Site index · List index
Message view « Date » · « Thread »
Top « Date » · « Thread »
From Apache Jenkins Server <jenk...@builds.apache.org>
Subject Build failed in Jenkins: Derby-trunk-suites.All #30
Date Sun, 12 Jul 2015 06:16:21 GMT
See <https://builds.apache.org/job/Derby-trunk-suites.All/30/changes>

Changes:

[bpendleton] DERBY-6824: Refactor ShutdownException into shared code area

Having the ShutdownException as a common shared exception class offers no
benefit on its own, but it is an enabler for being able to share the
exception encoding/decoding routines between the network client and the
network server.

There should be no functional changes as a result of this patch, and there
are no new tests added. Subsequent projects intend to build on this change
to introduce functional enhancements and they will include tests for that.

------------------------------------------
[...truncated 1688 lines...]
    [junit] 	at junit.extensions.TestSetup$1.protect(TestSetup.java:21)
    [junit] 	at junit.framework.TestResult.runProtected(TestResult.java:124)
    [junit] 	at junit.extensions.TestSetup.run(TestSetup.java:25)
    [junit] 	at junit.extensions.TestDecorator.basicRun(TestDecorator.java:24)
    [junit] 	at junit.extensions.TestSetup$1.protect(TestSetup.java:21)
    [junit] 	at junit.framework.TestResult.runProtected(TestResult.java:124)
    [junit] 	at junit.extensions.TestSetup.run(TestSetup.java:25)
    [junit] 	at org.apache.derbyTesting.junit.BaseTestSetup.run(BaseTestSetup.java:58)
    [junit] 	at junit.extensions.TestDecorator.basicRun(TestDecorator.java:24)
    [junit] 	at junit.extensions.TestSetup$1.protect(TestSetup.java:21)
    [junit] 	at junit.framework.TestResult.runProtected(TestResult.java:124)
    [junit] 	at junit.extensions.TestSetup.run(TestSetup.java:25)
    [junit] 	at junit.extensions.TestDecorator.basicRun(TestDecorator.java:24)
    [junit] 	at junit.extensions.TestSetup$1.protect(TestSetup.java:21)
    [junit] 	at junit.framework.TestResult.runProtected(TestResult.java:124)
    [junit] 	at junit.extensions.TestSetup.run(TestSetup.java:25)
    [junit] 	at org.apache.derbyTesting.junit.BaseTestSetup.run(BaseTestSetup.java:58)
    [junit] 	at junit.extensions.TestDecorator.basicRun(TestDecorator.java:24)
    [junit] 	at junit.extensions.TestSetup$1.protect(TestSetup.java:21)
    [junit] 	at junit.framework.TestResult.runProtected(TestResult.java:124)
    [junit] 	at junit.extensions.TestSetup.run(TestSetup.java:25)
    [junit] 	at junit.extensions.TestDecorator.basicRun(TestDecorator.java:24)
    [junit] 	at junit.extensions.TestSetup$1.protect(TestSetup.java:21)
    [junit] 	at junit.framework.TestResult.runProtected(TestResult.java:124)
    [junit] 	at junit.extensions.TestSetup.run(TestSetup.java:25)
    [junit] 	at org.apache.derbyTesting.junit.BaseTestSetup.run(BaseTestSetup.java:58)
    [junit] 	at junit.extensions.TestDecorator.basicRun(TestDecorator.java:24)
    [junit] 	at junit.extensions.TestSetup$1.protect(TestSetup.java:21)
    [junit] 	at junit.framework.TestResult.runProtected(TestResult.java:124)
    [junit] 	at junit.extensions.TestSetup.run(TestSetup.java:25)
    [junit] 	at junit.extensions.TestDecorator.basicRun(TestDecorator.java:24)
    [junit] 	at junit.extensions.TestSetup$1.protect(TestSetup.java:21)
    [junit] 	at junit.framework.TestResult.runProtected(TestResult.java:124)
    [junit] 	at junit.extensions.TestSetup.run(TestSetup.java:25)
    [junit] 	at junit.framework.TestSuite.runTest(TestSuite.java:230)
    [junit] 	at junit.framework.TestSuite.run(TestSuite.java:225)
    [junit] 	at junit.framework.TestSuite.runTest(TestSuite.java:230)
    [junit] 	at junit.framework.TestSuite.run(TestSuite.java:225)
    [junit] 	at junit.extensions.TestDecorator.basicRun(TestDecorator.java:24)
    [junit] 	at junit.extensions.TestSetup$1.protect(TestSetup.java:21)
    [junit] 	at junit.framework.TestResult.runProtected(TestResult.java:124)
    [junit] 	at junit.extensions.TestSetup.run(TestSetup.java:25)
    [junit] 	at org.apache.derbyTesting.junit.BaseTestSetup.run(BaseTestSetup.java:58)
    [junit] 	at junit.framework.TestSuite.runTest(TestSuite.java:230)
    [junit] 	at junit.framework.TestSuite.run(TestSuite.java:225)
    [junit] 	at org.apache.tools.ant.taskdefs.optional.junit.JUnitTestRunner.run(JUnitTestRunner.java:532)
    [junit] 	at org.apache.tools.ant.taskdefs.optional.junit.JUnitTestRunner.launch(JUnitTestRunner.java:1179)
    [junit] 	at org.apache.tools.ant.taskdefs.optional.junit.JUnitTestRunner.main(JUnitTestRunner.java:1030)
    [junit] Tests run: 3095, Failures: 30, Errors: 302, Skipped: 0, Time elapsed: 4,061.265
sec
    [junit] Test org.apache.derbyTesting.functionTests.tests.lang._Suite FAILED
    [junit] Running org.apache.derbyTesting.functionTests.tests.jdbcapi._Suite
    [junit] java.io.FileNotFoundException: system/wombat/log/log440.dat (No such file or directory)
    [junit] 	at java.io.FileInputStream.open(Native Method)
    [junit] 	at java.io.FileInputStream.<init>(FileInputStream.java:131)
    [junit] 	at org.apache.derbyTesting.functionTests.util.PrivilegedFileOpsForTests.copySingleFile(PrivilegedFileOpsForTests.java:374)
    [junit] 	at org.apache.derbyTesting.functionTests.util.PrivilegedFileOpsForTests.recursiveCopy(PrivilegedFileOpsForTests.java:346)
    [junit] 	at org.apache.derbyTesting.functionTests.util.PrivilegedFileOpsForTests.access$000(PrivilegedFileOpsForTests.java:49)
    [junit] 	at org.apache.derbyTesting.functionTests.util.PrivilegedFileOpsForTests$12.run(PrivilegedFileOpsForTests.java:305)
    [junit] 	at org.apache.derbyTesting.functionTests.util.PrivilegedFileOpsForTests$12.run(PrivilegedFileOpsForTests.java:303)
    [junit] 	at java.security.AccessController.doPrivileged(Native Method)
    [junit] 	at org.apache.derbyTesting.functionTests.util.PrivilegedFileOpsForTests.copy(PrivilegedFileOpsForTests.java:303)
    [junit] 	at org.apache.derbyTesting.functionTests.util.PrivilegedFileOpsForTests.recursiveCopy(PrivilegedFileOpsForTests.java:344)
    [junit] 	at org.apache.derbyTesting.functionTests.util.PrivilegedFileOpsForTests.access$000(PrivilegedFileOpsForTests.java:49)
    [junit] 	at org.apache.derbyTesting.functionTests.util.PrivilegedFileOpsForTests$12.run(PrivilegedFileOpsForTests.java:305)
    [junit] 	at org.apache.derbyTesting.functionTests.util.PrivilegedFileOpsForTests$12.run(PrivilegedFileOpsForTests.java:303)
    [junit] 	at java.security.AccessController.doPrivileged(Native Method)
    [junit] 	at org.apache.derbyTesting.functionTests.util.PrivilegedFileOpsForTests.copy(PrivilegedFileOpsForTests.java:303)
    [junit] 	at org.apache.derbyTesting.junit.BaseTestCase.runBare(BaseTestCase.java:153)
    [junit] 	at org.apache.derbyTesting.junit.BaseJDBCTestCase.runBareOverridable(BaseJDBCTestCase.java:443)
    [junit] 	at org.apache.derbyTesting.junit.BaseJDBCTestCase.runBare(BaseJDBCTestCase.java:460)
    [junit] 	at junit.framework.TestResult$1.protect(TestResult.java:106)
    [junit] 	at junit.framework.TestResult.runProtected(TestResult.java:124)
    [junit] 	at junit.framework.TestResult.run(TestResult.java:109)
    [junit] 	at junit.framework.TestCase.run(TestCase.java:120)
    [junit] 	at junit.framework.TestSuite.runTest(TestSuite.java:230)
    [junit] 	at junit.framework.TestSuite.run(TestSuite.java:225)
    [junit] 	at junit.extensions.TestDecorator.basicRun(TestDecorator.java:24)
    [junit] 	at junit.extensions.TestSetup$1.protect(TestSetup.java:21)
    [junit] 	at junit.framework.TestResult.runProtected(TestResult.java:124)
    [junit] 	at junit.extensions.TestSetup.run(TestSetup.java:25)
    [junit] 	at org.apache.derbyTesting.junit.BaseTestSetup.run(BaseTestSetup.java:58)
    [junit] 	at junit.extensions.TestDecorator.basicRun(TestDecorator.java:24)
    [junit] 	at junit.extensions.TestSetup$1.protect(TestSetup.java:21)
    [junit] 	at junit.framework.TestResult.runProtected(TestResult.java:124)
    [junit] 	at junit.extensions.TestSetup.run(TestSetup.java:25)
    [junit] 	at org.apache.derbyTesting.junit.BaseTestSetup.run(BaseTestSetup.java:58)
    [junit] 	at junit.extensions.TestDecorator.basicRun(TestDecorator.java:24)
    [junit] 	at junit.extensions.TestSetup$1.protect(TestSetup.java:21)
    [junit] 	at junit.framework.TestResult.runProtected(TestResult.java:124)
    [junit] 	at junit.extensions.TestSetup.run(TestSetup.java:25)
    [junit] 	at org.apache.derbyTesting.junit.BaseTestSetup.run(BaseTestSetup.java:58)
    [junit] 	at junit.extensions.TestDecorator.basicRun(TestDecorator.java:24)
    [junit] 	at junit.extensions.TestSetup$1.protect(TestSetup.java:21)
    [junit] 	at junit.framework.TestResult.runProtected(TestResult.java:124)
    [junit] 	at junit.extensions.TestSetup.run(TestSetup.java:25)
    [junit] 	at junit.framework.TestSuite.runTest(TestSuite.java:230)
    [junit] 	at junit.framework.TestSuite.run(TestSuite.java:225)
    [junit] 	at junit.framework.TestSuite.runTest(TestSuite.java:230)
    [junit] 	at junit.framework.TestSuite.run(TestSuite.java:225)
    [junit] 	at org.apache.tools.ant.taskdefs.optional.junit.JUnitTestRunner.run(JUnitTestRunner.java:532)
    [junit] 	at org.apache.tools.ant.taskdefs.optional.junit.JUnitTestRunner.launch(JUnitTestRunner.java:1179)
    [junit] 	at org.apache.tools.ant.taskdefs.optional.junit.JUnitTestRunner.main(JUnitTestRunner.java:1030)
    [junit] java.lang.SecurityException: sealing violation: package org.apache.derby.shared.common.error
is sealed
    [junit] 	at java.net.URLClassLoader.getAndVerifyPackage(URLClassLoader.java:394)
    [junit] 	at java.net.URLClassLoader.defineClass(URLClassLoader.java:423)
    [junit] 	at java.net.URLClassLoader.access$100(URLClassLoader.java:73)
    [junit] 	at java.net.URLClassLoader$1.run(URLClassLoader.java:367)
    [junit] 	at java.net.URLClassLoader$1.run(URLClassLoader.java:361)
    [junit] 	at java.security.AccessController.doPrivileged(Native Method)
    [junit] 	at java.net.URLClassLoader.findClass(URLClassLoader.java:360)
    [junit] 	at java.lang.ClassLoader.loadClass(ClassLoader.java:424)
    [junit] 	at sun.misc.Launcher$AppClassLoader.loadClass(Launcher.java:308)
    [junit] 	at java.lang.ClassLoader.loadClass(ClassLoader.java:357)
    [junit] 	at org.apache.derby.client.am.SqlException.<init>(SqlException.java:172)
    [junit] 	at org.apache.derby.client.am.SqlException.<init>(SqlException.java:203)
    [junit] 	at org.apache.derby.client.am.ClientStatement.setMaxFieldSize(ClientStatement.java:752)
    [junit] 	at org.apache.derbyTesting.functionTests.tests.jdbcapi.maxfieldsize.main(maxfieldsize.java:150)
    [junit] 	at sun.reflect.NativeMethodAccessorImpl.invoke0(Native Method)
    [junit] 	at sun.reflect.NativeMethodAccessorImpl.invoke(NativeMethodAccessorImpl.java:62)
    [junit] 	at sun.reflect.DelegatingMethodAccessorImpl.invoke(DelegatingMethodAccessorImpl.java:43)
    [junit] 	at java.lang.reflect.Method.invoke(Method.java:483)
    [junit] 	at org.apache.derbyTesting.functionTests.util.HarnessJavaTest.runTest(HarnessJavaTest.java:86)
    [junit] 	at junit.framework.TestCase.runBare(TestCase.java:130)
    [junit] 	at org.apache.derbyTesting.junit.BaseTestCase.runBare(BaseTestCase.java:120)
    [junit] 	at org.apache.derbyTesting.junit.BaseJDBCTestCase.runBareOverridable(BaseJDBCTestCase.java:443)
    [junit] 	at org.apache.derbyTesting.junit.BaseJDBCTestCase.runBare(BaseJDBCTestCase.java:460)
    [junit] 	at junit.framework.TestResult$1.protect(TestResult.java:106)
    [junit] 	at junit.framework.TestResult.runProtected(TestResult.java:124)
    [junit] 	at junit.framework.TestResult.run(TestResult.java:109)
    [junit] 	at junit.framework.TestCase.run(TestCase.java:120)
    [junit] 	at junit.extensions.TestDecorator.basicRun(TestDecorator.java:24)
    [junit] 	at junit.extensions.TestSetup$1.protect(TestSetup.java:21)
    [junit] 	at junit.framework.TestResult.runProtected(TestResult.java:124)
    [junit] 	at junit.extensions.TestSetup.run(TestSetup.java:25)
    [junit] 	at junit.extensions.TestDecorator.basicRun(TestDecorator.java:24)
    [junit] 	at junit.extensions.TestSetup$1.protect(TestSetup.java:21)
    [junit] 	at junit.framework.TestResult.runProtected(TestResult.java:124)
    [junit] 	at junit.extensions.TestSetup.run(TestSetup.java:25)
    [junit] 	at org.apache.derbyTesting.junit.BaseTestSetup.run(BaseTestSetup.java:58)
    [junit] 	at junit.extensions.TestDecorator.basicRun(TestDecorator.java:24)
    [junit] 	at junit.extensions.TestSetup$1.protect(TestSetup.java:21)
    [junit] 	at junit.framework.TestResult.runProtected(TestResult.java:124)
    [junit] 	at junit.extensions.TestSetup.run(TestSetup.java:25)
    [junit] 	at org.apache.derbyTesting.junit.BaseTestSetup.run(BaseTestSetup.java:58)
    [junit] 	at junit.framework.TestSuite.runTest(TestSuite.java:230)
    [junit] 	at junit.framework.TestSuite.run(TestSuite.java:225)
    [junit] 	at junit.extensions.TestDecorator.basicRun(TestDecorator.java:24)
    [junit] 	at junit.extensions.TestSetup$1.protect(TestSetup.java:21)
    [junit] 	at junit.framework.TestResult.runProtected(TestResult.java:124)
    [junit] 	at junit.extensions.TestSetup.run(TestSetup.java:25)
    [junit] 	at org.apache.derbyTesting.junit.BaseTestSetup.run(BaseTestSetup.java:58)
    [junit] 	at junit.extensions.TestDecorator.basicRun(TestDecorator.java:24)
    [junit] 	at junit.extensions.TestSetup$1.protect(TestSetup.java:21)
    [junit] 	at junit.framework.TestResult.runProtected(TestResult.java:124)
    [junit] 	at junit.extensions.TestSetup.run(TestSetup.java:25)
    [junit] 	at junit.framework.TestSuite.runTest(TestSuite.java:230)
    [junit] 	at junit.framework.TestSuite.run(TestSuite.java:225)
    [junit] 	at junit.framework.TestSuite.runTest(TestSuite.java:230)
    [junit] 	at junit.framework.TestSuite.run(TestSuite.java:225)
    [junit] 	at org.apache.tools.ant.taskdefs.optional.junit.JUnitTestRunner.run(JUnitTestRunner.java:532)
    [junit] 	at org.apache.tools.ant.taskdefs.optional.junit.JUnitTestRunner.launch(JUnitTestRunner.java:1179)
    [junit] 	at org.apache.tools.ant.taskdefs.optional.junit.JUnitTestRunner.main(JUnitTestRunner.java:1030)
    [junit] Exception in thread "Thread-117" java.lang.SecurityException: sealing violation:
package org.apache.derby.shared.common.error is sealed
    [junit] 	at java.net.URLClassLoader.getAndVerifyPackage(URLClassLoader.java:394)
    [junit] 	at java.net.URLClassLoader.defineClass(URLClassLoader.java:423)
    [junit] 	at java.net.URLClassLoader.access$100(URLClassLoader.java:73)
    [junit] 	at java.net.URLClassLoader$1.run(URLClassLoader.java:367)
    [junit] 	at java.net.URLClassLoader$1.run(URLClassLoader.java:361)
    [junit] 	at java.security.AccessController.doPrivileged(Native Method)
    [junit] 	at java.net.URLClassLoader.findClass(URLClassLoader.java:360)
    [junit] 	at java.lang.ClassLoader.loadClass(ClassLoader.java:424)
    [junit] 	at sun.misc.Launcher$AppClassLoader.loadClass(Launcher.java:308)
    [junit] 	at java.lang.ClassLoader.loadClass(ClassLoader.java:357)
    [junit] 	at org.apache.derby.client.net.NetConnectionReply.parseAbnormalEndUow(NetConnectionReply.java:452)
    [junit] 	at org.apache.derby.client.net.NetConnectionReply.parseAbnormalEndUow(NetConnectionReply.java:471)
    [junit] 	at org.apache.derby.client.net.NetStatementReply.parseOpenQueryError(NetStatementReply.java:665)
    [junit] 	at org.apache.derby.client.net.NetStatementReply.parseOPNQRYreply(NetStatementReply.java:248)
    [junit] 	at org.apache.derby.client.net.NetStatementReply.readOpenQuery(NetStatementReply.java:66)
    [junit] 	at org.apache.derby.client.net.StatementReply.readOpenQuery(StatementReply.java:53)
    [junit] 	at org.apache.derby.client.net.NetStatement.readOpenQuery_(NetStatement.java:170)
    [junit] 	at org.apache.derby.client.am.ClientStatement.readOpenQuery(ClientStatement.java:1733)
    [junit] 	at org.apache.derby.client.am.ClientPreparedStatement.flowExecute(ClientPreparedStatement.java:2156)
    [junit] 	at org.apache.derby.client.am.ClientPreparedStatement.executeQueryX(ClientPreparedStatement.java:383)
    [junit] 	at org.apache.derby.client.am.ClientPreparedStatement.executeQuery(ClientPreparedStatement.java:368)
    [junit] 	at org.apache.derbyTesting.functionTests.tests.jdbcapi.SetQueryTimeoutTest$StatementExecutor.run(SetQueryTimeoutTest.java:344)
    [junit] org.apache.derbyTesting.functionTests.tests.jdbcapi.SetQueryTimeoutTest$TestFailedException:
fetch did not time out. Highest execution time: 0 ms
    [junit] 	at org.apache.derbyTesting.functionTests.tests.jdbcapi.SetQueryTimeoutTest.expectException(SetQueryTimeoutTest.java:395)
    [junit] 	at org.apache.derbyTesting.functionTests.tests.jdbcapi.SetQueryTimeoutTest.testTimeoutWithFetch(SetQueryTimeoutTest.java:478)
    [junit] 	at org.apache.derbyTesting.functionTests.tests.jdbcapi.SetQueryTimeoutTest.go(SetQueryTimeoutTest.java:767)
    [junit] 	at org.apache.derbyTesting.functionTests.tests.jdbcapi.SetQueryTimeoutTest.main(SetQueryTimeoutTest.java:737)
    [junit] 	at sun.reflect.NativeMethodAccessorImpl.invoke0(Native Method)
    [junit] 	at sun.reflect.NativeMethodAccessorImpl.invoke(NativeMethodAccessorImpl.java:62)
    [junit] 	at sun.reflect.DelegatingMethodAccessorImpl.invoke(DelegatingMethodAccessorImpl.java:43)
    [junit] 	at java.lang.reflect.Method.invoke(Method.java:483)
    [junit] 	at org.apache.derbyTesting.functionTests.util.HarnessJavaTest.runTest(HarnessJavaTest.java:86)
    [junit] 	at junit.framework.TestCase.runBare(TestCase.java:130)
    [junit] 	at org.apache.derbyTesting.junit.BaseTestCase.runBare(BaseTestCase.java:120)
    [junit] 	at org.apache.derbyTesting.junit.BaseJDBCTestCase.runBareOverridable(BaseJDBCTestCase.java:443)
    [junit] 	at org.apache.derbyTesting.junit.BaseJDBCTestCase.runBare(BaseJDBCTestCase.java:460)
    [junit] 	at junit.framework.TestResult$1.protect(TestResult.java:106)
    [junit] 	at junit.framework.TestResult.runProtected(TestResult.java:124)
    [junit] 	at junit.framework.TestResult.run(TestResult.java:109)
    [junit] 	at junit.framework.TestCase.run(TestCase.java:120)
    [junit] 	at junit.extensions.TestDecorator.basicRun(TestDecorator.java:24)
    [junit] 	at junit.extensions.TestSetup$1.protect(TestSetup.java:21)
    [junit] 	at junit.framework.TestResult.runProtected(TestResult.java:124)
    [junit] 	at junit.extensions.TestSetup.run(TestSetup.java:25)
    [junit] 	at junit.extensions.TestDecorator.basicRun(TestDecorator.java:24)
    [junit] 	at junit.extensions.TestSetup$1.protect(TestSetup.java:21)
    [junit] 	at junit.framework.TestResult.runProtected(TestResult.java:124)
    [junit] 	at junit.extensions.TestSetup.run(TestSetup.java:25)
    [junit] 	at org.apache.derbyTesting.junit.BaseTestSetup.run(BaseTestSetup.java:58)
    [junit] 	at junit.extensions.TestDecorator.basicRun(TestDecorator.java:24)
    [junit] 	at junit.extensions.TestSetup$1.protect(TestSetup.java:21)
    [junit] 	at junit.framework.TestResult.runProtected(TestResult.java:124)
    [junit] 	at junit.extensions.TestSetup.run(TestSetup.java:25)
    [junit] 	at org.apache.derbyTesting.junit.BaseTestSetup.run(BaseTestSetup.java:58)
    [junit] 	at junit.framework.TestSuite.runTest(TestSuite.java:230)
    [junit] 	at junit.framework.TestSuite.run(TestSuite.java:225)
    [junit] 	at junit.extensions.TestDecorator.basicRun(TestDecorator.java:24)
    [junit] 	at junit.extensions.TestSetup$1.protect(TestSetup.java:21)
    [junit] 	at junit.framework.TestResult.runProtected(TestResult.java:124)
    [junit] 	at junit.extensions.TestSetup.run(TestSetup.java:25)
    [junit] 	at org.apache.derbyTesting.junit.BaseTestSetup.run(BaseTestSetup.java:58)
    [junit] 	at junit.extensions.TestDecorator.basicRun(TestDecorator.java:24)
    [junit] 	at junit.extensions.TestSetup$1.protect(TestSetup.java:21)
    [junit] 	at junit.framework.TestResult.runProtected(TestResult.java:124)
    [junit] 	at junit.extensions.TestSetup.run(TestSetup.java:25)
    [junit] 	at junit.framework.TestSuite.runTest(TestSuite.java:230)
    [junit] 	at junit.framework.TestSuite.run(TestSuite.java:225)
    [junit] 	at junit.framework.TestSuite.runTest(TestSuite.java:230)
    [junit] 	at junit.framework.TestSuite.run(TestSuite.java:225)
    [junit] 	at org.apache.tools.ant.taskdefs.optional.junit.JUnitTestRunner.run(JUnitTestRunner.java:532)
    [junit] 	at org.apache.tools.ant.taskdefs.optional.junit.JUnitTestRunner.launch(JUnitTestRunner.java:1179)
    [junit] 	at org.apache.tools.ant.taskdefs.optional.junit.JUnitTestRunner.main(JUnitTestRunner.java:1030)
    [junit] Tests run: 7836, Failures: 9, Errors: 3004, Skipped: 0, Time elapsed: 1,965.874
sec
    [junit] Test org.apache.derbyTesting.functionTests.tests.jdbcapi._Suite FAILED
    [junit] Running org.apache.derbyTesting.functionTests.tests.store._Suite
    [junit] Tests run: 345, Failures: 0, Errors: 18, Skipped: 0, Time elapsed: 1,116.827 sec
    [junit] Test org.apache.derbyTesting.functionTests.tests.store._Suite FAILED
    [junit] Running org.apache.derbyTesting.functionTests.tests.engine._Suite
    [junit] Tests run: 39, Failures: 0, Errors: 1, Skipped: 0, Time elapsed: 117.629 sec
    [junit] Test org.apache.derbyTesting.functionTests.tests.engine._Suite FAILED
    [junit] Running org.apache.derbyTesting.functionTests.tests.replicationTests.ReplicationSuite
Build timed out (after 400 minutes). Marking the build as failed.
[locks-and-latches] Releasing all the locks
[locks-and-latches] All the locks released
Build was aborted
Recording test results

Mime
View raw message