db-derby-dev mailing list archives

Site index · List index
Message view « Date » · « Thread »
Top « Date » · « Thread »
From "Myrna van Lunteren (JIRA)" <j...@apache.org>
Subject [jira] [Commented] (DERBY-6280) test failure in SetQueryTimeoutTest ComparisonFailure: Output at line 16 expected:<Test[ing that PreparedStatement remembers timeout.]> but was:<Test[ SetQueryTimeoutTest FAILED]>
Date Thu, 06 Mar 2014 22:09:49 GMT

    [ https://issues.apache.org/jira/browse/DERBY-6280?page=com.atlassian.jira.plugin.system.issuetabpanels:comment-tabpanel&focusedCommentId=13923149#comment-13923149
] 

Myrna van Lunteren commented on DERBY-6280:
-------------------------------------------

Test failed again: http://people.apache.org/~myrnavl/derby_test_results/v10_10/windows/testlog/ibm15/1574754-suites.All_diff.txt:

There was 1 failure:
1) SetQueryTimeoutTest(org.apache.derbyTesting.functionTests.tests.jdbcapi.JDBCHarnessJavaTest)junit.framework.ComparisonFailure:
Output at line 18 expected:<Test[ing timeout with executeUpdate call.]> but was:<Test[
SetQueryTimeoutTest FAILED]>
	at org.apache.derbyTesting.functionTests.util.CanonTestCase.compareCanon(CanonTestCase.java:109)
	at org.apache.derbyTesting.functionTests.util.HarnessJavaTest.runTest(HarnessJavaTest.java:91)
	at org.apache.derbyTesting.junit.BaseTestCase.runBare(BaseTestCase.java:118)
	at org.apache.derbyTesting.junit.BaseJDBCTestCase.runBareOverridable(BaseJDBCTestCase.java:442)
	at org.apache.derbyTesting.junit.BaseJDBCTestCase.runBare(BaseJDBCTestCase.java:459)
	at junit.extensions.TestDecorator.basicRun(TestDecorator.java:24)
	at junit.extensions.TestSetup$1.protect(TestSetup.java:21)
	at junit.extensions.TestSetup.run(TestSetup.java:25)
	at junit.extensions.TestDecorator.basicRun(TestDecorator.java:24)
	at junit.extensions.TestSetup$1.protect(TestSetup.java:21)
	at junit.extensions.TestSetup.run(TestSetup.java:25)
	at org.apache.derbyTesting.junit.BaseTestSetup.run(BaseTestSetup.java:57)
	at junit.extensions.TestDecorator.basicRun(TestDecorator.java:24)
	at junit.extensions.TestSetup$1.protect(TestSetup.java:21)
	at junit.extensions.TestSetup.run(TestSetup.java:25)
	at org.apache.derbyTesting.junit.BaseTestSetup.run(BaseTestSetup.java:57)

and in the console output (with derby.tests.trace=true): 
(emb)jdbcapi.JDBCHarnessJavaTest.SetQueryTimeoutTest org.apache.derbyTesting.functionTests.tests.jdbcapi.SetQueryTimeoutTest$TestFailedException:
Should have timed out, for CallableStatement, on iteration 2, runtime(millis): 8596
	at org.apache.derbyTesting.functionTests.tests.jdbcapi.SetQueryTimeoutTest.testStatementRemembersTimeout(SetQueryTimeoutTest.java:720)
	at org.apache.derbyTesting.functionTests.tests.jdbcapi.SetQueryTimeoutTest.testRememberTimeoutValue(SetQueryTimeoutTest.java:671)
	at org.apache.derbyTesting.functionTests.tests.jdbcapi.SetQueryTimeoutTest.go(SetQueryTimeoutTest.java:770)
	at org.apache.derbyTesting.functionTests.tests.jdbcapi.SetQueryTimeoutTest.main(SetQueryTimeoutTest.java:737)
	at sun.reflect.NativeMethodAccessorImpl.invoke0(Native Method)
	at sun.reflect.NativeMethodAccessorImpl.invoke(NativeMethodAccessorImpl.java:79)
	at sun.reflect.DelegatingMethodAccessorImpl.invoke(DelegatingMethodAccessorImpl.java:43)
	at java.lang.reflect.Method.invoke(Method.java:619)
	at org.apache.derbyTesting.functionTests.util.HarnessJavaTest.runTest(HarnessJavaTest.java:87)
	at junit.framework.TestCase.runBare(TestCase.java:130)
	at org.apache.derbyTesting.junit.BaseTestCase.runBare(BaseTestCase.java:118)
	at org.apache.derbyTesting.junit.BaseJDBCTestCase.runBareOverridable(BaseJDBCTestCase.java:442)
	at org.apache.derbyTesting.junit.BaseJDBCTestCase.runBare(BaseJDBCTestCase.java:459)
	at junit.framework.TestResult$1.protect(TestResult.java:106)
	at junit.framework.TestResult.runProtected(TestResult.java:124)
	at junit.framework.TestResult.run(TestResult.java:109)
	at junit.framework.TestCase.run(TestCase.java:120)
	at junit.extensions.TestDecorator.basicRun(TestDecorator.java:24)
	at junit.extensions.TestSetup$1.protect(TestSetup.java:21)
	at junit.framework.TestResult.runProtected(TestResult.java:124)
	at junit.extensions.TestSetup.run(TestSetup.java:25)
	at junit.extensions.TestDecorator.basicRun(TestDecorator.java:24)
	at junit.extensions.TestSetup$1.protect(TestSetup.java:21)
	at junit.framework.TestResult.runProtected(TestResult.java:124)
	at junit.extensions.TestSetup.run(TestSetup.java:25)
	at org.apache.derbyTesting.junit.BaseTestSetup.run(BaseTestSetup.java:57)
	at junit.extensions.TestDecorator.basicRun(TestDecorator.java:24)
	at junit.extensions.TestSetup$1.protect(TestSetup.java:21)
	at junit.framework.TestResult.runProtected(TestResult.java:124)
	at junit.extensions.TestSetup.run(TestSetup.java:25)
	at org.apache.derbyTesting.junit.BaseTestSetup.run(BaseTestSetup.java:57)
	at junit.framework.TestSuite.runTest(TestSuite.java:230)
	at junit.framework.TestSuite.run(TestSuite.java:225)
	at junit.framework.TestSuite.runTest(TestSuite.java:230)
	at junit.framework.TestSuite.run(TestSuite.java:225)
	at junit.framework.TestSuite.runTest(TestSuite.java:230)
	at junit.framework.TestSuite.run(TestSuite.java:225)
	at junit.framework.TestSuite.runTest(TestSuite.java:230)
	at junit.framework.TestSuite.run(TestSuite.java:225)
	at junit.framework.TestSuite.runTest(TestSuite.java:230)
	at junit.framework.TestSuite.run(TestSuite.java:225)
	at junit.textui.TestRunner.doRun(TestRunner.java:121)
	at junit.textui.TestRunner.start(TestRunner.java:185)
	at junit.textui.TestRunner.main(TestRunner.java:143)
used 62978 ms F.

> test failure in SetQueryTimeoutTest ComparisonFailure: Output at line 16 expected:<Test[ing
that PreparedStatement remembers timeout.]> but was:<Test[ SetQueryTimeoutTest FAILED]>
> -----------------------------------------------------------------------------------------------------------------------------------------------------------------------------------
>
>                 Key: DERBY-6280
>                 URL: https://issues.apache.org/jira/browse/DERBY-6280
>             Project: Derby
>          Issue Type: Bug
>          Components: Test
>    Affects Versions: 10.10.1.4
>         Environment: win(on vmware), ibm16
>            Reporter: Myrna van Lunteren
>
> build:
> 10.10.1.3 - (1495273)
> see: http://people.apache.org/~myrnavl/derby_test_results/v10_10/windows/testlog/ibm16/1495273-suites.All_diff.txt
> stack trace:
> 1) SetQueryTimeoutTest(org.apache.derbyTesting.functionTests.tests.jdbcapi.JDBCHarnessJavaTest)junit.framework.ComparisonFailure:
Output at line 16 expected:<Test[ing that PreparedStatement remembers timeout.]> but
was:<Test[ SetQueryTimeoutTest FAILED]>
> 	at org.apache.derbyTesting.functionTests.util.CanonTestCase.compareCanon(CanonTestCase.java:109)
> 	at org.apache.derbyTesting.functionTests.util.HarnessJavaTest.runTest(HarnessJavaTest.java:91)
> 	at org.apache.derbyTesting.junit.BaseTestCase.runBare(BaseTestCase.java:117)
> 	at org.apache.derbyTesting.junit.BaseJDBCTestCase.runBareOverridable(BaseJDBCTestCase.java:442)
> 	at org.apache.derbyTesting.junit.BaseJDBCTestCase.runBare(BaseJDBCTestCase.java:459)
> 	at junit.extensions.TestDecorator.basicRun(TestDecorator.java:24)
> 	at junit.extensions.TestSetup$1.protect(TestSetup.java:21)
> 	at junit.extensions.TestSetup.run(TestSetup.java:25)
> 	at junit.extensions.TestDecorator.basicRun(TestDecorator.java:24)
> 	at junit.extensions.TestSetup$1.protect(TestSetup.java:21)
> 	at junit.extensions.TestSetup.run(TestSetup.java:25)
> 	at org.apache.derbyTesting.junit.BaseTestSetup.run(BaseTestSetup.java:57)
> 	at junit.extensions.TestDecorator.basicRun(TestDecorator.java:24)
> 	at junit.extensions.TestSetup$1.protect(TestSetup.java:21)
> 	at junit.extensions.TestSetup.run(TestSetup.java:25)
> 	at org.apache.derbyTesting.junit.BaseTestSetup.run(BaseTestSetup.java:57)



--
This message was sent by Atlassian JIRA
(v6.2#6252)

Mime
View raw message