db-derby-dev mailing list archives

Site index · List index
Message view « Date » · « Thread »
Top « Date » · « Thread »
From "Mamta A. Satoor (JIRA)" <j...@apache.org>
Subject [jira] [Commented] (DERBY-6311) cs_FailedStreamInsertCharBufferBoundaries(org.apache.derbyTesting.functionTests.tests.jdbcapi.Derby2017LayerATest)java.sql.SQLException: Exception during restore of a serializable or SQLData object of class
Date Tue, 04 Feb 2014 22:34:09 GMT

    [ https://issues.apache.org/jira/browse/DERBY-6311?page=com.atlassian.jira.plugin.system.issuetabpanels:comment-tabpanel&focusedCommentId=13891320#comment-13891320
] 

Mamta A. Satoor commented on DERBY-6311:
----------------------------------------

Happened again on windows 2008R2 with ibm 16 on 10.9.2.2 - (1563372)
http://people.apache.org/~myrnavl/derby_test_results/v10_9/windows/testlog/ibm15/1563372-suites.All_diff.txt
1) cs_FailedStreamInsertCharBufferBoundaries(org.apache.derbyTesting.functionTests.tests.jdbcapi.Derby2017LayerATest)java.sql.SQLException:
Exception during restore of a serializable or SQLData object of class 
	at org.apache.derby.client.am.SQLExceptionFactory.getSQLException(Unknown Source)
	at org.apache.derby.client.am.SqlException.getSQLException(Unknown Source)
	at org.apache.derby.client.am.Statement.executeQuery(Unknown Source)
	at org.apache.derbyTesting.functionTests.tests.jdbcapi.Derby2017LayerATest.doInsertTest(Derby2017LayerATest.java:559)
	at org.apache.derbyTesting.functionTests.tests.jdbcapi.Derby2017LayerATest.cs_FailedStreamInsertCharBufferBoundaries(Derby2017LayerATest.java:166)
	at sun.reflect.NativeMethodAccessorImpl.invoke0(Native Method)
	at sun.reflect.NativeMethodAccessorImpl.invoke(NativeMethodAccessorImpl.java:79)
	at sun.reflect.DelegatingMethodAccessorImpl.invoke(DelegatingMethodAccessorImpl.java:43)
	at org.apache.derbyTesting.junit.BaseTestCase.runBare(BaseTestCase.java:113)
	at org.apache.derbyTesting.junit.BaseJDBCTestCase.runBareOverridable(BaseJDBCTestCase.java:442)
	at org.apache.derbyTesting.junit.BaseJDBCTestCase.runBare(BaseJDBCTestCase.java:459)
	at junit.extensions.TestDecorator.basicRun(TestDecorator.java:24)
	at junit.extensions.TestSetup$1.protect(TestSetup.java:21)
	at junit.extensions.TestSetup.run(TestSetup.java:25)
	at org.apache.derbyTesting.junit.BaseTestSetup.run(BaseTestSetup.java:57)
	at junit.extensions.TestDecorator.basicRun(TestDecorator.java:24)
	at junit.extensions.TestSetup$1.protect(TestSetup.java:21)
	at junit.extensions.TestSetup.run(TestSetup.java:25)
Caused by: org.apache.derby.client.am.SqlException: Exception during restore of a serializable
or SQLData object of class 
	at org.apache.derby.client.am.Statement.completeSqlca(Unknown Source)
	at org.apache.derby.client.am.Statement.completeOpenQuery(Unknown Source)
	at org.apache.derby.client.net.NetStatementReply.parseOpenQueryFailure(Unknown Source)
	at org.apache.derby.client.net.NetStatementReply.parseOPNQRYreply(Unknown Source)
	at org.apache.derby.client.net.NetStatementReply.readOpenQuery(Unknown Source)
	at org.apache.derby.client.net.StatementReply.readOpenQuery(Unknown Source)
	at org.apache.derby.client.net.NetStatement.readOpenQuery_(Unknown Source)
	at org.apache.derby.client.am.Statement.readOpenQuery(Unknown Source)
	at org.apache.derby.client.am.Statement.flowExecute(Unknown Source)
	at org.apache.derby.client.am.Statement.executeQueryX(Unknown Source)
	... 38 more
Caused by: org.apache.derby.client.am.SqlException: Java exception: ': java.io.UTFDataFormatException'.
	at org.apache.derby.client.am.SqlException.<init>(Unknown Source)
	at org.apache.derby.client.am.SqlException.<init>(Unknown Source)
	... 48 more

> cs_FailedStreamInsertCharBufferBoundaries(org.apache.derbyTesting.functionTests.tests.jdbcapi.Derby2017LayerATest)java.sql.SQLException:
Exception during restore of a serializable or SQLData object of class 
> ---------------------------------------------------------------------------------------------------------------------------------------------------------------------------------------------------------------
>
>                 Key: DERBY-6311
>                 URL: https://issues.apache.org/jira/browse/DERBY-6311
>             Project: Derby
>          Issue Type: Bug
>          Components: Network Client
>    Affects Versions: 10.11.0.0
>         Environment: Windows IBM JDK 1.7
>            Reporter: Kathey Marsden
>
> Saw this failure in the nightlies 
> http://cloudsoft.svl.ibm.com/intranet/nightlies/derbywinvm/JarResults.2013-08-13/ibm17_suites.All/suites.All.out
> 1) cs_FailedStreamInsertCharBufferBoundaries(org.apache.derbyTesting.functionTests.tests.jdbcapi.Derby2017LayerATest)java.sql.SQLException:
Exception during restore of a serializable or SQLData object of class 
> 	at org.apache.derby.client.am.SQLExceptionFactory.getSQLException(Unknown Source)
> 	at org.apache.derby.client.am.SqlException.getSQLException(Unknown Source)
> 	at org.apache.derby.client.am.ClientStatement.executeQuery(Unknown Source)
> 	at org.apache.derbyTesting.functionTests.tests.jdbcapi.Derby2017LayerATest.doInsertTest(Derby2017LayerATest.java:559)
> 	at org.apache.derbyTesting.functionTests.tests.jdbcapi.Derby2017LayerATest.cs_FailedStreamInsertCharBufferBoundaries(Derby2017LayerATest.java:166)
> 	at sun.reflect.NativeMethodAccessorImpl.invoke0(Native Method)
> 	at sun.reflect.NativeMethodAccessorImpl.invoke(NativeMethodAccessorImpl.java:76)
> 	at sun.reflect.DelegatingMethodAccessorImpl.invoke(DelegatingMethodAccessorImpl.java:43)
> 	at org.apache.derbyTesting.junit.BaseTestCase.runBare(BaseTestCase.java:117)
> 	at org.apache.derbyTesting.junit.BaseJDBCTestCase.runBareOverridable(BaseJDBCTestCase.java:439)
> 	at org.apache.derbyTesting.junit.BaseJDBCTestCase.runBare(BaseJDBCTestCase.java:456)
> 	at junit.extensions.TestDecorator.basicRun(TestDecorator.java:24)
> 	at junit.extensions.TestSetup$1.protect(TestSetup.java:21)
> 	at junit.extensions.TestSetup.run(TestSetup.java:25)
> 	at org.apache.derbyTesting.junit.BaseTestSetup.run(BaseTestSetup.java:57)
> 	at junit.extensions.TestDecorator.basicRun(TestDecorator.java:24)
> 	at junit.extensions.TestSetup$1.protect(TestSetup.java:21)
> 	at junit.extensions.TestSetup.run(TestSetup.java:25)
> Caused by: org.apache.derby.client.am.SqlException: Exception during restore of a serializable
or SQLData object of class 
> 	at org.apache.derby.client.am.ClientStatement.completeSqlca(Unknown Source)
> 	at org.apache.derby.client.am.ClientStatement.completeOpenQuery(Unknown Source)
> 	at org.apache.derby.client.net.NetStatementReply.parseOpenQueryFailure(Unknown Source)
> 	at org.apache.derby.client.net.NetStatementReply.parseOPNQRYreply(Unknown Source)
> 	at org.apache.derby.client.net.NetStatementReply.readOpenQuery(Unknown Source)
> 	at org.apache.derby.client.net.StatementReply.readOpenQuery(Unknown Source)
> 	at org.apache.derby.client.net.NetStatement.readOpenQuery_(Unknown Source)
> 	at org.apache.derby.client.am.ClientStatement.readOpenQuery(Unknown Source)
> 	at org.apache.derby.client.am.ClientStatement.flowExecute(Unknown Source)
> 	at org.apache.derby.client.am.ClientStatement.executeQueryX(Unknown Source)
> 	... 38 more
> Caused by: org.apache.derby.client.am.SqlException: Java exception: ': java.io.UTFDataFormatException'.
> 	at org.apache.derby.client.am.SqlException.<init>(Unknown Source)
> 	at org.apache.derby.client.am.SqlException.<init>(Unknown Source)
> 	... 48 more
> FAILURES!!!
> Tests run: 17765,  Failures: 0,  Errors: 1



--
This message was sent by Atlassian JIRA
(v6.1.5#6160)

Mime
View raw message