db-derby-dev mailing list archives

Site index · List index
Message view « Date » · « Thread »
Top « Date » · « Thread »
From "ASF subversion and git services (JIRA)" <j...@apache.org>
Subject [jira] [Commented] (DERBY-6280) test failure in SetQueryTimeoutTest ComparisonFailure: Output at line 16 expected:<Test[ing that PreparedStatement remembers timeout.]> but was:<Test[ SetQueryTimeoutTest FAILED]>
Date Tue, 25 Feb 2014 17:56:19 GMT

    [ https://issues.apache.org/jira/browse/DERBY-6280?page=com.atlassian.jira.plugin.system.issuetabpanels:comment-tabpanel&focusedCommentId=13911789#comment-13911789
] 

ASF subversion and git services commented on DERBY-6280:
--------------------------------------------------------

Commit 1571771 from [~myrna] in branch 'code/branches/10.10'
[ https://svn.apache.org/r1571771 ]

DERBY-6280; test failure in SetQueryTimeoutTest ComparisonFailure: Output at line 16 expected:<Test[ing
that PreparedStatement remembers timeout.]> but was:<Test[ SetQueryTimeoutTest FAILED]>
  merge of revisions 1571764 and 1571769 from trunk

> test failure in SetQueryTimeoutTest ComparisonFailure: Output at line 16 expected:<Test[ing
that PreparedStatement remembers timeout.]> but was:<Test[ SetQueryTimeoutTest FAILED]>
> -----------------------------------------------------------------------------------------------------------------------------------------------------------------------------------
>
>                 Key: DERBY-6280
>                 URL: https://issues.apache.org/jira/browse/DERBY-6280
>             Project: Derby
>          Issue Type: Bug
>          Components: Test
>    Affects Versions: 10.10.1.4
>         Environment: win(on vmware), ibm16
>            Reporter: Myrna van Lunteren
>
> build:
> 10.10.1.3 - (1495273)
> see: http://people.apache.org/~myrnavl/derby_test_results/v10_10/windows/testlog/ibm16/1495273-suites.All_diff.txt
> stack trace:
> 1) SetQueryTimeoutTest(org.apache.derbyTesting.functionTests.tests.jdbcapi.JDBCHarnessJavaTest)junit.framework.ComparisonFailure:
Output at line 16 expected:<Test[ing that PreparedStatement remembers timeout.]> but
was:<Test[ SetQueryTimeoutTest FAILED]>
> 	at org.apache.derbyTesting.functionTests.util.CanonTestCase.compareCanon(CanonTestCase.java:109)
> 	at org.apache.derbyTesting.functionTests.util.HarnessJavaTest.runTest(HarnessJavaTest.java:91)
> 	at org.apache.derbyTesting.junit.BaseTestCase.runBare(BaseTestCase.java:117)
> 	at org.apache.derbyTesting.junit.BaseJDBCTestCase.runBareOverridable(BaseJDBCTestCase.java:442)
> 	at org.apache.derbyTesting.junit.BaseJDBCTestCase.runBare(BaseJDBCTestCase.java:459)
> 	at junit.extensions.TestDecorator.basicRun(TestDecorator.java:24)
> 	at junit.extensions.TestSetup$1.protect(TestSetup.java:21)
> 	at junit.extensions.TestSetup.run(TestSetup.java:25)
> 	at junit.extensions.TestDecorator.basicRun(TestDecorator.java:24)
> 	at junit.extensions.TestSetup$1.protect(TestSetup.java:21)
> 	at junit.extensions.TestSetup.run(TestSetup.java:25)
> 	at org.apache.derbyTesting.junit.BaseTestSetup.run(BaseTestSetup.java:57)
> 	at junit.extensions.TestDecorator.basicRun(TestDecorator.java:24)
> 	at junit.extensions.TestSetup$1.protect(TestSetup.java:21)
> 	at junit.extensions.TestSetup.run(TestSetup.java:25)
> 	at org.apache.derbyTesting.junit.BaseTestSetup.run(BaseTestSetup.java:57)



--
This message was sent by Atlassian JIRA
(v6.1.5#6160)

Mime
View raw message