db-derby-dev mailing list archives

Site index · List index
Message view « Date » · « Thread »
Top « Date » · « Thread »
From Apache Jenkins Server <jenk...@builds.apache.org>
Subject Build failed in Jenkins: Derby-branch-10.9 #111
Date Wed, 06 Nov 2013 10:55:32 GMT
See <https://builds.apache.org/job/Derby-branch-10.9/111/>

------------------------------------------
Started by an SCM change
Building remotely on ubuntu6 in workspace <https://builds.apache.org/job/Derby-branch-10.9/ws/>
Updating https://svn.eu.apache.org/repos/asf/db/derby/code/branches/10.9 at revision '2013-11-06T10:54:28.937
+0000'
A         java/testing/org/apache/derbyTesting/functionTests/tests/store/Derby4923Test.java
U         java/testing/org/apache/derbyTesting/functionTests/tests/store/_Suite.java
U         java/testing/org/apache/derbyTesting/functionTests/master/DerbyNetClient/dblook_test_net.out
U         java/testing/org/apache/derbyTesting/functionTests/master/DerbyNetClient/dblook_test_net_territory.out
U         java/testing/org/apache/derbyTesting/functionTests/master/dblook_test.out
U         java/testing/org/apache/derbyTesting/functionTests/master/dblook_test_territory.out
U         java/engine/org/apache/derby/impl/sql/compile/CreateTriggerNode.java
U         java/engine/org/apache/derby/impl/store/raw/data/StoredPage.java
 U        .
At revision 1539305
hudson.util.IOException2: revision check failed on https://svn.eu.apache.org/repos/asf/db/derby/code/branches/10.9
	at hudson.scm.SubversionChangeLogBuilder.buildModule(SubversionChangeLogBuilder.java:178)
	at hudson.scm.SubversionChangeLogBuilder.run(SubversionChangeLogBuilder.java:113)
	at hudson.scm.SubversionSCM.calcChangeLog(SubversionSCM.java:654)
	at hudson.scm.SubversionSCM.checkout(SubversionSCM.java:815)
	at hudson.model.AbstractProject.checkout(AbstractProject.java:1411)
	at hudson.model.AbstractBuild$AbstractBuildExecution.defaultCheckout(AbstractBuild.java:652)
	at jenkins.scm.SCMCheckoutStrategy.checkout(SCMCheckoutStrategy.java:88)
	at hudson.model.AbstractBuild$AbstractBuildExecution.run(AbstractBuild.java:557)
	at hudson.model.Run.execute(Run.java:1665)
	at hudson.model.FreeStyleBuild.run(FreeStyleBuild.java:46)
	at hudson.model.ResourceController.execute(ResourceController.java:88)
	at hudson.model.Executor.run(Executor.java:230)
Caused by: org.tmatesoft.svn.core.SVNException: svn: E175002: OPTIONS /repos/asf/db/derby/code/branches/10.9
failed
	at org.tmatesoft.svn.core.internal.io.dav.http.HTTPConnection.request(HTTPConnection.java:388)
	at org.tmatesoft.svn.core.internal.io.dav.http.HTTPConnection.request(HTTPConnection.java:373)
	at org.tmatesoft.svn.core.internal.io.dav.http.HTTPConnection.request(HTTPConnection.java:361)
	at org.tmatesoft.svn.core.internal.io.dav.DAVConnection.performHttpRequest(DAVConnection.java:707)
	at org.tmatesoft.svn.core.internal.io.dav.DAVConnection.exchangeCapabilities(DAVConnection.java:627)
	at org.tmatesoft.svn.core.internal.io.dav.DAVConnection.open(DAVConnection.java:102)
	at org.tmatesoft.svn.core.internal.io.dav.DAVRepository.openConnection(DAVRepository.java:1020)
	at org.tmatesoft.svn.core.internal.io.dav.DAVRepository.getLatestRevision(DAVRepository.java:180)
	at org.tmatesoft.svn.core.internal.wc2.ng.SvnNgRepositoryAccess.getRevisionNumber(SvnNgRepositoryAccess.java:118)
	at org.tmatesoft.svn.core.internal.wc2.SvnRepositoryAccess.getLocations(SvnRepositoryAccess.java:148)
	at org.tmatesoft.svn.core.internal.wc2.ng.SvnNgRepositoryAccess.createRepositoryFor(SvnNgRepositoryAccess.java:45)
	at org.tmatesoft.svn.core.internal.wc2.remote.SvnRemoteLog.run(SvnRemoteLog.java:160)
	at org.tmatesoft.svn.core.internal.wc2.remote.SvnRemoteLog.run(SvnRemoteLog.java:35)
	at org.tmatesoft.svn.core.internal.wc2.SvnOperationRunner.run(SvnOperationRunner.java:20)
	at org.tmatesoft.svn.core.wc2.SvnOperationFactory.run(SvnOperationFactory.java:1238)
	at org.tmatesoft.svn.core.wc2.SvnOperation.run(SvnOperation.java:294)
	at org.tmatesoft.svn.core.wc.SVNLogClient.doLog(SVNLogClient.java:967)
	at org.tmatesoft.svn.core.wc.SVNLogClient.doLog(SVNLogClient.java:872)
	at hudson.scm.SubversionChangeLogBuilder.buildModule(SubversionChangeLogBuilder.java:166)
	... 11 more
Caused by: svn: E175002: OPTIONS /repos/asf/db/derby/code/branches/10.9 failed
	at org.tmatesoft.svn.core.SVNErrorMessage.create(SVNErrorMessage.java:208)
	at org.tmatesoft.svn.core.SVNErrorMessage.create(SVNErrorMessage.java:154)
	at org.tmatesoft.svn.core.SVNErrorMessage.create(SVNErrorMessage.java:97)
	... 30 more
Caused by: org.tmatesoft.svn.core.SVNException: svn: E175002: OPTIONS request failed on '/repos/asf/db/derby/code/branches/10.9'
svn: E175002: handshake alert:  unrecognized_name
	at org.tmatesoft.svn.core.internal.wc.SVNErrorManager.error(SVNErrorManager.java:64)
	at org.tmatesoft.svn.core.internal.wc.SVNErrorManager.error(SVNErrorManager.java:51)
	at org.tmatesoft.svn.core.internal.io.dav.http.HTTPConnection._request(HTTPConnection.java:777)
	at org.tmatesoft.svn.core.internal.io.dav.http.HTTPConnection.request(HTTPConnection.java:382)
	... 29 more
Caused by: svn: E175002: OPTIONS request failed on '/repos/asf/db/derby/code/branches/10.9'
	at org.tmatesoft.svn.core.SVNErrorMessage.create(SVNErrorMessage.java:208)
	at org.tmatesoft.svn.core.internal.io.dav.http.HTTPConnection._request(HTTPConnection.java:775)
	... 30 more
Caused by: svn: E175002: handshake alert:  unrecognized_name
	at org.tmatesoft.svn.core.SVNErrorMessage.create(SVNErrorMessage.java:109)
	at org.tmatesoft.svn.core.internal.io.dav.http.HTTPConnection._request(HTTPConnection.java:526)
	... 30 more
Caused by: javax.net.ssl.SSLProtocolException: handshake alert:  unrecognized_name
	at sun.security.ssl.ClientHandshaker.handshakeAlert(ClientHandshaker.java:1292)
	at sun.security.ssl.SSLSocketImpl.recvAlert(SSLSocketImpl.java:1954)
	at sun.security.ssl.SSLSocketImpl.readRecord(SSLSocketImpl.java:1077)
	at sun.security.ssl.SSLSocketImpl.performInitialHandshake(SSLSocketImpl.java:1312)
	at sun.security.ssl.SSLSocketImpl.writeRecord(SSLSocketImpl.java:702)
	at sun.security.ssl.AppOutputStream.write(AppOutputStream.java:122)
	at java.io.BufferedOutputStream.flushBuffer(BufferedOutputStream.java:82)
	at java.io.BufferedOutputStream.flush(BufferedOutputStream.java:140)
	at org.tmatesoft.svn.core.internal.io.dav.http.HTTPConnection.sendData(HTTPConnection.java:323)
	at org.tmatesoft.svn.core.internal.io.dav.http.HTTPRequest.dispatch(HTTPRequest.java:170)
	at org.tmatesoft.svn.core.internal.io.dav.http.HTTPConnection._request(HTTPConnection.java:480)
	... 30 more
Retrying after 10 seconds
Updating https://svn.eu.apache.org/repos/asf/db/derby/code/branches/10.9 at revision '2013-11-06T10:54:28.937
+0000'
At revision 1539305
hudson.util.IOException2: revision check failed on https://svn.eu.apache.org/repos/asf/db/derby/code/branches/10.9
	at hudson.scm.SubversionChangeLogBuilder.buildModule(SubversionChangeLogBuilder.java:178)
	at hudson.scm.SubversionChangeLogBuilder.run(SubversionChangeLogBuilder.java:113)
	at hudson.scm.SubversionSCM.calcChangeLog(SubversionSCM.java:654)
	at hudson.scm.SubversionSCM.checkout(SubversionSCM.java:815)
	at hudson.model.AbstractProject.checkout(AbstractProject.java:1411)
	at hudson.model.AbstractBuild$AbstractBuildExecution.defaultCheckout(AbstractBuild.java:652)
	at jenkins.scm.SCMCheckoutStrategy.checkout(SCMCheckoutStrategy.java:88)
	at hudson.model.AbstractBuild$AbstractBuildExecution.run(AbstractBuild.java:557)
	at hudson.model.Run.execute(Run.java:1665)
	at hudson.model.FreeStyleBuild.run(FreeStyleBuild.java:46)
	at hudson.model.ResourceController.execute(ResourceController.java:88)
	at hudson.model.Executor.run(Executor.java:230)
Caused by: org.tmatesoft.svn.core.SVNException: svn: E175002: OPTIONS /repos/asf/db/derby/code/branches/10.9
failed
	at org.tmatesoft.svn.core.internal.io.dav.http.HTTPConnection.request(HTTPConnection.java:388)
	at org.tmatesoft.svn.core.internal.io.dav.http.HTTPConnection.request(HTTPConnection.java:373)
	at org.tmatesoft.svn.core.internal.io.dav.http.HTTPConnection.request(HTTPConnection.java:361)
	at org.tmatesoft.svn.core.internal.io.dav.DAVConnection.performHttpRequest(DAVConnection.java:707)
	at org.tmatesoft.svn.core.internal.io.dav.DAVConnection.exchangeCapabilities(DAVConnection.java:627)
	at org.tmatesoft.svn.core.internal.io.dav.DAVConnection.open(DAVConnection.java:102)
	at org.tmatesoft.svn.core.internal.io.dav.DAVRepository.openConnection(DAVRepository.java:1020)
	at org.tmatesoft.svn.core.internal.io.dav.DAVRepository.getLatestRevision(DAVRepository.java:180)
	at org.tmatesoft.svn.core.internal.wc2.ng.SvnNgRepositoryAccess.getRevisionNumber(SvnNgRepositoryAccess.java:118)
	at org.tmatesoft.svn.core.internal.wc2.SvnRepositoryAccess.getLocations(SvnRepositoryAccess.java:148)
	at org.tmatesoft.svn.core.internal.wc2.ng.SvnNgRepositoryAccess.createRepositoryFor(SvnNgRepositoryAccess.java:45)
	at org.tmatesoft.svn.core.internal.wc2.remote.SvnRemoteLog.run(SvnRemoteLog.java:160)
	at org.tmatesoft.svn.core.internal.wc2.remote.SvnRemoteLog.run(SvnRemoteLog.java:35)
	at org.tmatesoft.svn.core.internal.wc2.SvnOperationRunner.run(SvnOperationRunner.java:20)
	at org.tmatesoft.svn.core.wc2.SvnOperationFactory.run(SvnOperationFactory.java:1238)
	at org.tmatesoft.svn.core.wc2.SvnOperation.run(SvnOperation.java:294)
	at org.tmatesoft.svn.core.wc.SVNLogClient.doLog(SVNLogClient.java:967)
	at org.tmatesoft.svn.core.wc.SVNLogClient.doLog(SVNLogClient.java:872)
	at hudson.scm.SubversionChangeLogBuilder.buildModule(SubversionChangeLogBuilder.java:166)
	... 11 more
Caused by: svn: E175002: OPTIONS /repos/asf/db/derby/code/branches/10.9 failed
	at org.tmatesoft.svn.core.SVNErrorMessage.create(SVNErrorMessage.java:208)
	at org.tmatesoft.svn.core.SVNErrorMessage.create(SVNErrorMessage.java:154)
	at org.tmatesoft.svn.core.SVNErrorMessage.create(SVNErrorMessage.java:97)
	... 30 more
Caused by: org.tmatesoft.svn.core.SVNException: svn: E175002: OPTIONS request failed on '/repos/asf/db/derby/code/branches/10.9'
svn: E175002: handshake alert:  unrecognized_name
	at org.tmatesoft.svn.core.internal.wc.SVNErrorManager.error(SVNErrorManager.java:64)
	at org.tmatesoft.svn.core.internal.wc.SVNErrorManager.error(SVNErrorManager.java:51)
	at org.tmatesoft.svn.core.internal.io.dav.http.HTTPConnection._request(HTTPConnection.java:777)
	at org.tmatesoft.svn.core.internal.io.dav.http.HTTPConnection.request(HTTPConnection.java:382)
	... 29 more
Caused by: svn: E175002: OPTIONS request failed on '/repos/asf/db/derby/code/branches/10.9'
	at org.tmatesoft.svn.core.SVNErrorMessage.create(SVNErrorMessage.java:208)
	at org.tmatesoft.svn.core.internal.io.dav.http.HTTPConnection._request(HTTPConnection.java:775)
	... 30 more
Caused by: svn: E175002: handshake alert:  unrecognized_name
	at org.tmatesoft.svn.core.SVNErrorMessage.create(SVNErrorMessage.java:109)
	at org.tmatesoft.svn.core.internal.io.dav.http.HTTPConnection._request(HTTPConnection.java:526)
	... 30 more
Caused by: javax.net.ssl.SSLProtocolException: handshake alert:  unrecognized_name
	at sun.security.ssl.ClientHandshaker.handshakeAlert(ClientHandshaker.java:1292)
	at sun.security.ssl.SSLSocketImpl.recvAlert(SSLSocketImpl.java:1954)
	at sun.security.ssl.SSLSocketImpl.readRecord(SSLSocketImpl.java:1077)
	at sun.security.ssl.SSLSocketImpl.performInitialHandshake(SSLSocketImpl.java:1312)
	at sun.security.ssl.SSLSocketImpl.writeRecord(SSLSocketImpl.java:702)
	at sun.security.ssl.AppOutputStream.write(AppOutputStream.java:122)
	at java.io.BufferedOutputStream.flushBuffer(BufferedOutputStream.java:82)
	at java.io.BufferedOutputStream.flush(BufferedOutputStream.java:140)
	at org.tmatesoft.svn.core.internal.io.dav.http.HTTPConnection.sendData(HTTPConnection.java:323)
	at org.tmatesoft.svn.core.internal.io.dav.http.HTTPRequest.dispatch(HTTPRequest.java:170)
	at org.tmatesoft.svn.core.internal.io.dav.http.HTTPConnection._request(HTTPConnection.java:480)
	... 30 more
Retrying after 10 seconds
Updating https://svn.eu.apache.org/repos/asf/db/derby/code/branches/10.9 at revision '2013-11-06T10:54:28.937
+0000'
At revision 1539305
hudson.util.IOException2: revision check failed on https://svn.eu.apache.org/repos/asf/db/derby/code/branches/10.9
	at hudson.scm.SubversionChangeLogBuilder.buildModule(SubversionChangeLogBuilder.java:178)
	at hudson.scm.SubversionChangeLogBuilder.run(SubversionChangeLogBuilder.java:113)
	at hudson.scm.SubversionSCM.calcChangeLog(SubversionSCM.java:654)
	at hudson.scm.SubversionSCM.checkout(SubversionSCM.java:815)
	at hudson.model.AbstractProject.checkout(AbstractProject.java:1411)
	at hudson.model.AbstractBuild$AbstractBuildExecution.defaultCheckout(AbstractBuild.java:652)
	at jenkins.scm.SCMCheckoutStrategy.checkout(SCMCheckoutStrategy.java:88)
	at hudson.model.AbstractBuild$AbstractBuildExecution.run(AbstractBuild.java:557)
	at hudson.model.Run.execute(Run.java:1665)
	at hudson.model.FreeStyleBuild.run(FreeStyleBuild.java:46)
	at hudson.model.ResourceController.execute(ResourceController.java:88)
	at hudson.model.Executor.run(Executor.java:230)
Caused by: org.tmatesoft.svn.core.SVNException: svn: E175002: OPTIONS /repos/asf/db/derby/code/branches/10.9
failed
	at org.tmatesoft.svn.core.internal.io.dav.http.HTTPConnection.request(HTTPConnection.java:388)
	at org.tmatesoft.svn.core.internal.io.dav.http.HTTPConnection.request(HTTPConnection.java:373)
	at org.tmatesoft.svn.core.internal.io.dav.http.HTTPConnection.request(HTTPConnection.java:361)
	at org.tmatesoft.svn.core.internal.io.dav.DAVConnection.performHttpRequest(DAVConnection.java:707)
	at org.tmatesoft.svn.core.internal.io.dav.DAVConnection.exchangeCapabilities(DAVConnection.java:627)
	at org.tmatesoft.svn.core.internal.io.dav.DAVConnection.open(DAVConnection.java:102)
	at org.tmatesoft.svn.core.internal.io.dav.DAVRepository.openConnection(DAVRepository.java:1020)
	at org.tmatesoft.svn.core.internal.io.dav.DAVRepository.getLatestRevision(DAVRepository.java:180)
	at org.tmatesoft.svn.core.internal.wc2.ng.SvnNgRepositoryAccess.getRevisionNumber(SvnNgRepositoryAccess.java:118)
	at org.tmatesoft.svn.core.internal.wc2.SvnRepositoryAccess.getLocations(SvnRepositoryAccess.java:148)
	at org.tmatesoft.svn.core.internal.wc2.ng.SvnNgRepositoryAccess.createRepositoryFor(SvnNgRepositoryAccess.java:45)
	at org.tmatesoft.svn.core.internal.wc2.remote.SvnRemoteLog.run(SvnRemoteLog.java:160)
	at org.tmatesoft.svn.core.internal.wc2.remote.SvnRemoteLog.run(SvnRemoteLog.java:35)
	at org.tmatesoft.svn.core.internal.wc2.SvnOperationRunner.run(SvnOperationRunner.java:20)
	at org.tmatesoft.svn.core.wc2.SvnOperationFactory.run(SvnOperationFactory.java:1238)
	at org.tmatesoft.svn.core.wc2.SvnOperation.run(SvnOperation.java:294)
	at org.tmatesoft.svn.core.wc.SVNLogClient.doLog(SVNLogClient.java:967)
	at org.tmatesoft.svn.core.wc.SVNLogClient.doLog(SVNLogClient.java:872)
	at hudson.scm.SubversionChangeLogBuilder.buildModule(SubversionChangeLogBuilder.java:166)
	... 11 more
Caused by: svn: E175002: OPTIONS /repos/asf/db/derby/code/branches/10.9 failed
	at org.tmatesoft.svn.core.SVNErrorMessage.create(SVNErrorMessage.java:208)
	at org.tmatesoft.svn.core.SVNErrorMessage.create(SVNErrorMessage.java:154)
	at org.tmatesoft.svn.core.SVNErrorMessage.create(SVNErrorMessage.java:97)
	... 30 more
Caused by: org.tmatesoft.svn.core.SVNException: svn: E175002: OPTIONS request failed on '/repos/asf/db/derby/code/branches/10.9'
svn: E175002: handshake alert:  unrecognized_name
	at org.tmatesoft.svn.core.internal.wc.SVNErrorManager.error(SVNErrorManager.java:64)
	at org.tmatesoft.svn.core.internal.wc.SVNErrorManager.error(SVNErrorManager.java:51)
	at org.tmatesoft.svn.core.internal.io.dav.http.HTTPConnection._request(HTTPConnection.java:777)
	at org.tmatesoft.svn.core.internal.io.dav.http.HTTPConnection.request(HTTPConnection.java:382)
	... 29 more
Caused by: svn: E175002: OPTIONS request failed on '/repos/asf/db/derby/code/branches/10.9'
	at org.tmatesoft.svn.core.SVNErrorMessage.create(SVNErrorMessage.java:208)
	at org.tmatesoft.svn.core.internal.io.dav.http.HTTPConnection._request(HTTPConnection.java:775)
	... 30 more
Caused by: svn: E175002: handshake alert:  unrecognized_name
	at org.tmatesoft.svn.core.SVNErrorMessage.create(SVNErrorMessage.java:109)
	at org.tmatesoft.svn.core.internal.io.dav.http.HTTPConnection._request(HTTPConnection.java:526)
	... 30 more
Caused by: javax.net.ssl.SSLProtocolException: handshake alert:  unrecognized_name
	at sun.security.ssl.ClientHandshaker.handshakeAlert(ClientHandshaker.java:1292)
	at sun.security.ssl.SSLSocketImpl.recvAlert(SSLSocketImpl.java:1954)
	at sun.security.ssl.SSLSocketImpl.readRecord(SSLSocketImpl.java:1077)
	at sun.security.ssl.SSLSocketImpl.performInitialHandshake(SSLSocketImpl.java:1312)
	at sun.security.ssl.SSLSocketImpl.writeRecord(SSLSocketImpl.java:702)
	at sun.security.ssl.AppOutputStream.write(AppOutputStream.java:122)
	at java.io.BufferedOutputStream.flushBuffer(BufferedOutputStream.java:82)
	at java.io.BufferedOutputStream.flush(BufferedOutputStream.java:140)
	at org.tmatesoft.svn.core.internal.io.dav.http.HTTPConnection.sendData(HTTPConnection.java:323)
	at org.tmatesoft.svn.core.internal.io.dav.http.HTTPRequest.dispatch(HTTPRequest.java:170)
	at org.tmatesoft.svn.core.internal.io.dav.http.HTTPConnection._request(HTTPConnection.java:480)
	... 30 more
[WARNINGS] Skipping publisher since build result is FAILURE

Mime
View raw message