db-derby-dev mailing list archives

Site index · List index
Message view « Date » · « Thread »
Top « Date » · « Thread »
From Apache Jenkins Server <jenk...@builds.apache.org>
Subject Build failed in Jenkins: Derby-branch-10.5 #219
Date Wed, 13 Nov 2013 02:32:42 GMT
See <https://builds.apache.org/job/Derby-branch-10.5/219/>

------------------------------------------
[...truncated 4831 lines...]
AU        plugins/eclipse/org.apache.derby.plugin.doc/topics/images/ij_commands.GIF
AU        plugins/eclipse/org.apache.derby.plugin.doc/topics/images/create_class.GIF
AU        plugins/eclipse/org.apache.derby.plugin.doc/topics/images/server_popup.gif
AU        plugins/eclipse/org.apache.derby.plugin.doc/topics/images/properties.gif
AU        plugins/eclipse/org.apache.derby.plugin.doc/topics/images/restaurant_editor.GIF
AU        plugins/eclipse/org.apache.derby.plugin.doc/topics/images/create_file.GIF
AU        plugins/eclipse/org.apache.derby.plugin.doc/topics/images/shutdown_success.gif
AU        plugins/eclipse/org.apache.derby.plugin.doc/topics/images/start_server_console.gif
AU        plugins/eclipse/org.apache.derby.plugin.doc/topics/images/add_nature.GIF
AU        plugins/eclipse/org.apache.derby.plugin.doc/topics/images/run_javaapp.GIF
AU        plugins/eclipse/org.apache.derby.plugin.doc/topics/images/sysinfo_start.GIF
AU        plugins/eclipse/org.apache.derby.plugin.doc/topics/images/stop_popup.gif
AU        plugins/eclipse/org.apache.derby.plugin.doc/topics/images/sysinfo_output.GIF
AU        plugins/eclipse/org.apache.derby.plugin.doc/topics/images/stop_server.GIF
AU        plugins/eclipse/org.apache.derby.plugin.doc/topics/images/create_restaurant.GIF
AU        plugins/eclipse/org.apache.derby.plugin.doc/topics/images/remove_nature.GIF
AU        plugins/eclipse/org.apache.derby.plugin.doc/topics/images/property_sheet.GIF
AU        plugins/eclipse/org.apache.derby.plugin.doc/topics/images/restaurant_script.GIF
AU        plugins/eclipse/org.apache.derby.plugin.doc/topics/images/completed_javaapp.GIF
AU        plugins/eclipse/org.apache.derby.plugin.doc/topics/images/new_class.GIF
AU        plugins/eclipse/org.apache.derby.plugin.doc/topics/images/start_ij.GIF
AU        plugins/eclipse/org.apache.derby.plugin.doc/topics/start_toc.html
AU        plugins/eclipse/org.apache.derby.plugin.doc/topics/nature_toc.html
AU        plugins/eclipse/org.apache.derby.plugin.doc/topics/derby_app.html
AU        plugins/eclipse/org.apache.derby.plugin.doc/topics/ij_toc.html
AU        plugins/eclipse/org.apache.derby.plugin.doc/topics/java_project.html
AU        plugins/eclipse/org.apache.derby.plugin.doc/topics/resources.html
AU        plugins/eclipse/org.apache.derby.plugin.doc/topics/remove_nature.html
AU        plugins/eclipse/org.apache.derby.plugin.doc/topics/server_toc.html
AU        plugins/eclipse/org.apache.derby.plugin.doc/topics/stop_server.html
AU        plugins/eclipse/org.apache.derby.plugin.doc/topics/start_server.html
AU        plugins/eclipse/org.apache.derby.plugin.doc/topics/ij2.html
A         plugins/eclipse/org.apache.derby.plugin.doc/LICENSE
AU        plugins/eclipse/org.apache.derby.plugin.doc/.project
AU        plugins/eclipse/org.apache.derby.plugin.doc/toc.xml
AU        plugins/eclipse/org.apache.derby.plugin.doc/build.properties
AU        plugins/eclipse/org.apache.derby.plugin.doc/plugin.xml
AU        LICENSE
AU        STATUS
 U        .
At revision 1541364
hudson.util.IOException2: revision check failed on https://svn.eu.apache.org/repos/asf/db/derby/code/branches/10.5
	at hudson.scm.SubversionChangeLogBuilder.buildModule(SubversionChangeLogBuilder.java:178)
	at hudson.scm.SubversionChangeLogBuilder.run(SubversionChangeLogBuilder.java:113)
	at hudson.scm.SubversionSCM.calcChangeLog(SubversionSCM.java:654)
	at hudson.scm.SubversionSCM.checkout(SubversionSCM.java:815)
	at hudson.model.AbstractProject.checkout(AbstractProject.java:1411)
	at hudson.model.AbstractBuild$AbstractBuildExecution.defaultCheckout(AbstractBuild.java:652)
	at jenkins.scm.SCMCheckoutStrategy.checkout(SCMCheckoutStrategy.java:88)
	at hudson.model.AbstractBuild$AbstractBuildExecution.run(AbstractBuild.java:557)
	at hudson.model.Run.execute(Run.java:1665)
	at hudson.model.FreeStyleBuild.run(FreeStyleBuild.java:46)
	at hudson.model.ResourceController.execute(ResourceController.java:88)
	at hudson.model.Executor.run(Executor.java:230)
Caused by: org.tmatesoft.svn.core.SVNException: svn: E175002: OPTIONS /repos/asf/db/derby/code/branches/10.5
failed
	at org.tmatesoft.svn.core.internal.io.dav.http.HTTPConnection.request(HTTPConnection.java:388)
	at org.tmatesoft.svn.core.internal.io.dav.http.HTTPConnection.request(HTTPConnection.java:373)
	at org.tmatesoft.svn.core.internal.io.dav.http.HTTPConnection.request(HTTPConnection.java:361)
	at org.tmatesoft.svn.core.internal.io.dav.DAVConnection.performHttpRequest(DAVConnection.java:707)
	at org.tmatesoft.svn.core.internal.io.dav.DAVConnection.exchangeCapabilities(DAVConnection.java:627)
	at org.tmatesoft.svn.core.internal.io.dav.DAVConnection.open(DAVConnection.java:102)
	at org.tmatesoft.svn.core.internal.io.dav.DAVRepository.openConnection(DAVRepository.java:1020)
	at org.tmatesoft.svn.core.internal.io.dav.DAVRepository.getLatestRevision(DAVRepository.java:180)
	at org.tmatesoft.svn.core.internal.wc2.ng.SvnNgRepositoryAccess.getRevisionNumber(SvnNgRepositoryAccess.java:118)
	at org.tmatesoft.svn.core.internal.wc2.SvnRepositoryAccess.getLocations(SvnRepositoryAccess.java:148)
	at org.tmatesoft.svn.core.internal.wc2.ng.SvnNgRepositoryAccess.createRepositoryFor(SvnNgRepositoryAccess.java:45)
	at org.tmatesoft.svn.core.internal.wc2.remote.SvnRemoteLog.run(SvnRemoteLog.java:160)
	at org.tmatesoft.svn.core.internal.wc2.remote.SvnRemoteLog.run(SvnRemoteLog.java:35)
	at org.tmatesoft.svn.core.internal.wc2.SvnOperationRunner.run(SvnOperationRunner.java:20)
	at org.tmatesoft.svn.core.wc2.SvnOperationFactory.run(SvnOperationFactory.java:1238)
	at org.tmatesoft.svn.core.wc2.SvnOperation.run(SvnOperation.java:294)
	at org.tmatesoft.svn.core.wc.SVNLogClient.doLog(SVNLogClient.java:967)
	at org.tmatesoft.svn.core.wc.SVNLogClient.doLog(SVNLogClient.java:872)
	at hudson.scm.SubversionChangeLogBuilder.buildModule(SubversionChangeLogBuilder.java:166)
	... 11 more
Caused by: svn: E175002: OPTIONS /repos/asf/db/derby/code/branches/10.5 failed
	at org.tmatesoft.svn.core.SVNErrorMessage.create(SVNErrorMessage.java:208)
	at org.tmatesoft.svn.core.SVNErrorMessage.create(SVNErrorMessage.java:154)
	at org.tmatesoft.svn.core.SVNErrorMessage.create(SVNErrorMessage.java:97)
	... 30 more
Caused by: org.tmatesoft.svn.core.SVNException: svn: E175002: OPTIONS request failed on '/repos/asf/db/derby/code/branches/10.5'
svn: E175002: handshake alert:  unrecognized_name
	at org.tmatesoft.svn.core.internal.wc.SVNErrorManager.error(SVNErrorManager.java:64)
	at org.tmatesoft.svn.core.internal.wc.SVNErrorManager.error(SVNErrorManager.java:51)
	at org.tmatesoft.svn.core.internal.io.dav.http.HTTPConnection._request(HTTPConnection.java:777)
	at org.tmatesoft.svn.core.internal.io.dav.http.HTTPConnection.request(HTTPConnection.java:382)
	... 29 more
Caused by: svn: E175002: OPTIONS request failed on '/repos/asf/db/derby/code/branches/10.5'
	at org.tmatesoft.svn.core.SVNErrorMessage.create(SVNErrorMessage.java:208)
	at org.tmatesoft.svn.core.internal.io.dav.http.HTTPConnection._request(HTTPConnection.java:775)
	... 30 more
Caused by: svn: E175002: handshake alert:  unrecognized_name
	at org.tmatesoft.svn.core.SVNErrorMessage.create(SVNErrorMessage.java:109)
	at org.tmatesoft.svn.core.internal.io.dav.http.HTTPConnection._request(HTTPConnection.java:526)
	... 30 more
Caused by: javax.net.ssl.SSLProtocolException: handshake alert:  unrecognized_name
	at sun.security.ssl.ClientHandshaker.handshakeAlert(ClientHandshaker.java:1292)
	at sun.security.ssl.SSLSocketImpl.recvAlert(SSLSocketImpl.java:1954)
	at sun.security.ssl.SSLSocketImpl.readRecord(SSLSocketImpl.java:1077)
	at sun.security.ssl.SSLSocketImpl.performInitialHandshake(SSLSocketImpl.java:1312)
	at sun.security.ssl.SSLSocketImpl.writeRecord(SSLSocketImpl.java:702)
	at sun.security.ssl.AppOutputStream.write(AppOutputStream.java:122)
	at java.io.BufferedOutputStream.flushBuffer(BufferedOutputStream.java:82)
	at java.io.BufferedOutputStream.flush(BufferedOutputStream.java:140)
	at org.tmatesoft.svn.core.internal.io.dav.http.HTTPConnection.sendData(HTTPConnection.java:323)
	at org.tmatesoft.svn.core.internal.io.dav.http.HTTPRequest.dispatch(HTTPRequest.java:170)
	at org.tmatesoft.svn.core.internal.io.dav.http.HTTPConnection._request(HTTPConnection.java:480)
	... 30 more
Retrying after 10 seconds
Updating https://svn.eu.apache.org/repos/asf/db/derby/code/branches/10.5 at revision '2013-11-13T02:31:01.781
+0000'
At revision 1541364
hudson.util.IOException2: revision check failed on https://svn.eu.apache.org/repos/asf/db/derby/code/branches/10.5
	at hudson.scm.SubversionChangeLogBuilder.buildModule(SubversionChangeLogBuilder.java:178)
	at hudson.scm.SubversionChangeLogBuilder.run(SubversionChangeLogBuilder.java:113)
	at hudson.scm.SubversionSCM.calcChangeLog(SubversionSCM.java:654)
	at hudson.scm.SubversionSCM.checkout(SubversionSCM.java:815)
	at hudson.model.AbstractProject.checkout(AbstractProject.java:1411)
	at hudson.model.AbstractBuild$AbstractBuildExecution.defaultCheckout(AbstractBuild.java:652)
	at jenkins.scm.SCMCheckoutStrategy.checkout(SCMCheckoutStrategy.java:88)
	at hudson.model.AbstractBuild$AbstractBuildExecution.run(AbstractBuild.java:557)
	at hudson.model.Run.execute(Run.java:1665)
	at hudson.model.FreeStyleBuild.run(FreeStyleBuild.java:46)
	at hudson.model.ResourceController.execute(ResourceController.java:88)
	at hudson.model.Executor.run(Executor.java:230)
Caused by: org.tmatesoft.svn.core.SVNException: svn: E175002: OPTIONS /repos/asf/db/derby/code/branches/10.5
failed
	at org.tmatesoft.svn.core.internal.io.dav.http.HTTPConnection.request(HTTPConnection.java:388)
	at org.tmatesoft.svn.core.internal.io.dav.http.HTTPConnection.request(HTTPConnection.java:373)
	at org.tmatesoft.svn.core.internal.io.dav.http.HTTPConnection.request(HTTPConnection.java:361)
	at org.tmatesoft.svn.core.internal.io.dav.DAVConnection.performHttpRequest(DAVConnection.java:707)
	at org.tmatesoft.svn.core.internal.io.dav.DAVConnection.exchangeCapabilities(DAVConnection.java:627)
	at org.tmatesoft.svn.core.internal.io.dav.DAVConnection.open(DAVConnection.java:102)
	at org.tmatesoft.svn.core.internal.io.dav.DAVRepository.openConnection(DAVRepository.java:1020)
	at org.tmatesoft.svn.core.internal.io.dav.DAVRepository.getLatestRevision(DAVRepository.java:180)
	at org.tmatesoft.svn.core.internal.wc2.ng.SvnNgRepositoryAccess.getRevisionNumber(SvnNgRepositoryAccess.java:118)
	at org.tmatesoft.svn.core.internal.wc2.SvnRepositoryAccess.getLocations(SvnRepositoryAccess.java:148)
	at org.tmatesoft.svn.core.internal.wc2.ng.SvnNgRepositoryAccess.createRepositoryFor(SvnNgRepositoryAccess.java:45)
	at org.tmatesoft.svn.core.internal.wc2.remote.SvnRemoteLog.run(SvnRemoteLog.java:160)
	at org.tmatesoft.svn.core.internal.wc2.remote.SvnRemoteLog.run(SvnRemoteLog.java:35)
	at org.tmatesoft.svn.core.internal.wc2.SvnOperationRunner.run(SvnOperationRunner.java:20)
	at org.tmatesoft.svn.core.wc2.SvnOperationFactory.run(SvnOperationFactory.java:1238)
	at org.tmatesoft.svn.core.wc2.SvnOperation.run(SvnOperation.java:294)
	at org.tmatesoft.svn.core.wc.SVNLogClient.doLog(SVNLogClient.java:967)
	at org.tmatesoft.svn.core.wc.SVNLogClient.doLog(SVNLogClient.java:872)
	at hudson.scm.SubversionChangeLogBuilder.buildModule(SubversionChangeLogBuilder.java:166)
	... 11 more
Caused by: svn: E175002: OPTIONS /repos/asf/db/derby/code/branches/10.5 failed
	at org.tmatesoft.svn.core.SVNErrorMessage.create(SVNErrorMessage.java:208)
	at org.tmatesoft.svn.core.SVNErrorMessage.create(SVNErrorMessage.java:154)
	at org.tmatesoft.svn.core.SVNErrorMessage.create(SVNErrorMessage.java:97)
	... 30 more
Caused by: org.tmatesoft.svn.core.SVNException: svn: E175002: OPTIONS request failed on '/repos/asf/db/derby/code/branches/10.5'
svn: E175002: handshake alert:  unrecognized_name
	at org.tmatesoft.svn.core.internal.wc.SVNErrorManager.error(SVNErrorManager.java:64)
	at org.tmatesoft.svn.core.internal.wc.SVNErrorManager.error(SVNErrorManager.java:51)
	at org.tmatesoft.svn.core.internal.io.dav.http.HTTPConnection._request(HTTPConnection.java:777)
	at org.tmatesoft.svn.core.internal.io.dav.http.HTTPConnection.request(HTTPConnection.java:382)
	... 29 more
Caused by: svn: E175002: OPTIONS request failed on '/repos/asf/db/derby/code/branches/10.5'
	at org.tmatesoft.svn.core.SVNErrorMessage.create(SVNErrorMessage.java:208)
	at org.tmatesoft.svn.core.internal.io.dav.http.HTTPConnection._request(HTTPConnection.java:775)
	... 30 more
Caused by: svn: E175002: handshake alert:  unrecognized_name
	at org.tmatesoft.svn.core.SVNErrorMessage.create(SVNErrorMessage.java:109)
	at org.tmatesoft.svn.core.internal.io.dav.http.HTTPConnection._request(HTTPConnection.java:526)
	... 30 more
Caused by: javax.net.ssl.SSLProtocolException: handshake alert:  unrecognized_name
	at sun.security.ssl.ClientHandshaker.handshakeAlert(ClientHandshaker.java:1292)
	at sun.security.ssl.SSLSocketImpl.recvAlert(SSLSocketImpl.java:1954)
	at sun.security.ssl.SSLSocketImpl.readRecord(SSLSocketImpl.java:1077)
	at sun.security.ssl.SSLSocketImpl.performInitialHandshake(SSLSocketImpl.java:1312)
	at sun.security.ssl.SSLSocketImpl.writeRecord(SSLSocketImpl.java:702)
	at sun.security.ssl.AppOutputStream.write(AppOutputStream.java:122)
	at java.io.BufferedOutputStream.flushBuffer(BufferedOutputStream.java:82)
	at java.io.BufferedOutputStream.flush(BufferedOutputStream.java:140)
	at org.tmatesoft.svn.core.internal.io.dav.http.HTTPConnection.sendData(HTTPConnection.java:323)
	at org.tmatesoft.svn.core.internal.io.dav.http.HTTPRequest.dispatch(HTTPRequest.java:170)
	at org.tmatesoft.svn.core.internal.io.dav.http.HTTPConnection._request(HTTPConnection.java:480)
	... 30 more
Retrying after 10 seconds
Updating https://svn.eu.apache.org/repos/asf/db/derby/code/branches/10.5 at revision '2013-11-13T02:31:01.781
+0000'
At revision 1541364
hudson.util.IOException2: revision check failed on https://svn.eu.apache.org/repos/asf/db/derby/code/branches/10.5
	at hudson.scm.SubversionChangeLogBuilder.buildModule(SubversionChangeLogBuilder.java:178)
	at hudson.scm.SubversionChangeLogBuilder.run(SubversionChangeLogBuilder.java:113)
	at hudson.scm.SubversionSCM.calcChangeLog(SubversionSCM.java:654)
	at hudson.scm.SubversionSCM.checkout(SubversionSCM.java:815)
	at hudson.model.AbstractProject.checkout(AbstractProject.java:1411)
	at hudson.model.AbstractBuild$AbstractBuildExecution.defaultCheckout(AbstractBuild.java:652)
	at jenkins.scm.SCMCheckoutStrategy.checkout(SCMCheckoutStrategy.java:88)
	at hudson.model.AbstractBuild$AbstractBuildExecution.run(AbstractBuild.java:557)
	at hudson.model.Run.execute(Run.java:1665)
	at hudson.model.FreeStyleBuild.run(FreeStyleBuild.java:46)
	at hudson.model.ResourceController.execute(ResourceController.java:88)
	at hudson.model.Executor.run(Executor.java:230)
Caused by: org.tmatesoft.svn.core.SVNException: svn: E175002: OPTIONS /repos/asf/db/derby/code/branches/10.5
failed
	at org.tmatesoft.svn.core.internal.io.dav.http.HTTPConnection.request(HTTPConnection.java:388)
	at org.tmatesoft.svn.core.internal.io.dav.http.HTTPConnection.request(HTTPConnection.java:373)
	at org.tmatesoft.svn.core.internal.io.dav.http.HTTPConnection.request(HTTPConnection.java:361)
	at org.tmatesoft.svn.core.internal.io.dav.DAVConnection.performHttpRequest(DAVConnection.java:707)
	at org.tmatesoft.svn.core.internal.io.dav.DAVConnection.exchangeCapabilities(DAVConnection.java:627)
	at org.tmatesoft.svn.core.internal.io.dav.DAVConnection.open(DAVConnection.java:102)
	at org.tmatesoft.svn.core.internal.io.dav.DAVRepository.openConnection(DAVRepository.java:1020)
	at org.tmatesoft.svn.core.internal.io.dav.DAVRepository.getLatestRevision(DAVRepository.java:180)
	at org.tmatesoft.svn.core.internal.wc2.ng.SvnNgRepositoryAccess.getRevisionNumber(SvnNgRepositoryAccess.java:118)
	at org.tmatesoft.svn.core.internal.wc2.SvnRepositoryAccess.getLocations(SvnRepositoryAccess.java:148)
	at org.tmatesoft.svn.core.internal.wc2.ng.SvnNgRepositoryAccess.createRepositoryFor(SvnNgRepositoryAccess.java:45)
	at org.tmatesoft.svn.core.internal.wc2.remote.SvnRemoteLog.run(SvnRemoteLog.java:160)
	at org.tmatesoft.svn.core.internal.wc2.remote.SvnRemoteLog.run(SvnRemoteLog.java:35)
	at org.tmatesoft.svn.core.internal.wc2.SvnOperationRunner.run(SvnOperationRunner.java:20)
	at org.tmatesoft.svn.core.wc2.SvnOperationFactory.run(SvnOperationFactory.java:1238)
	at org.tmatesoft.svn.core.wc2.SvnOperation.run(SvnOperation.java:294)
	at org.tmatesoft.svn.core.wc.SVNLogClient.doLog(SVNLogClient.java:967)
	at org.tmatesoft.svn.core.wc.SVNLogClient.doLog(SVNLogClient.java:872)
	at hudson.scm.SubversionChangeLogBuilder.buildModule(SubversionChangeLogBuilder.java:166)
	... 11 more
Caused by: svn: E175002: OPTIONS /repos/asf/db/derby/code/branches/10.5 failed
	at org.tmatesoft.svn.core.SVNErrorMessage.create(SVNErrorMessage.java:208)
	at org.tmatesoft.svn.core.SVNErrorMessage.create(SVNErrorMessage.java:154)
	at org.tmatesoft.svn.core.SVNErrorMessage.create(SVNErrorMessage.java:97)
	... 30 more
Caused by: org.tmatesoft.svn.core.SVNException: svn: E175002: OPTIONS request failed on '/repos/asf/db/derby/code/branches/10.5'
svn: E175002: handshake alert:  unrecognized_name
	at org.tmatesoft.svn.core.internal.wc.SVNErrorManager.error(SVNErrorManager.java:64)
	at org.tmatesoft.svn.core.internal.wc.SVNErrorManager.error(SVNErrorManager.java:51)
	at org.tmatesoft.svn.core.internal.io.dav.http.HTTPConnection._request(HTTPConnection.java:777)
	at org.tmatesoft.svn.core.internal.io.dav.http.HTTPConnection.request(HTTPConnection.java:382)
	... 29 more
Caused by: svn: E175002: OPTIONS request failed on '/repos/asf/db/derby/code/branches/10.5'
	at org.tmatesoft.svn.core.SVNErrorMessage.create(SVNErrorMessage.java:208)
	at org.tmatesoft.svn.core.internal.io.dav.http.HTTPConnection._request(HTTPConnection.java:775)
	... 30 more
Caused by: svn: E175002: handshake alert:  unrecognized_name
	at org.tmatesoft.svn.core.SVNErrorMessage.create(SVNErrorMessage.java:109)
	at org.tmatesoft.svn.core.internal.io.dav.http.HTTPConnection._request(HTTPConnection.java:526)
	... 30 more
Caused by: javax.net.ssl.SSLProtocolException: handshake alert:  unrecognized_name
	at sun.security.ssl.ClientHandshaker.handshakeAlert(ClientHandshaker.java:1292)
	at sun.security.ssl.SSLSocketImpl.recvAlert(SSLSocketImpl.java:1954)
	at sun.security.ssl.SSLSocketImpl.readRecord(SSLSocketImpl.java:1077)
	at sun.security.ssl.SSLSocketImpl.performInitialHandshake(SSLSocketImpl.java:1312)
	at sun.security.ssl.SSLSocketImpl.writeRecord(SSLSocketImpl.java:702)
	at sun.security.ssl.AppOutputStream.write(AppOutputStream.java:122)
	at java.io.BufferedOutputStream.flushBuffer(BufferedOutputStream.java:82)
	at java.io.BufferedOutputStream.flush(BufferedOutputStream.java:140)
	at org.tmatesoft.svn.core.internal.io.dav.http.HTTPConnection.sendData(HTTPConnection.java:323)
	at org.tmatesoft.svn.core.internal.io.dav.http.HTTPRequest.dispatch(HTTPRequest.java:170)
	at org.tmatesoft.svn.core.internal.io.dav.http.HTTPConnection._request(HTTPConnection.java:480)
	... 30 more
[WARNINGS] Skipping publisher since build result is FAILURE

Mime
View raw message