db-derby-dev mailing list archives

Site index · List index
Message view « Date » · « Thread »
Top « Date » · « Thread »
From "Mamta A. Satoor (JIRA)" <j...@apache.org>
Subject [jira] [Commented] (DERBY-6280) test failure in SetQueryTimeoutTest ComparisonFailure: Output at line 16 expected:<Test[ing that PreparedStatement remembers timeout.]> but was:<Test[ SetQueryTimeoutTest FAILED]>
Date Fri, 13 Sep 2013 18:15:53 GMT

    [ https://issues.apache.org/jira/browse/DERBY-6280?page=com.atlassian.jira.plugin.system.issuetabpanels:comment-tabpanel&focusedCommentId=13766748#comment-13766748
] 

Mamta A. Satoor commented on DERBY-6280:
----------------------------------------

Failed on 10.10 codeline(revision 1522131) with IBM jdk 1.7
http://people.apache.org/~myrnavl/derby_test_results/v10_10/windows/testlog/ibm17/1522131-suites.All_diff.txt
                
> test failure in SetQueryTimeoutTest ComparisonFailure: Output at line 16 expected:<Test[ing
that PreparedStatement remembers timeout.]> but was:<Test[ SetQueryTimeoutTest FAILED]>
> -----------------------------------------------------------------------------------------------------------------------------------------------------------------------------------
>
>                 Key: DERBY-6280
>                 URL: https://issues.apache.org/jira/browse/DERBY-6280
>             Project: Derby
>          Issue Type: Bug
>          Components: Test
>    Affects Versions: 10.10.1.3
>         Environment: win(on vmware), ibm16
>            Reporter: Myrna van Lunteren
>
> build:
> 10.10.1.3 - (1495273)
> see: http://people.apache.org/~myrnavl/derby_test_results/v10_10/windows/testlog/ibm16/1495273-suites.All_diff.txt
> stack trace:
> 1) SetQueryTimeoutTest(org.apache.derbyTesting.functionTests.tests.jdbcapi.JDBCHarnessJavaTest)junit.framework.ComparisonFailure:
Output at line 16 expected:<Test[ing that PreparedStatement remembers timeout.]> but
was:<Test[ SetQueryTimeoutTest FAILED]>
> 	at org.apache.derbyTesting.functionTests.util.CanonTestCase.compareCanon(CanonTestCase.java:109)
> 	at org.apache.derbyTesting.functionTests.util.HarnessJavaTest.runTest(HarnessJavaTest.java:91)
> 	at org.apache.derbyTesting.junit.BaseTestCase.runBare(BaseTestCase.java:117)
> 	at org.apache.derbyTesting.junit.BaseJDBCTestCase.runBareOverridable(BaseJDBCTestCase.java:442)
> 	at org.apache.derbyTesting.junit.BaseJDBCTestCase.runBare(BaseJDBCTestCase.java:459)
> 	at junit.extensions.TestDecorator.basicRun(TestDecorator.java:24)
> 	at junit.extensions.TestSetup$1.protect(TestSetup.java:21)
> 	at junit.extensions.TestSetup.run(TestSetup.java:25)
> 	at junit.extensions.TestDecorator.basicRun(TestDecorator.java:24)
> 	at junit.extensions.TestSetup$1.protect(TestSetup.java:21)
> 	at junit.extensions.TestSetup.run(TestSetup.java:25)
> 	at org.apache.derbyTesting.junit.BaseTestSetup.run(BaseTestSetup.java:57)
> 	at junit.extensions.TestDecorator.basicRun(TestDecorator.java:24)
> 	at junit.extensions.TestSetup$1.protect(TestSetup.java:21)
> 	at junit.extensions.TestSetup.run(TestSetup.java:25)
> 	at org.apache.derbyTesting.junit.BaseTestSetup.run(BaseTestSetup.java:57)

--
This message is automatically generated by JIRA.
If you think it was sent incorrectly, please contact your JIRA administrators
For more information on JIRA, see: http://www.atlassian.com/software/jira

Mime
View raw message