db-derby-dev mailing list archives: June 2013

Site index · List index
Message list« Previous · 1 · 2 · 3 · 4 · 5 · 6 · 7 · 8 · 9 · 10 · 11 · 12 · 13 · 14 · Next »Thread · Author · Date
[jira] [Updated] (DERBY-6130) SYSALIASES.SYSTEMALIAS is always false, even for system-supplied routines
Dag H. Wanvik (JIRA)   [jira] [Updated] (DERBY-6130) SYSALIASES.SYSTEMALIAS is always false, even for system-supplied routines Wed, 19 Jun, 07:19
[jira] [Updated] (DERBY-6115) Restricted Table Function initScan() does not pass complex OR expressions
Dag H. Wanvik (JIRA)   [jira] [Updated] (DERBY-6115) Restricted Table Function initScan() does not pass complex OR expressions Wed, 19 Jun, 07:21
Dag H. Wanvik (JIRA)   [jira] [Updated] (DERBY-6115) Restricted Table Function initScan() does not pass complex OR expressions Wed, 19 Jun, 07:21
Dag H. Wanvik (JIRA)   [jira] [Updated] (DERBY-6115) Restricted Table Function initScan() does not pass complex OR expressions Wed, 19 Jun, 07:33
[jira] [Updated] (DERBY-6111) OutOfMemoryError using CREATE INDEX on large tables
Dag H. Wanvik (JIRA)   [jira] [Updated] (DERBY-6111) OutOfMemoryError using CREATE INDEX on large tables Wed, 19 Jun, 07:35
[jira] [Commented] (DERBY-6099) Some DataTypeDescriptor methods may be missing Blob and Clob
Dag H. Wanvik (JIRA)   [jira] [Commented] (DERBY-6099) Some DataTypeDescriptor methods may be missing Blob and Clob Wed, 19 Jun, 07:37
Dag H. Wanvik (JIRA)   [jira] [Updated] (DERBY-6099) Some DataTypeDescriptor methods may be missing Blob and Clob Wed, 19 Jun, 07:39
Dag H. Wanvik (JIRA)   [jira] [Updated] (DERBY-6099) Some DataTypeDescriptor methods may be missing Blob and Clob Wed, 19 Jun, 07:39
Kathey Marsden (JIRA)   [jira] [Commented] (DERBY-6099) Some DataTypeDescriptor methods may be missing Blob and Clob Wed, 19 Jun, 20:30
[jira] [Updated] (DERBY-6080) Cast to same type changes result with IN subquery
Dag H. Wanvik (JIRA)   [jira] [Updated] (DERBY-6080) Cast to same type changes result with IN subquery Wed, 19 Jun, 07:41
Dag H. Wanvik (JIRA)   [jira] [Updated] (DERBY-6080) Cast to same type changes result with IN subquery Wed, 19 Jun, 07:49
Dag H. Wanvik (JIRA)   [jira] [Updated] (DERBY-6080) Cast to same type changes result with IN subquery Wed, 19 Jun, 07:49
[jira] [Commented] (DERBY-6048) Derby database would not start after machine crash
Dag H. Wanvik (JIRA)   [jira] [Commented] (DERBY-6048) Derby database would not start after machine crash Wed, 19 Jun, 07:53
Dag H. Wanvik (JIRA)   [jira] [Resolved] (DERBY-6048) Derby database would not start after machine crash Wed, 19 Jun, 07:53
Dag H. Wanvik (JIRA)   [jira] [Updated] (DERBY-6048) Derby database would not start after machine crash Wed, 19 Jun, 07:55
[jira] [Updated] (DERBY-6036) If you wrap a SELECT * view around a table, all of the columns are read from the base row even when you SELECT only a subset of the view columns.
Dag H. Wanvik (JIRA)   [jira] [Updated] (DERBY-6036) If you wrap a SELECT * view around a table, all of the columns are read from the base row even when you SELECT only a subset of the view columns. Wed, 19 Jun, 07:57
Dag H. Wanvik (JIRA)   [jira] [Commented] (DERBY-6036) If you wrap a SELECT * view around a table, all of the columns are read from the base row even when you SELECT only a subset of the view columns. Wed, 19 Jun, 07:59
[jira] [Updated] (DERBY-6035) Client and embedded drivers return different SQL state for unregistered parameter
Dag H. Wanvik (JIRA)   [jira] [Updated] (DERBY-6035) Client and embedded drivers return different SQL state for unregistered parameter Wed, 19 Jun, 08:03
Dag H. Wanvik (JIRA)   [jira] [Updated] (DERBY-6035) Client and embedded drivers return different SQL state for unregistered parameter Wed, 19 Jun, 08:18
[jira] [Updated] (DERBY-6032) Concatenation operator confuses collation
Dag H. Wanvik (JIRA)   [jira] [Updated] (DERBY-6032) Concatenation operator confuses collation Wed, 19 Jun, 08:28
[jira] [Updated] (DERBY-6029) ClassCastException or assert when mixing system tables and user tables in LIKE ... ESCAPE
Dag H. Wanvik (JIRA)   [jira] [Updated] (DERBY-6029) ClassCastException or assert when mixing system tables and user tables in LIKE ... ESCAPE Wed, 19 Jun, 08:34
[jira] [Updated] (DERBY-6026) NullPointerException when calling string function in predicate with territory based collation
Dag H. Wanvik (JIRA)   [jira] [Updated] (DERBY-6026) NullPointerException when calling string function in predicate with territory based collation Wed, 19 Jun, 08:38
[jira] [Updated] (DERBY-6025) Wrong results with IN lists and indexes in territory based collation
Dag H. Wanvik (JIRA)   [jira] [Updated] (DERBY-6025) Wrong results with IN lists and indexes in territory based collation Wed, 19 Jun, 09:36
Dag H. Wanvik (JIRA)   [jira] [Updated] (DERBY-6025) Wrong results with IN lists and indexes in territory based collation Wed, 19 Jun, 09:36
[jira] [Updated] (DERBY-6024) Incorrect handling of NULL in IN lists
Dag H. Wanvik (JIRA)   [jira] [Updated] (DERBY-6024) Incorrect handling of NULL in IN lists Wed, 19 Jun, 09:44
[jira] [Updated] (DERBY-6013) Assert failure with ORDER BY in UNION used in sub-query
Dag H. Wanvik (JIRA)   [jira] [Updated] (DERBY-6013) Assert failure with ORDER BY in UNION used in sub-query Wed, 19 Jun, 10:15
[jira] [Updated] (DERBY-5959) Territory-based collation is not robust against changes in the collation rules
Dag H. Wanvik (JIRA)   [jira] [Updated] (DERBY-5959) Territory-based collation is not robust against changes in the collation rules Wed, 19 Jun, 10:19
ingemar.ab...@oracle.com [Java DB - testing] Success continuous trunk (rev 1494482) Wed, 19 Jun, 11:01
ingemar.ab...@oracle.com [Java DB - testing] Success continuous trunk (rev 1494541) Wed, 19 Jun, 14:21
[jira] [Updated] (DERBY-6222) add release note for 10.11 noting that using a JVM previous to jdk1.6 will not work
Mike Matrigali (JIRA)   [jira] [Updated] (DERBY-6222) add release note for 10.11 noting that using a JVM previous to jdk1.6 will not work Wed, 19 Jun, 17:14
[jira] [Closed] (DERBY-6181) fix AutoloadTest to support running concurrently when different base ports are specified.
Mike Matrigali (JIRA)   [jira] [Closed] (DERBY-6181) fix AutoloadTest to support running concurrently when different base ports are specified. Wed, 19 Jun, 17:16
[jira] [Closed] (DERBY-6154) add non-order by cases to the BlobClob4BlobTest
Mike Matrigali (JIRA)   [jira] [Closed] (DERBY-6154) add non-order by cases to the BlobClob4BlobTest Wed, 19 Jun, 17:16
[jira] [Closed] (DERBY-6178) AutoloadTest does not proprogate original jvm -D flags to spawned JVM, leading to LAB regression test failures
Mike Matrigali (JIRA)   [jira] [Closed] (DERBY-6178) AutoloadTest does not proprogate original jvm -D flags to spawned JVM, leading to LAB regression test failures Wed, 19 Jun, 17:16
[jira] [Closed] (DERBY-6144) nightly regression test failure, intermittent error : testStatisticsCorrectness(org.apache.derbyTesting.functionTests.tests.store.AutomaticIndexStatisticsTest)junit.framework.AssertionFailedError
Mike Matrigali (JIRA)   [jira] [Closed] (DERBY-6144) nightly regression test failure, intermittent error : testStatisticsCorrectness(org.apache.derbyTesting.functionTests.tests.store.AutomaticIndexStatisticsTest)junit.framework.AssertionFailedError Wed, 19 Jun, 17:16
[jira] [Closed] (DERBY-6084) org.apache.derbyTesting.functionTests.tests.multi.StressMultiTestjava.security.AccessControlException: Access denied (java.lang.RuntimePermission modifyThread) cascades to 38 errors and 674 failures in nightly test run against ibm16
Mike Matrigali (JIRA)   [jira] [Closed] (DERBY-6084) org.apache.derbyTesting.functionTests.tests.multi.StressMultiTestjava.security.AccessControlException: Access denied (java.lang.RuntimePermission modifyThread) cascades to 38 errors and 674 failures in nightly test run against ibm16 Wed, 19 Jun, 17:18
[jira] [Closed] (DERBY-6079) 100's of errors in nightly test run on weme after jacoco property/priviledges checkin
Mike Matrigali (JIRA)   [jira] [Closed] (DERBY-6079) 100's of errors in nightly test run on weme after jacoco property/priviledges checkin Wed, 19 Jun, 17:18
[jira] [Closed] (DERBY-5975) intermittent nightly test failure across releases in Derby5937SlaveShutdownTest.testSlaveFailoverLeak
Mike Matrigali (JIRA)   [jira] [Closed] (DERBY-5975) intermittent nightly test failure across releases in Derby5937SlaveShutdownTest.testSlaveFailoverLeak Wed, 19 Jun, 17:18
[jira] [Closed] (DERBY-5667) testReadCommitted(org.apache.derbyTesting.functionTests.tests.store.UpdateLocksTest)junit.framework.AssertionFailedError: Missing rows in ResultSet
Mike Matrigali (JIRA)   [jira] [Closed] (DERBY-5667) testReadCommitted(org.apache.derbyTesting.functionTests.tests.store.UpdateLocksTest)junit.framework.AssertionFailedError: Missing rows in ResultSet Wed, 19 Jun, 17:18
[jira] [Closed] (DERBY-5670) multiple failures in AutoloadTest, in nightly regression test run
Mike Matrigali (JIRA)   [jira] [Closed] (DERBY-5670) multiple failures in AutoloadTest, in nightly regression test run Wed, 19 Jun, 17:18
[jira] [Closed] (DERBY-5666) nightly suite error in NativeAuthenticationServiceTest : Database restoration unexpectedly failed.
Mike Matrigali (JIRA)   [jira] [Closed] (DERBY-5666) nightly suite error in NativeAuthenticationServiceTest : Database restoration unexpectedly failed. Wed, 19 Jun, 17:18
[jira] [Closed] (DERBY-5624) System can run out of stack space while processing DropOnCommit requests.
Mike Matrigali (JIRA)   [jira] [Closed] (DERBY-5624) System can run out of stack space while processing DropOnCommit requests. Wed, 19 Jun, 17:20
[jira] [Closed] (DERBY-5665) nightly regression test failure in rollForwardBackup: ERROR XSRS4: Error renaming file (during backup) from extinout\mybackup\wombat to extinout\mybackup\wombat.OLD.
Mike Matrigali (JIRA)   [jira] [Closed] (DERBY-5665) nightly regression test failure in rollForwardBackup: ERROR XSRS4: Error renaming file (during backup) from extinout\mybackup\wombat to extinout\mybackup\wombat.OLD. Wed, 19 Jun, 17:20
[jira] [Closed] (DERBY-4577) An expanding update fails with an nospc.U error.
Mike Matrigali (JIRA)   [jira] [Closed] (DERBY-4577) An expanding update fails with an nospc.U error. Wed, 19 Jun, 17:20
[jira] [Closed] (DERBY-5279) test5DeleteBeforeTriggerNoReferencingClause fails in nightly testing
Mike Matrigali (JIRA)   [jira] [Closed] (DERBY-5279) test5DeleteBeforeTriggerNoReferencingClause fails in nightly testing Wed, 19 Jun, 17:20
[jira] [Closed] (DERBY-5574) encryption test in encryption nightly suite test fails with ERROR XBM0S: Unable to rename file error
Mike Matrigali (JIRA)   [jira] [Closed] (DERBY-5574) encryption test in encryption nightly suite test fails with ERROR XBM0S: Unable to rename file error Wed, 19 Jun, 17:20
[jira] [Closed] (DERBY-5573) nightly test failure, encryptParams failed when it found directory already exists.
Mike Matrigali (JIRA)   [jira] [Closed] (DERBY-5573) nightly test failure, encryptParams failed when it found directory already exists. Wed, 19 Jun, 17:20
[jira] [Closed] (DERBY-4729) add more information to the XACT_PROTOCOL_VIOLATION returned from store.
Mike Matrigali (JIRA)   [jira] [Closed] (DERBY-4729) add more information to the XACT_PROTOCOL_VIOLATION returned from store. Wed, 19 Jun, 17:20
[jira] [Closed] (DERBY-5575) testImportExportProcedures(org.apache.derbyTesting.functionTests.tests.tools.ImportExportProcedureTest)java.sql.SQLException: An IOException occurred while writing data to the file.
Mike Matrigali (JIRA)   [jira] [Closed] (DERBY-5575) testImportExportProcedures(org.apache.derbyTesting.functionTests.tests.tools.ImportExportProcedureTest)java.sql.SQLException: An IOException occurred while writing data to the file. Wed, 19 Jun, 17:20
[jira] [Closed] (DERBY-2699) performance of like in territory based collation databases may be improved by changing way collation elements are calculated.
Mike Matrigali (JIRA)   [jira] [Closed] (DERBY-2699) performance of like in territory based collation databases may be improved by changing way collation elements are calculated. Wed, 19 Jun, 17:22
[jira] [Updated] (DERBY-5686) multiple intermittent errors in nightly tests during DriverMgrAuthenticationTest test. reason: An SQL data change is not permitted for a read-only connection, user or database.
Mike Matrigali (JIRA)   [jira] [Updated] (DERBY-5686) multiple intermittent errors in nightly tests during DriverMgrAuthenticationTest test. reason: An SQL data change is not permitted for a read-only connection, user or database. Wed, 19 Jun, 17:24
Fwd: Apache Derby - Improvising for intelligent querying
Madushanka Fonseka   Fwd: Apache Derby - Improvising for intelligent querying Wed, 19 Jun, 19:58
Madushanka Fonseka     Fwd: Apache Derby - Improvising for intelligent querying Wed, 19 Jun, 20:00
Rick Hillegas       Re: Fwd: Apache Derby - Improvising for intelligent querying Thu, 20 Jun, 14:34
Madushanka Fonseka         Re: Fwd: Apache Derby - Improvising for intelligent querying Thu, 20 Jun, 16:12
ingemar.ab...@oracle.com [Java DB - testing] Success nightly trunk (rev 1494541) Thu, 20 Jun, 00:53
Message list« Previous · 1 · 2 · 3 · 4 · 5 · 6 · 7 · 8 · 9 · 10 · 11 · 12 · 13 · 14 · Next »Thread · Author · Date
Box list
Dec 2014169
Nov 2014175
Oct 2014424
Sep 2014531
Aug 2014659
Jul 2014570
Jun 2014712
May 2014698
Apr 2014464
Mar 2014895
Feb 2014630
Jan 2014475
Dec 2013329
Nov 2013524
Oct 2013875
Sep 2013562
Aug 2013618
Jul 2013657
Jun 20131166
May 2013788
Apr 20131185
Mar 2013588
Feb 2013664
Jan 2013538
Dec 2012331
Nov 2012446
Oct 2012636
Sep 2012663
Aug 2012384
Jul 2012481
Jun 2012586
May 2012900
Apr 2012709
Mar 2012767
Feb 2012897
Jan 2012391
Dec 2011478
Nov 2011444
Oct 2011576
Sep 2011744
Aug 2011684
Jul 2011722
Jun 2011804
May 2011605
Apr 2011574
Mar 20111193
Feb 20111393
Jan 2011834
Dec 2010535
Nov 2010595
Oct 2010703
Sep 2010673
Aug 2010657
Jul 2010848
Jun 2010929
May 2010709
Apr 2010885
Mar 2010673
Feb 2010646
Jan 2010638
Dec 2009566
Nov 2009660
Oct 2009604
Sep 2009505
Aug 2009921
Jul 20091312
Jun 20091035
May 2009835
Apr 20091088
Mar 2009884
Feb 2009541
Jan 2009692
Dec 2008522
Nov 2008616
Oct 2008723
Sep 2008455
Aug 2008754
Jul 2008988
Jun 2008871
May 2008842
Apr 20081384
Mar 20081904
Feb 20082074
Jan 20081539
Dec 2007852
Nov 20071273
Oct 20071391
Sep 2007911
Aug 2007908
Jul 20071492
Jun 20072222
May 20072295
Apr 20071394
Mar 20072200
Feb 20071383
Jan 20071360
Dec 20061026
Nov 20061413
Oct 20061324
Sep 20062319
Aug 20063287
Jul 20062434
Jun 20061712
May 20061602
Apr 20061694
Mar 20061985
Feb 20062535
Jan 20061640
Dec 2005741
Nov 20051157
Oct 20051185
Sep 2005783
Aug 2005896
Jul 2005652
Jun 20051494
May 20051323
Apr 2005684
Mar 2005612
Feb 2005351
Jan 2005438
Dec 2004435
Nov 2004274
Oct 2004281
Sep 2004388
Aug 2004160