db-derby-dev mailing list archives: June 2013

Site index · List index
Message list« Previous · 1 · 2 · 3 · 4 · 5 · 6 · 7 · 8 · 9 · 10 · 11 · 12 · 13 · 14 · Next »Thread · Author · Date
[jira] [Updated] (DERBY-534) Support use of the WHEN clause in CREATE TRIGGER statements
Mamta A. Satoor (JIRA)   [jira] [Updated] (DERBY-534) Support use of the WHEN clause in CREATE TRIGGER statements Tue, 25 Jun, 15:22
[jira] [Updated] (DERBY-472) Full Text Indexing / Full Text Search
Mamta A. Satoor (JIRA)   [jira] [Updated] (DERBY-472) Full Text Indexing / Full Text Search Tue, 25 Jun, 15:24
[jira] [Updated] (DERBY-455) Add support for creating index on expressions
Mamta A. Satoor (JIRA)   [jira] [Updated] (DERBY-455) Add support for creating index on expressions Tue, 25 Jun, 15:26
[jira] [Updated] (DERBY-362) Some of the DDL checks to prevent incorrect temporary table use is incorrect. These may incorrectly stop access to valid permanant tables in SESSION schema.
Mamta A. Satoor (JIRA)   [jira] [Updated] (DERBY-362) Some of the DDL checks to prevent incorrect temporary table use is incorrect. These may incorrectly stop access to valid permanant tables in SESSION schema. Tue, 25 Jun, 15:26
[jira] [Updated] (DERBY-338) Move checks for referential constraints from DDL execution time to DML execution time
Mamta A. Satoor (JIRA)   [jira] [Updated] (DERBY-338) Move checks for referential constraints from DDL execution time to DML execution time Tue, 25 Jun, 15:28
[jira] [Updated] (DERBY-252) polishing up idea of default value including auto increment of a column in table
Mamta A. Satoor (JIRA)   [jira] [Updated] (DERBY-252) polishing up idea of default value including auto increment of a column in table Tue, 25 Jun, 15:28
[jira] [Updated] (DERBY-152) Implement COMMIT SQL Statement
Mamta A. Satoor (JIRA)   [jira] [Updated] (DERBY-152) Implement COMMIT SQL Statement Tue, 25 Jun, 15:28
[jira] [Updated] (DERBY-11) Recursive SQL and WITH A(col list) as (Select col list From Table List) Support.
Mamta A. Satoor (JIRA)   [jira] [Updated] (DERBY-11) Recursive SQL and WITH A(col list) as (Select col list From Table List) Support. Tue, 25 Jun, 15:30
[jira] [Resolved] (DERBY-5110) intermittent test failure in testInvalidLDAPServerConnectionError
Myrna van Lunteren (JIRA)   [jira] [Resolved] (DERBY-5110) intermittent test failure in testInvalidLDAPServerConnectionError Tue, 25 Jun, 15:46
ingemar.ab...@oracle.com [Java DB - testing] Success continuous 10.10 (rev 1496455) Tue, 25 Jun, 16:02
ingemar.ab...@oracle.com [Java DB - testing] Success continuous trunk (rev 1496449) Tue, 25 Jun, 17:01
[jira] [Closed] (DERBY-4635) intermittent failure in (...)replicationTests.ReplicationRun_Local_1Indexing.testReplication_Local_1_Indexing
Myrna van Lunteren (JIRA)   [jira] [Closed] (DERBY-4635) intermittent failure in (...)replicationTests.ReplicationRun_Local_1Indexing.testReplication_Local_1_Indexing Tue, 25 Jun, 21:51
Myrna van Lunteren (JIRA)   [jira] [Reopened] (DERBY-4635) intermittent failure in (...)replicationTests.ReplicationRun_Local_1Indexing.testReplication_Local_1_Indexing Thu, 27 Jun, 19:24
[jira] [Resolved] (DERBY-5600) ) testReplication_Local_1_Indexing(org.apache.derbyTesting.functionTests.tests.replicationTests.ReplicationRun_Local_1Indexing)junit.framework.AssertionFailedError: Failover did not succeed at org.apache.derbyTesting.junit.BaseTestCase.fail(BaseTestCase.
Myrna van Lunteren (JIRA)   [jira] [Resolved] (DERBY-5600) ) testReplication_Local_1_Indexing(org.apache.derbyTesting.functionTests.tests.replicationTests.ReplicationRun_Local_1Indexing)junit.framework.AssertionFailedError: Failover did not succeed at org.apache.derbyTesting.junit.BaseTestCase.fail(BaseTestCase. Tue, 25 Jun, 21:53
[jira] [Resolved] (DERBY-5123) address a select number of intermittent test issues - goal is to get all nightly tests at trunk running clean for at least 2 weeks
Myrna van Lunteren (JIRA)   [jira] [Resolved] (DERBY-5123) address a select number of intermittent test issues - goal is to get all nightly tests at trunk running clean for at least 2 weeks Tue, 25 Jun, 22:11
[jira] [Created] (DERBY-6275) address selective intermittent test failures before 10.10.2 release for 2-week clean goal.
Myrna van Lunteren (JIRA)   [jira] [Created] (DERBY-6275) address selective intermittent test failures before 10.10.2 release for 2-week clean goal. Tue, 25 Jun, 22:15
Myrna van Lunteren (JIRA)   [jira] [Commented] (DERBY-6275) address selective intermittent test failures before 10.10.2 release for 2-week clean goal. Thu, 27 Jun, 22:14
Myrna van Lunteren (JIRA)   [jira] [Commented] (DERBY-6275) address selective intermittent test failures before 10.10.2 release for 2-week clean goal. Thu, 27 Jun, 22:43
ingemar.ab...@oracle.com [Java DB - testing] Error nightly trunk (rev 1496449) Wed, 26 Jun, 00:33
ingemar.ab...@oracle.com [Java DB - testing] Error nightly 10.10 (rev 1496455) Wed, 26 Jun, 05:13
ingemar.ab...@oracle.com [Java DB - testing] Success continuous trunk (rev 1496837) Wed, 26 Jun, 12:41
ingemar.ab...@oracle.com [Java DB - testing] Success continuous trunk (rev 1496870) Wed, 26 Jun, 12:51
ingemar.ab...@oracle.com [Java DB - testing] Success continuous 10.9 (rev 1496859) Wed, 26 Jun, 14:11
ingemar.ab...@oracle.com [Java DB - testing] Success continuous 10.10 (rev 1496996) Wed, 26 Jun, 20:15
ingemar.ab...@oracle.com [Java DB - testing] Success nightly trunk (rev 1496870) Thu, 27 Jun, 01:43
ingemar.ab...@oracle.com [Java DB - testing] Success nightly 10.9 (rev 1496859) Thu, 27 Jun, 07:13
ingemar.ab...@oracle.com [Java DB - testing] Success continuous trunk (rev 1497205) Thu, 27 Jun, 08:33
ingemar.ab...@oracle.com [Java DB - testing] Success continuous trunk (rev 1497230) Thu, 27 Jun, 11:23
ingemar.ab...@oracle.com [Java DB - testing] Success nightly 10.10 (rev 1496996) Thu, 27 Jun, 13:23
[jira] [Created] (DERBY-6276) Convert lang/DB2IsolationLevels.sql to JUnit
Dag H. Wanvik (JIRA)   [jira] [Created] (DERBY-6276) Convert lang/DB2IsolationLevels.sql to JUnit Thu, 27 Jun, 13:54
Dag H. Wanvik (JIRA)   [jira] [Updated] (DERBY-6276) Convert lang/DB2IsolationLevels.sql to JUnit Thu, 27 Jun, 14:12
[jira] [Created] (DERBY-6277) Derby still dead locks while freezing and unfreezing
Raghavendra Neelekani (JIRA)   [jira] [Created] (DERBY-6277) Derby still dead locks while freezing and unfreezing Thu, 27 Jun, 17:13
Raghavendra Neelekani (JIRA)   [jira] [Updated] (DERBY-6277) Derby still dead locks while freezing and unfreezing Thu, 27 Jun, 17:17
Raghavendra Neelekani (JIRA)   [jira] [Updated] (DERBY-6277) Derby still dead locks while freezing and unfreezing Thu, 27 Jun, 17:17
Raghavendra Neelekani (JIRA)   [jira] [Updated] (DERBY-6277) Derby still dead locks while freezing and unfreezing Thu, 27 Jun, 17:19
[jira] [Created] (DERBY-6278) test failure in testDynamicResultSets(org.apache.derbyTesting.functionTests.tests.lang.LangProcedureTest)junit.framework.AssertionFailedError: Column value mismatch @ column '1', row 1: \
Myrna van Lunteren (JIRA)   [jira] [Created] (DERBY-6278) test failure in testDynamicResultSets(org.apache.derbyTesting.functionTests.tests.lang.LangProcedureTest)junit.framework.AssertionFailedError: Column value mismatch @ column '1', row 1: \ Thu, 27 Jun, 18:37
[jira] [Created] (DERBY-6279) test failure in st_b5772 in StoreScriptsTest; 'java.sql.SQLException: Log Record has been sent to the stream, but it cannot be applied to the store (Object null).
Myrna van Lunteren (JIRA)   [jira] [Created] (DERBY-6279) test failure in st_b5772 in StoreScriptsTest; 'java.sql.SQLException: Log Record has been sent to the stream, but it cannot be applied to the store (Object null). Thu, 27 Jun, 18:52
[jira] [Created] (DERBY-6280) test failure in SetQueryTimeoutTest ComparisonFailure: Output at line 16 expected:<Test[ing that PreparedStatement remembers timeout.]> but was:<Test[ SetQueryTimeoutTest FAILED]>
Myrna van Lunteren (JIRA)   [jira] [Created] (DERBY-6280) test failure in SetQueryTimeoutTest ComparisonFailure: Output at line 16 expected:<Test[ing that PreparedStatement remembers timeout.]> but was:<Test[ SetQueryTimeoutTest FAILED]> Thu, 27 Jun, 19:12
Myrna van Lunteren (JIRA)   [jira] [Commented] (DERBY-6280) test failure in SetQueryTimeoutTest ComparisonFailure: Output at line 16 expected:<Test[ing that PreparedStatement remembers timeout.]> but was:<Test[ SetQueryTimeoutTest FAILED]> Thu, 27 Jun, 19:14
[jira] [Created] (DERBY-6281) test failure in lang/TriggerGeneral.sql
Myrna van Lunteren (JIRA)   [jira] [Created] (DERBY-6281) test failure in lang/TriggerGeneral.sql Thu, 27 Jun, 21:58
ingemar.ab...@oracle.com [Java DB - testing] Success continuous trunk (rev 1497537) Thu, 27 Jun, 22:11
[jira] [Commented] (DERBY-973) Restore fails in OnlineBackupTest1
Myrna van Lunteren (JIRA)   [jira] [Commented] (DERBY-973) Restore fails in OnlineBackupTest1 Thu, 27 Jun, 22:41
[jira] [Reopened] (DERBY-5969) Encryption, re-encryption, and un-encryption silently fail if the database is already booted.
Mike Matrigali (JIRA)   [jira] [Reopened] (DERBY-5969) Encryption, re-encryption, and un-encryption silently fail if the database is already booted. Thu, 27 Jun, 22:41
Mike Matrigali (JIRA)   [jira] [Updated] (DERBY-5969) Encryption, re-encryption, and un-encryption silently fail if the database is already booted. Thu, 27 Jun, 22:43
Mike Matrigali (JIRA)   [jira] [Closed] (DERBY-5969) Encryption, re-encryption, and un-encryption silently fail if the database is already booted. Thu, 27 Jun, 22:43
[jira] [Reopened] (DERBY-5886) FILE_CANNOT_REMOVE_FILE exception prints garbage.
Mike Matrigali (JIRA)   [jira] [Reopened] (DERBY-5886) FILE_CANNOT_REMOVE_FILE exception prints garbage. Thu, 27 Jun, 22:51
Mike Matrigali (JIRA)   [jira] [Updated] (DERBY-5886) FILE_CANNOT_REMOVE_FILE exception prints garbage. Thu, 27 Jun, 22:53
Mike Matrigali (JIRA)   [jira] [Resolved] (DERBY-5886) FILE_CANNOT_REMOVE_FILE exception prints garbage. Thu, 27 Jun, 22:55
[jira] [Commented] (DERBY-5866) testFiringConstraintOrder(org.apache.derbyTesting.functionTests.tests.lang.TriggerTest)junit.framework.AssertionFailedError: matching triggers need to be fired in order creation:1,NO CASCADE BEFORE,DELETE,ROW
Myrna van Lunteren (JIRA)   [jira] [Commented] (DERBY-5866) testFiringConstraintOrder(org.apache.derbyTesting.functionTests.tests.lang.TriggerTest)junit.framework.AssertionFailedError: matching triggers need to be fired in order creation:1,NO CASCADE BEFORE,DELETE,ROW Thu, 27 Jun, 22:55
[jira] [Updated] (DERBY-5880) Move java.sql.Wrapper implementations to base classes in embedded driver
Mike Matrigali (JIRA)   [jira] [Updated] (DERBY-5880) Move java.sql.Wrapper implementations to base classes in embedded driver Thu, 27 Jun, 22:57
Mike Matrigali (JIRA)   [jira] [Reopened] (DERBY-5880) Move java.sql.Wrapper implementations to base classes in embedded driver Thu, 27 Jun, 22:57
Mike Matrigali (JIRA)   [jira] [Closed] (DERBY-5880) Move java.sql.Wrapper implementations to base classes in embedded driver Thu, 27 Jun, 22:59
[jira] [Commented] (DERBY-5872) Inconsistency between isWrapperFor() and unwrap() in logical statements
Mike Matrigali (JIRA)   [jira] [Commented] (DERBY-5872) Inconsistency between isWrapperFor() and unwrap() in logical statements Thu, 27 Jun, 23:01
[jira] [Reopened] (DERBY-5749) Implicit cast of variable length values, e.g. as arguments to stored methods and generated columns values, silently truncate if too long
Mike Matrigali (JIRA)   [jira] [Reopened] (DERBY-5749) Implicit cast of variable length values, e.g. as arguments to stored methods and generated columns values, silently truncate if too long Thu, 27 Jun, 23:05
Mike Matrigali (JIRA)   [jira] [Closed] (DERBY-5749) Implicit cast of variable length values, e.g. as arguments to stored methods and generated columns values, silently truncate if too long Thu, 27 Jun, 23:07
Mike Matrigali (JIRA)   [jira] [Updated] (DERBY-5749) Implicit cast of variable length values, e.g. as arguments to stored methods and generated columns values, silently truncate if too long Thu, 27 Jun, 23:07
Message list« Previous · 1 · 2 · 3 · 4 · 5 · 6 · 7 · 8 · 9 · 10 · 11 · 12 · 13 · 14 · Next »Thread · Author · Date
Box list
Jan 2015127
Dec 2014187
Nov 2014175
Oct 2014424
Sep 2014531
Aug 2014659
Jul 2014570
Jun 2014712
May 2014698
Apr 2014464
Mar 2014895
Feb 2014630
Jan 2014475
Dec 2013329
Nov 2013524
Oct 2013875
Sep 2013562
Aug 2013618
Jul 2013657
Jun 20131166
May 2013788
Apr 20131185
Mar 2013588
Feb 2013664
Jan 2013538
Dec 2012331
Nov 2012446
Oct 2012636
Sep 2012663
Aug 2012384
Jul 2012481
Jun 2012586
May 2012900
Apr 2012709
Mar 2012767
Feb 2012897
Jan 2012391
Dec 2011478
Nov 2011444
Oct 2011576
Sep 2011744
Aug 2011684
Jul 2011722
Jun 2011804
May 2011605
Apr 2011574
Mar 20111193
Feb 20111393
Jan 2011834
Dec 2010535
Nov 2010595
Oct 2010703
Sep 2010673
Aug 2010657
Jul 2010848
Jun 2010929
May 2010709
Apr 2010885
Mar 2010673
Feb 2010646
Jan 2010638
Dec 2009566
Nov 2009660
Oct 2009604
Sep 2009505
Aug 2009921
Jul 20091312
Jun 20091035
May 2009835
Apr 20091088
Mar 2009884
Feb 2009541
Jan 2009692
Dec 2008522
Nov 2008616
Oct 2008723
Sep 2008455
Aug 2008754
Jul 2008988
Jun 2008871
May 2008842
Apr 20081384
Mar 20081904
Feb 20082074
Jan 20081539
Dec 2007852
Nov 20071273
Oct 20071391
Sep 2007911
Aug 2007908
Jul 20071492
Jun 20072222
May 20072295
Apr 20071394
Mar 20072200
Feb 20071383
Jan 20071360
Dec 20061026
Nov 20061413
Oct 20061324
Sep 20062319
Aug 20063287
Jul 20062434
Jun 20061712
May 20061602
Apr 20061694
Mar 20061985
Feb 20062535
Jan 20061640
Dec 2005741
Nov 20051157
Oct 20051185
Sep 2005783
Aug 2005896
Jul 2005652
Jun 20051494
May 20051323
Apr 2005684
Mar 2005612
Feb 2005351
Jan 2005438
Dec 2004435
Nov 2004274
Oct 2004281
Sep 2004388
Aug 2004160