db-derby-dev mailing list archives: June 2013

Site index · List index
Message list« Previous · 1 · 2 · 3 · 4 · 5 · 6 · 7 · 8 · 9 · 10 · 11 · 12 · 13 · 14 · Next »Thread · Author · Date
ingemar.ab...@oracle.com [Java DB - testing] Success continuous trunk (rev 1489349) Tue, 04 Jun, 12:11
ingemar.ab...@oracle.com [Java DB - testing] Success continuous trunk (rev 1489354) Tue, 04 Jun, 12:12
[jira] [Resolved] (DERBY-6221) Can't select from SYS.SYSUSERS if you use a WHERE clause in the query
Rick Hillegas (JIRA)   [jira] [Resolved] (DERBY-6221) Can't select from SYS.SYSUSERS if you use a WHERE clause in the query Tue, 04 Jun, 12:21
Rick Hillegas (JIRA)   [jira] [Closed] (DERBY-6221) Can't select from SYS.SYSUSERS if you use a WHERE clause in the query Fri, 14 Jun, 17:06
Mike Matrigali (JIRA)   [jira] [Reopened] (DERBY-6221) Can't select from SYS.SYSUSERS if you use a WHERE clause in the query Thu, 27 Jun, 22:31
Mike Matrigali (JIRA)   [jira] [Updated] (DERBY-6221) Can't select from SYS.SYSUSERS if you use a WHERE clause in the query Thu, 27 Jun, 22:31
Mike Matrigali (JIRA)   [jira] [Closed] (DERBY-6221) Can't select from SYS.SYSUSERS if you use a WHERE clause in the query Thu, 27 Jun, 22:31
ingemar.ab...@oracle.com [Java DB - testing] Error continuous 10.10 (rev 1489312) Tue, 04 Jun, 17:51
ingemar.ab...@oracle.com [Java DB - testing] Success continuous 10.8 (rev 1489473) Tue, 04 Jun, 18:31
ingemar.ab...@oracle.com [Java DB - testing] Success continuous 10.9 (rev 1489470) Tue, 04 Jun, 19:41
ingemar.ab...@oracle.com [Java DB - testing] Success nightly trunk (rev 1489354) Wed, 05 Jun, 01:43
ingemar.ab...@oracle.com [Java DB - testing] Failure nightly 10.8 (rev 1489473) Wed, 05 Jun, 01:45
Re: [vote]Re: Should DERBY take advantage of infra's offer of some svn/JIRA integration
Myrna van Lunteren   Re: [vote]Re: Should DERBY take advantage of infra's offer of some svn/JIRA integration Wed, 05 Jun, 02:02
ingemar.ab...@oracle.com [Java DB - testing] Success nightly 10.9 (rev 1489470) Wed, 05 Jun, 02:13
[jira] [Commented] (DERBY-673) Get rid of the NodeFactory
Dag H. Wanvik (JIRA)   [jira] [Commented] (DERBY-673) Get rid of the NodeFactory Wed, 05 Jun, 02:56
Dag H. Wanvik (JIRA)   [jira] [Updated] (DERBY-673) Get rid of the NodeFactory Wed, 05 Jun, 02:56
Dag H. Wanvik (JIRA)   [jira] [Assigned] (DERBY-673) Get rid of the NodeFactory Thu, 06 Jun, 13:47
Dag H. Wanvik (JIRA)   [jira] [Updated] (DERBY-673) Get rid of the NodeFactory Mon, 17 Jun, 10:59
Dag H. Wanvik (JIRA)   [jira] [Updated] (DERBY-673) Get rid of the NodeFactory Mon, 17 Jun, 10:59
Dag H. Wanvik (JIRA)   [jira] [Comment Edited] (DERBY-673) Get rid of the NodeFactory Mon, 17 Jun, 11:21
Rick Hillegas (JIRA)   [jira] [Commented] (DERBY-673) Get rid of the NodeFactory Wed, 19 Jun, 12:42
Knut Anders Hatlen (JIRA)   [jira] [Commented] (DERBY-673) Get rid of the NodeFactory Wed, 19 Jun, 12:57
Dag H. Wanvik (JIRA)   [jira] [Commented] (DERBY-673) Get rid of the NodeFactory Thu, 20 Jun, 14:04
Dag H. Wanvik (JIRA)   [jira] [Updated] (DERBY-673) Get rid of the NodeFactory Thu, 20 Jun, 14:12
Dag H. Wanvik (JIRA)   [jira] [Updated] (DERBY-673) Get rid of the NodeFactory Fri, 21 Jun, 07:38
Dag H. Wanvik (JIRA)   [jira] [Commented] (DERBY-673) Get rid of the NodeFactory Fri, 21 Jun, 07:50
Dag H. Wanvik (JIRA)   [jira] [Updated] (DERBY-673) Get rid of the NodeFactory Fri, 21 Jun, 08:16
ASF subversion and git services (JIRA)   [jira] [Commented] (DERBY-673) Get rid of the NodeFactory Fri, 21 Jun, 10:05
Dag H. Wanvik (JIRA)   [jira] [Updated] (DERBY-673) Get rid of the NodeFactory Tue, 25 Jun, 05:26
Dag H. Wanvik (JIRA)   [jira] [Comment Edited] (DERBY-673) Get rid of the NodeFactory Tue, 25 Jun, 05:42
Knut Anders Hatlen (JIRA)   [jira] [Commented] (DERBY-673) Get rid of the NodeFactory Tue, 25 Jun, 14:00
Mamta A. Satoor (JIRA)   [jira] [Updated] (DERBY-673) Get rid of the NodeFactory Tue, 25 Jun, 15:18
ASF subversion and git services (JIRA)   [jira] [Commented] (DERBY-673) Get rid of the NodeFactory Thu, 27 Jun, 07:39
Dag H. Wanvik (JIRA)   [jira] [Commented] (DERBY-673) Get rid of the NodeFactory Thu, 27 Jun, 07:59
Dag H. Wanvik (JIRA)   [jira] [Updated] (DERBY-673) Get rid of the NodeFactory Thu, 27 Jun, 08:14
ASF subversion and git services (JIRA)   [jira] [Commented] (DERBY-673) Get rid of the NodeFactory Fri, 28 Jun, 04:32
ASF subversion and git services (JIRA)   [jira] [Commented] (DERBY-673) Get rid of the NodeFactory Fri, 28 Jun, 12:04
ASF subversion and git services (JIRA)   [jira] [Commented] (DERBY-673) Get rid of the NodeFactory Fri, 28 Jun, 13:33
Dag H. Wanvik (JIRA)   [jira] [Updated] (DERBY-673) Get rid of the NodeFactory Sun, 30 Jun, 08:48
Dag H. Wanvik (JIRA)   [jira] [Comment Edited] (DERBY-673) Get rid of the NodeFactory Sun, 30 Jun, 08:51
[jira] [Commented] (DERBY-6214) PreparedStatement.setObject(int, Object, Types.CLOB) fail with DerbyNet
Mamta A. Satoor (JIRA)   [jira] [Commented] (DERBY-6214) PreparedStatement.setObject(int, Object, Types.CLOB) fail with DerbyNet Wed, 05 Jun, 06:45
Mamta A. Satoor (JIRA)   [jira] [Commented] (DERBY-6214) PreparedStatement.setObject(int, Object, Types.CLOB) fail with DerbyNet Wed, 05 Jun, 20:15
Mamta A. Satoor (JIRA)   [jira] [Updated] (DERBY-6214) PreparedStatement.setObject(int, Object, Types.CLOB) fail with DerbyNet Fri, 07 Jun, 22:10
Kathey Marsden (JIRA)   [jira] [Commented] (DERBY-6214) PreparedStatement.setObject(int, Object, Types.CLOB) fail with DerbyNet Mon, 10 Jun, 17:24
Mamta A. Satoor (JIRA)   [jira] [Commented] (DERBY-6214) PreparedStatement.setObject(int, Object, Types.CLOB) fail with DerbyNet Tue, 11 Jun, 16:44
Mamta A. Satoor (JIRA)   [jira] [Comment Edited] (DERBY-6214) PreparedStatement.setObject(int, Object, Types.CLOB) fail with DerbyNet Tue, 11 Jun, 20:01
Mike Matrigali (JIRA)   [jira] [Commented] (DERBY-6214) PreparedStatement.setObject(int, Object, Types.CLOB) fail with DerbyNet Tue, 11 Jun, 20:03
Mamta A. Satoor (JIRA)   [jira] [Updated] (DERBY-6214) PreparedStatement.setObject(int, Object, Types.CLOB) fail with DerbyNet Thu, 13 Jun, 06:42
Mamta A. Satoor (JIRA)   [jira] [Commented] (DERBY-6214) PreparedStatement.setObject(int, Object, Types.CLOB) fail with DerbyNet Mon, 17 Jun, 19:35
ingemar.ab...@oracle.com [Java DB - testing] Success nightly 10.10 (rev 1489312) Wed, 05 Jun, 06:53
Apache Jenkins Server Jenkins build became unstable: Derby-10.10-suites.All #26 Wed, 05 Jun, 07:15
Apache Jenkins Server   Jenkins build is back to stable : Derby-10.10-suites.All #27 Wed, 12 Jun, 11:35
[jira] [Created] (DERBY-6246) convert i18n/urlLocale.sql to JUnit
Kathey Marsden (JIRA)   [jira] [Created] (DERBY-6246) convert i18n/urlLocale.sql to JUnit Wed, 05 Jun, 15:40
Kathey Marsden (JIRA)   [jira] [Updated] (DERBY-6246) convert i18n/urlLocale.sql to JUnit Wed, 05 Jun, 22:36
Kathey Marsden (JIRA)   [jira] [Updated] (DERBY-6246) convert i18n/urlLocale.sql to JUnit Wed, 05 Jun, 22:36
Kathey Marsden (JIRA)   [jira] [Updated] (DERBY-6246) convert i18n/urlLocale.sql to JUnit Thu, 06 Jun, 00:12
Kathey Marsden (JIRA)   [jira] [Updated] (DERBY-6246) convert i18n/urlLocale.sql to JUnit Thu, 06 Jun, 00:12
Knut Anders Hatlen (JIRA)   [jira] [Commented] (DERBY-6246) convert i18n/urlLocale.sql to JUnit Thu, 06 Jun, 11:36
Kathey Marsden (JIRA)   [jira] [Updated] (DERBY-6246) convert i18n/urlLocale.sql to JUnit Fri, 07 Jun, 12:53
ASF subversion and git services (JIRA)   [jira] [Commented] (DERBY-6246) convert i18n/urlLocale.sql to JUnit Fri, 07 Jun, 16:44
Kathey Marsden (JIRA)   [jira] [Updated] (DERBY-6246) convert i18n/urlLocale.sql to JUnit Fri, 07 Jun, 16:48
ASF subversion and git services (JIRA)   [jira] [Commented] (DERBY-6246) convert i18n/urlLocale.sql to JUnit Mon, 10 Jun, 08:04
ASF subversion and git services (JIRA)   [jira] [Commented] (DERBY-6246) convert i18n/urlLocale.sql to JUnit Thu, 13 Jun, 12:53
Kathey Marsden (JIRA)   [jira] [Resolved] (DERBY-6246) convert i18n/urlLocale.sql to JUnit Fri, 14 Jun, 16:58
[jira] [Created] (DERBY-6247) updatelocksJDBC30 test failing in nightly regression tests
Mike Matrigali (JIRA)   [jira] [Created] (DERBY-6247) updatelocksJDBC30 test failing in nightly regression tests Wed, 05 Jun, 17:06
Myrna van Lunteren (JIRA)   [jira] [Commented] (DERBY-6247) updatelocksJDBC30 test failing in nightly regression tests Thu, 27 Jun, 22:45
[jira] [Updated] (DERBY-3624) testfailure in storetests/st_derby715 with ibm 1.5 on iseries machine; one deadlock message missing
Mike Matrigali (JIRA)   [jira] [Updated] (DERBY-3624) testfailure in storetests/st_derby715 with ibm 1.5 on iseries machine; one deadlock message missing Wed, 05 Jun, 17:08
Mike Matrigali (JIRA)   [jira] [Updated] (DERBY-3624) testfailure in storetests/st_derby715 with ibm 1.5 on iseries machine; one deadlock message missing Wed, 05 Jun, 17:08
Mike Matrigali (JIRA)   [jira] [Commented] (DERBY-3624) testfailure in storetests/st_derby715 with ibm 1.5 on iseries machine; one deadlock message missing Wed, 05 Jun, 17:10
Mike Matrigali (JIRA)   [jira] [Updated] (DERBY-3624) testfailure in storetests/st_derby715 with ibm 1.5 on iseries machine; one deadlock message missing Wed, 05 Jun, 18:26
Mike Matrigali (JIRA)   [jira] [Commented] (DERBY-3624) testfailure in storetests/st_derby715 with ibm 1.5 on iseries machine; one deadlock message missing Wed, 05 Jun, 18:28
Myrna van Lunteren (JIRA)   [jira] [Commented] (DERBY-3624) testfailure in storetests/st_derby715 with ibm 1.5 on iseries machine; one deadlock message missing Wed, 19 Jun, 22:46
Myrna van Lunteren (JIRA)   [jira] [Commented] (DERBY-3624) testfailure in storetests/st_derby715 with ibm 1.5 on iseries machine; one deadlock message missing Thu, 27 Jun, 22:49
[jira] [Commented] (DERBY-6143) nightly regression test failure: cs_FailedStreamInsertCharBufferBoundaries(org.apache.derbyTesting.functionTests.tests.jdbcapi.Derby2017LayerATest)java.io.IOException
Mike Matrigali (JIRA)   [jira] [Commented] (DERBY-6143) nightly regression test failure: cs_FailedStreamInsertCharBufferBoundaries(org.apache.derbyTesting.functionTests.tests.jdbcapi.Derby2017LayerATest)java.io.IOException Wed, 05 Jun, 17:12
Mike Matrigali (JIRA)   [jira] [Commented] (DERBY-6143) nightly regression test failure: cs_FailedStreamInsertCharBufferBoundaries(org.apache.derbyTesting.functionTests.tests.jdbcapi.Derby2017LayerATest)java.io.IOException Wed, 05 Jun, 17:14
Mike Matrigali (JIRA)   [jira] [Commented] (DERBY-6143) nightly regression test failure: cs_FailedStreamInsertCharBufferBoundaries(org.apache.derbyTesting.functionTests.tests.jdbcapi.Derby2017LayerATest)java.io.IOException Wed, 05 Jun, 18:48
Mike Matrigali (JIRA)   [jira] [Commented] (DERBY-6143) nightly regression test failure: cs_FailedStreamInsertCharBufferBoundaries(org.apache.derbyTesting.functionTests.tests.jdbcapi.Derby2017LayerATest)java.io.IOException Wed, 12 Jun, 17:27
[jira] [Updated] (DERBY-5850) store/rollForwardRecovery fails with java.lang.ArrayIndexOutOfBoundsException
Mike Matrigali (JIRA)   [jira] [Updated] (DERBY-5850) store/rollForwardRecovery fails with java.lang.ArrayIndexOutOfBoundsException Wed, 05 Jun, 17:22
Mike Matrigali (JIRA)   [jira] [Commented] (DERBY-5850) store/rollForwardRecovery fails with java.lang.ArrayIndexOutOfBoundsException Wed, 05 Jun, 17:22
[jira] [Created] (DERBY-6248) nightly regression test failure: testDerby966(org.apache.derbyTesting.functionTests.tests.jdbcapi.XATest)java.sql.SQLFeatureNotSupportedException: The DDM object 0x2408 is not supported. The connection has been terminated.
Mike Matrigali (JIRA)   [jira] [Created] (DERBY-6248) nightly regression test failure: testDerby966(org.apache.derbyTesting.functionTests.tests.jdbcapi.XATest)java.sql.SQLFeatureNotSupportedException: The DDM object 0x2408 is not supported. The connection has been terminated. Wed, 05 Jun, 17:28
Mike Matrigali (JIRA)   [jira] [Commented] (DERBY-6248) nightly regression test failure: testDerby966(org.apache.derbyTesting.functionTests.tests.jdbcapi.XATest)java.sql.SQLFeatureNotSupportedException: The DDM object 0x2408 is not supported. The connection has been terminated. Wed, 12 Jun, 17:21
Myrna van Lunteren (JIRA)   [jira] [Commented] (DERBY-6248) nightly regression test failure: testDerby966(org.apache.derbyTesting.functionTests.tests.jdbcapi.XATest)java.sql.SQLFeatureNotSupportedException: The DDM object 0x2408 is not supported. The connection has been terminated. Thu, 27 Jun, 22:53
[jira] [Updated] (DERBY-4952) Failure in testTriggerBasic(org.apache.derbyTesting.functionTests.tests.upgradeTests.Bas icSetup)java.sql.SQLException: A SAVEPOINT with the passed name already exists i n the current transaction.
Mike Matrigali (JIRA)   [jira] [Updated] (DERBY-4952) Failure in testTriggerBasic(org.apache.derbyTesting.functionTests.tests.upgradeTests.Bas icSetup)java.sql.SQLException: A SAVEPOINT with the passed name already exists i n the current transaction. Wed, 05 Jun, 17:30
[jira] [Updated] (DERBY-2767) 'lang/ddlTableLockMode.sql' fails with 'Number of rows visited=1' when expecting '0'.
Mike Matrigali (JIRA)   [jira] [Updated] (DERBY-2767) 'lang/ddlTableLockMode.sql' fails with 'Number of rows visited=1' when expecting '0'. Wed, 05 Jun, 18:30
Mike Matrigali (JIRA)   [jira] [Commented] (DERBY-2767) 'lang/ddlTableLockMode.sql' fails with 'Number of rows visited=1' when expecting '0'. Wed, 05 Jun, 18:34
[jira] [Created] (DERBY-6249) nightly regression test failure:
Mike Matrigali (JIRA)   [jira] [Created] (DERBY-6249) nightly regression test failure: Wed, 05 Jun, 18:38
Mike Matrigali (JIRA)   [jira] [Updated] (DERBY-6249) nightly regression test failure: testReplication_Local_3_p5_DERBY_3878)java.sql.SQLException: DERBY SQL error: ERRORCODE: 0, SQLSTATE: XJ001, SQLERRMC: java.lang.NullPointerExceptionXJ001.U Wed, 05 Jun, 18:42
Knut Anders Hatlen (JIRA)   [jira] [Resolved] (DERBY-6249) nightly regression test failure: testReplication_Local_3_p5_DERBY_3878)java.sql.SQLException: DERBY SQL error: ERRORCODE: 0, SQLSTATE: XJ001, SQLERRMC: java.lang.NullPointerExceptionXJ001.U Thu, 06 Jun, 11:02
Mike Matrigali (JIRA)   [jira] [Closed] (DERBY-6249) nightly regression test failure: testReplication_Local_3_p5_DERBY_3878)java.sql.SQLException: DERBY SQL error: ERRORCODE: 0, SQLSTATE: XJ001, SQLERRMC: java.lang.NullPointerExceptionXJ001.U Wed, 19 Jun, 17:16
[jira] [Created] (DERBY-6250) nightly regression test failure: testBasic(org.apache.derbyTesting.functionTests.tests.jdbc4.LoginTimeoutTest)junit.framework.AssertionFailedError: Should not have been able to connect!
Mike Matrigali (JIRA)   [jira] [Created] (DERBY-6250) nightly regression test failure: testBasic(org.apache.derbyTesting.functionTests.tests.jdbc4.LoginTimeoutTest)junit.framework.AssertionFailedError: Should not have been able to connect! Wed, 05 Jun, 18:54
[jira] [Created] (DERBY-6251) nightly regression test failure on weme, derbyrunjartest failing with: Process exception: (2) The system cannot find the file specified.
Mike Matrigali (JIRA)   [jira] [Created] (DERBY-6251) nightly regression test failure on weme, derbyrunjartest failing with: Process exception: (2) The system cannot find the file specified. Wed, 05 Jun, 19:04
Mike Matrigali (JIRA)   [jira] [Commented] (DERBY-6251) nightly regression test failure on weme, derbyrunjartest failing with: Process exception: (2) The system cannot find the file specified. Wed, 05 Jun, 19:06
Mike Matrigali (JIRA)   [jira] [Updated] (DERBY-6251) nightly regression test failure on weme, derbyrunjartest failing with: Process exception: (2) The system cannot find the file specified. Wed, 05 Jun, 19:24
Mike Matrigali (JIRA)   [jira] [Commented] (DERBY-6251) nightly regression test failure on weme, derbyrunjartest failing with: Process exception: (2) The system cannot find the file specified. Wed, 05 Jun, 19:24
Mike Matrigali (JIRA)   [jira] [Commented] (DERBY-6251) nightly regression test failure on weme, derbyrunjartest failing with: Process exception: (2) The system cannot find the file specified. Wed, 05 Jun, 19:28
Mike Matrigali (JIRA)   [jira] [Updated] (DERBY-6251) nightly regression test failure on weme, derbyrunjartest failing with: Process exception: (2) The system cannot find the file specified. Wed, 05 Jun, 19:28
Myrna van Lunteren (JIRA)   [jira] [Commented] (DERBY-6251) nightly regression test failure on weme, derbyrunjartest failing with: Process exception: (2) The system cannot find the file specified. Mon, 10 Jun, 18:26
ASF subversion and git services (JIRA)   [jira] [Commented] (DERBY-6251) nightly regression test failure on weme, derbyrunjartest failing with: Process exception: (2) The system cannot find the file specified. Mon, 10 Jun, 18:54
ASF subversion and git services (JIRA)   [jira] [Commented] (DERBY-6251) nightly regression test failure on weme, derbyrunjartest failing with: Process exception: (2) The system cannot find the file specified. Mon, 10 Jun, 19:43
ASF subversion and git services (JIRA)   [jira] [Commented] (DERBY-6251) nightly regression test failure on weme, derbyrunjartest failing with: Process exception: (2) The system cannot find the file specified. Mon, 10 Jun, 20:50
ASF subversion and git services (JIRA)   [jira] [Commented] (DERBY-6251) nightly regression test failure on weme, derbyrunjartest failing with: Process exception: (2) The system cannot find the file specified. Mon, 10 Jun, 21:30
ASF subversion and git services (JIRA)   [jira] [Commented] (DERBY-6251) nightly regression test failure on weme, derbyrunjartest failing with: Process exception: (2) The system cannot find the file specified. Mon, 10 Jun, 21:58
ASF subversion and git services (JIRA)   [jira] [Commented] (DERBY-6251) nightly regression test failure on weme, derbyrunjartest failing with: Process exception: (2) The system cannot find the file specified. Mon, 10 Jun, 22:42
ASF subversion and git services (JIRA)   [jira] [Commented] (DERBY-6251) nightly regression test failure on weme, derbyrunjartest failing with: Process exception: (2) The system cannot find the file specified. Mon, 10 Jun, 23:11
Myrna van Lunteren (JIRA)   [jira] [Commented] (DERBY-6251) nightly regression test failure on weme, derbyrunjartest failing with: Process exception: (2) The system cannot find the file specified. Tue, 11 Jun, 20:45
Myrna van Lunteren (JIRA)   [jira] [Updated] (DERBY-6251) nightly regression test failure on weme, derbyrunjartest failing with: Process exception: (2) The system cannot find the file specified. Tue, 11 Jun, 20:45
Myrna van Lunteren (JIRA)   [jira] [Resolved] (DERBY-6251) nightly regression test failure on weme, derbyrunjartest failing with: Process exception: (2) The system cannot find the file specified. Wed, 12 Jun, 23:51
ASF subversion and git services (JIRA)   [jira] [Commented] (DERBY-6251) nightly regression test failure on weme, derbyrunjartest failing with: Process exception: (2) The system cannot find the file specified. Fri, 14 Jun, 00:12
Myrna van Lunteren (JIRA)   [jira] [Commented] (DERBY-6251) nightly regression test failure on weme, derbyrunjartest failing with: Process exception: (2) The system cannot find the file specified. Fri, 14 Jun, 00:14
Mike Matrigali (JIRA)   [jira] [Closed] (DERBY-6251) nightly regression test failure on weme, derbyrunjartest failing with: Process exception: (2) The system cannot find the file specified. Wed, 19 Jun, 17:16
[jira] [Commented] (DERBY-6146) nightly regression test failure: testMultipleLastKeyWaitsInMaxScan(org.apache.derbyTesting.functionTests.tests.store.IndexSplitDeadlockTest)junit.framework.AssertionFailedError: Column value mismatch @ column '1',
Mike Matrigali (JIRA)   [jira] [Commented] (DERBY-6146) nightly regression test failure: testMultipleLastKeyWaitsInMaxScan(org.apache.derbyTesting.functionTests.tests.store.IndexSplitDeadlockTest)junit.framework.AssertionFailedError: Column value mismatch @ column '1', Wed, 05 Jun, 19:08
Mike Matrigali (JIRA)   [jira] [Updated] (DERBY-6146) nightly regression test failure: testMultipleLastKeyWaitsInMaxScan(org.apache.derbyTesting.functionTests.tests.store.IndexSplitDeadlockTest)junit.framework.AssertionFailedError: Column value mismatch @ column '1', Wed, 05 Jun, 19:10
Myrna van Lunteren (JIRA)   [jira] [Commented] (DERBY-6146) nightly regression test failure: testMultipleLastKeyWaitsInMaxScan(org.apache.derbyTesting.functionTests.tests.store.IndexSplitDeadlockTest)junit.framework.AssertionFailedError: Column value mismatch @ column '1', Thu, 27 Jun, 22:39
[jira] [Commented] (DERBY-4303) Handful of replication tests failed because they failed to get a connection to the slave within two minutes.
Mike Matrigali (JIRA)   [jira] [Commented] (DERBY-4303) Handful of replication tests failed because they failed to get a connection to the slave within two minutes. Wed, 05 Jun, 19:10
Mike Matrigali (JIRA)   [jira] [Updated] (DERBY-4303) Handful of replication tests failed because they failed to get a connection to the slave within two minutes. Wed, 05 Jun, 19:12
Mike Matrigali (JIRA)   [jira] [Updated] (DERBY-4303) Handful of replication tests failed because they failed to get a connection to the slave within two minutes. Wed, 05 Jun, 19:12
[jira] [Created] (DERBY-6252) nightly regression test failure: test_01_WrongUsage()junit.framework.AssertionFailedError: expectedExitValue:1 does not match exitValue:3262096
Mike Matrigali (JIRA)   [jira] [Created] (DERBY-6252) nightly regression test failure: test_01_WrongUsage()junit.framework.AssertionFailedError: expectedExitValue:1 does not match exitValue:3262096 Wed, 05 Jun, 19:16
[jira] [Updated] (DERBY-6171) SecureServerTest failure on 10.8(revision 1465166) with ibm 142, AssertionFailedError: expected:<0> but was:<8108160>
Mike Matrigali (JIRA)   [jira] [Updated] (DERBY-6171) SecureServerTest failure on 10.8(revision 1465166) with ibm 142, AssertionFailedError: expected:<0> but was:<8108160> Wed, 05 Jun, 19:20
Mike Matrigali (JIRA)   [jira] [Updated] (DERBY-6171) SecureServerTest failure on 10.8(revision 1465166) with ibm 142, Wed, 05 Jun, 19:20
Mike Matrigali (JIRA)   [jira] [Commented] (DERBY-6171) SecureServerTest failure on 10.8(revision 1465166) with ibm 142, AssertionFailedError: expected:<0> but was:<8108160> Wed, 05 Jun, 19:20
ingemar.ab...@oracle.com [Java DB - testing] Success continuous trunk (rev 1489924) Wed, 05 Jun, 19:21
mike matrigali looking for architectural advice for dealing with streams/LOBS as inputs to UPDATE operations Wed, 05 Jun, 22:40
Dag Wanvik   Re: looking for architectural advice for dealing with streams/LOBS as inputs to UPDATE operations Thu, 06 Jun, 04:33
Knut Anders Hatlen   Re: looking for architectural advice for dealing with streams/LOBS as inputs to UPDATE operations Thu, 06 Jun, 10:53
ingemar.ab...@oracle.com [Java DB - testing] Error nightly trunk (rev 1489924) Wed, 05 Jun, 23:43
[jira] [Assigned] (DERBY-6114) OOME in XAMemTest.testDerby4137_TransactionTimeoutSpecifiedNotExceeded
Knut Anders Hatlen (JIRA)   [jira] [Assigned] (DERBY-6114) OOME in XAMemTest.testDerby4137_TransactionTimeoutSpecifiedNotExceeded Thu, 06 Jun, 06:56
Knut Anders Hatlen (JIRA)   [jira] [Commented] (DERBY-6114) OOME in XAMemTest.testDerby4137_TransactionTimeoutSpecifiedNotExceeded Thu, 06 Jun, 07:44
Knut Anders Hatlen (JIRA)   [jira] [Updated] (DERBY-6114) OOME in XAMemTest.testDerby4137_TransactionTimeoutSpecifiedNotExceeded Thu, 06 Jun, 08:51
Knut Anders Hatlen (JIRA)   [jira] [Updated] (DERBY-6114) OOME in XAMemTest.testDerby4137_TransactionTimeoutSpecifiedNotExceeded Thu, 06 Jun, 11:13
ASF subversion and git services (JIRA)   [jira] [Commented] (DERBY-6114) OOME in XAMemTest.testDerby4137_TransactionTimeoutSpecifiedNotExceeded Wed, 12 Jun, 07:36
Knut Anders Hatlen (JIRA)   [jira] [Updated] (DERBY-6114) OOME in XAMemTest.testDerby4137_TransactionTimeoutSpecifiedNotExceeded Wed, 12 Jun, 09:48
ASF subversion and git services (JIRA)   [jira] [Commented] (DERBY-6114) OOME in XAMemTest.testDerby4137_TransactionTimeoutSpecifiedNotExceeded Wed, 12 Jun, 09:52
ASF subversion and git services (JIRA)   [jira] [Commented] (DERBY-6114) OOME in XAMemTest.testDerby4137_TransactionTimeoutSpecifiedNotExceeded Wed, 26 Jun, 09:42
Knut Anders Hatlen (JIRA)   [jira] [Updated] (DERBY-6114) OOME in XAMemTest.testDerby4137_TransactionTimeoutSpecifiedNotExceeded Wed, 26 Jun, 09:42
[jira] [Commented] (DERBY-6224) Many test failures on latest JDK 8 EA build because of missing SQLPermission
ASF subversion and git services (JIRA)   [jira] [Commented] (DERBY-6224) Many test failures on latest JDK 8 EA build because of missing SQLPermission Thu, 06 Jun, 14:05
Knut Anders Hatlen (JIRA)   [jira] [Commented] (DERBY-6224) Many test failures on latest JDK 8 EA build because of missing SQLPermission Thu, 06 Jun, 14:05
Knut Anders Hatlen (JIRA)   [jira] [Updated] (DERBY-6224) Many test failures on latest JDK 8 EA build because of missing SQLPermission Thu, 06 Jun, 14:07
Kathey Marsden (JIRA)   [jira] [Commented] (DERBY-6224) Many test failures on latest JDK 8 EA build because of missing SQLPermission Thu, 06 Jun, 19:23
Knut Anders Hatlen (JIRA)   [jira] [Commented] (DERBY-6224) Many test failures on latest JDK 8 EA build because of missing SQLPermission Thu, 06 Jun, 20:28
Knut Anders Hatlen (JIRA)   [jira] [Updated] (DERBY-6224) Many test failures on latest JDK 8 EA build because of missing SQLPermission Thu, 06 Jun, 20:28
Kathey Marsden (JIRA)   [jira] [Commented] (DERBY-6224) Many test failures on latest JDK 8 EA build because of missing SQLPermission Thu, 06 Jun, 21:34
Knut Anders Hatlen (JIRA)   [jira] [Updated] (DERBY-6224) Many test failures on latest JDK 8 EA build because of missing SQLPermission Fri, 07 Jun, 12:57
Knut Anders Hatlen (JIRA)   [jira] [Updated] (DERBY-6224) Many test failures on latest JDK 8 EA build because of missing SQLPermission Wed, 12 Jun, 12:16
Knut Anders Hatlen (JIRA)   [jira] [Commented] (DERBY-6224) Many test failures on latest JDK 8 EA build because of missing SQLPermission Wed, 12 Jun, 14:15
Knut Anders Hatlen (JIRA)   [jira] [Updated] (DERBY-6224) Many test failures on latest JDK 8 EA build because of missing SQLPermission Thu, 13 Jun, 07:34
ASF subversion and git services (JIRA)   [jira] [Commented] (DERBY-6224) Many test failures on latest JDK 8 EA build because of missing SQLPermission Fri, 14 Jun, 14:06
ASF subversion and git services (JIRA)   [jira] [Commented] (DERBY-6224) Many test failures on latest JDK 8 EA build because of missing SQLPermission Wed, 19 Jun, 20:07
Knut Anders Hatlen (JIRA)   [jira] [Commented] (DERBY-6224) Many test failures on latest JDK 8 EA build because of missing SQLPermission Thu, 20 Jun, 08:24
Knut Anders Hatlen (JIRA)   [jira] [Updated] (DERBY-6224) Many test failures on latest JDK 8 EA build because of missing SQLPermission Thu, 20 Jun, 08:40
ASF subversion and git services (JIRA)   [jira] [Commented] (DERBY-6224) Many test failures on latest JDK 8 EA build because of missing SQLPermission Thu, 20 Jun, 08:42
ASF subversion and git services (JIRA)   [jira] [Commented] (DERBY-6224) Many test failures on latest JDK 8 EA build because of missing SQLPermission Thu, 20 Jun, 12:02
ASF subversion and git services (JIRA)   [jira] [Commented] (DERBY-6224) Many test failures on latest JDK 8 EA build because of missing SQLPermission Thu, 20 Jun, 14:54
Knut Anders Hatlen (JIRA)   [jira] [Updated] (DERBY-6224) Many test failures on latest JDK 8 EA build because of missing SQLPermission Thu, 20 Jun, 14:56
Knut Anders Hatlen (JIRA)   [jira] [Updated] (DERBY-6224) Many test failures on latest JDK 8 EA build because of missing SQLPermission Thu, 20 Jun, 15:11
Knut Anders Hatlen (JIRA)   [jira] [Resolved] (DERBY-6224) Many test failures on latest JDK 8 EA build because of missing SQLPermission Thu, 20 Jun, 15:15
Dag H. Wanvik (JIRA)   [jira] [Commented] (DERBY-6224) Many test failures on latest JDK 8 EA build because of missing SQLPermission Fri, 21 Jun, 05:34
Knut Anders Hatlen (JIRA)   [jira] [Commented] (DERBY-6224) Many test failures on latest JDK 8 EA build because of missing SQLPermission Fri, 21 Jun, 07:30
Knut Anders Hatlen (JIRA)   [jira] [Commented] (DERBY-6224) Many test failures on latest JDK 8 EA build because of missing SQLPermission Fri, 21 Jun, 07:58
Knut Anders Hatlen (JIRA)   [jira] [Updated] (DERBY-6224) Many test failures on latest JDK 8 EA build because of missing SQLPermission Fri, 21 Jun, 08:16
Knut Anders Hatlen (JIRA)   [jira] [Updated] (DERBY-6224) Many test failures on latest JDK 8 EA build because of missing SQLPermission Fri, 21 Jun, 09:57
Dag H. Wanvik (JIRA)   [jira] [Commented] (DERBY-6224) Many test failures on latest JDK 8 EA build because of missing SQLPermission Mon, 24 Jun, 05:49
ingemar.ab...@oracle.com [Java DB - testing] Success continuous 10.9 (rev 1490291) Thu, 06 Jun, 18:01
[jira] [Commented] (DERBY-5003) NPE in ReplicationRun_Local_3_p5 when stopping slave after purposely crashing master
Mike Matrigali (JIRA)   [jira] [Commented] (DERBY-5003) NPE in ReplicationRun_Local_3_p5 when stopping slave after purposely crashing master Thu, 06 Jun, 18:11
Mike Matrigali (JIRA)   [jira] [Updated] (DERBY-5003) NPE in ReplicationRun_Local_3_p5 when stopping slave after purposely crashing master Thu, 06 Jun, 18:11
ingemar.ab...@oracle.com [Java DB - testing] Success nightly 10.9 (rev 1490291) Fri, 07 Jun, 08:13
[jira] [Created] (DERBY-6253) Collapse SQLException factories
Knut Anders Hatlen (JIRA)   [jira] [Created] (DERBY-6253) Collapse SQLException factories Fri, 07 Jun, 09:01
Knut Anders Hatlen (JIRA)   [jira] [Commented] (DERBY-6253) Collapse SQLException factories Fri, 07 Jun, 09:10
Knut Anders Hatlen (JIRA)   [jira] [Updated] (DERBY-6253) Collapse SQLException factories Mon, 10 Jun, 11:02
Knut Anders Hatlen (JIRA)   [jira] [Updated] (DERBY-6253) Collapse SQLException factories Mon, 10 Jun, 11:02
Knut Anders Hatlen (JIRA)   [jira] [Resolved] (DERBY-6253) Collapse SQLException factories Mon, 17 Jun, 10:01
ASF subversion and git services (JIRA)   [jira] [Commented] (DERBY-6253) Collapse SQLException factories Mon, 17 Jun, 10:01
ASF subversion and git services (JIRA)   [jira] [Commented] (DERBY-6253) Collapse SQLException factories Mon, 17 Jun, 10:17
[jira] [Created] (DERBY-6254) Reduce number of factory methods in StandardException
Knut Anders Hatlen (JIRA)   [jira] [Created] (DERBY-6254) Reduce number of factory methods in StandardException Fri, 07 Jun, 10:53
Knut Anders Hatlen (JIRA)   [jira] [Updated] (DERBY-6254) Reduce number of factory methods in StandardException Fri, 07 Jun, 11:01
Dag H. Wanvik (JIRA)   [jira] [Commented] (DERBY-6254) Reduce number of factory methods in StandardException Mon, 10 Jun, 01:46
ASF subversion and git services (JIRA)   [jira] [Commented] (DERBY-6254) Reduce number of factory methods in StandardException Mon, 10 Jun, 08:08
Knut Anders Hatlen (JIRA)   [jira] [Closed] (DERBY-6254) Reduce number of factory methods in StandardException Mon, 10 Jun, 08:08
[jira] [Created] (DERBY-6255) convert i18n/messageLocale.sql
Kathey Marsden (JIRA)   [jira] [Created] (DERBY-6255) convert i18n/messageLocale.sql Fri, 07 Jun, 16:46
Kathey Marsden (JIRA)   [jira] [Updated] (DERBY-6255) convert i18n/messageLocale.sql Sat, 08 Jun, 16:20
Kathey Marsden (JIRA)   [jira] [Updated] (DERBY-6255) convert i18n/messageLocale.sql Sat, 08 Jun, 16:26
Kathey Marsden (JIRA)   [jira] [Updated] (DERBY-6255) convert i18n/messageLocale.sql Sat, 08 Jun, 16:26
Kathey Marsden (JIRA)   [jira] [Updated] (DERBY-6255) convert i18n/messageLocale.sql Sat, 08 Jun, 16:26
ASF subversion and git services (JIRA)   [jira] [Commented] (DERBY-6255) convert i18n/messageLocale.sql Mon, 10 Jun, 17:58
ASF subversion and git services (JIRA)   [jira] [Commented] (DERBY-6255) convert i18n/messageLocale.sql Mon, 10 Jun, 20:16
Knut Anders Hatlen (JIRA)   [jira] [Updated] (DERBY-6255) convert i18n/messageLocale.sql Wed, 12 Jun, 07:27
ASF subversion and git services (JIRA)   [jira] [Commented] (DERBY-6255) convert i18n/messageLocale.sql Wed, 12 Jun, 07:29
ASF subversion and git services (JIRA)   [jira] [Commented] (DERBY-6255) convert i18n/messageLocale.sql Thu, 13 Jun, 12:53
Kathey Marsden (JIRA)   [jira] [Resolved] (DERBY-6255) convert i18n/messageLocale.sql Fri, 14 Jun, 16:58
Message list« Previous · 1 · 2 · 3 · 4 · 5 · 6 · 7 · 8 · 9 · 10 · 11 · 12 · 13 · 14 · Next »Thread · Author · Date
Box list
Dec 2014124
Nov 2014175
Oct 2014424
Sep 2014531
Aug 2014659
Jul 2014570
Jun 2014712
May 2014698
Apr 2014464
Mar 2014895
Feb 2014630
Jan 2014475
Dec 2013329
Nov 2013524
Oct 2013875
Sep 2013562
Aug 2013618
Jul 2013657
Jun 20131166
May 2013788
Apr 20131185
Mar 2013588
Feb 2013664
Jan 2013538
Dec 2012331
Nov 2012446
Oct 2012636
Sep 2012663
Aug 2012384
Jul 2012481
Jun 2012586
May 2012900
Apr 2012709
Mar 2012767
Feb 2012897
Jan 2012391
Dec 2011478
Nov 2011444
Oct 2011576
Sep 2011744
Aug 2011684
Jul 2011722
Jun 2011804
May 2011605
Apr 2011574
Mar 20111193
Feb 20111393
Jan 2011834
Dec 2010535
Nov 2010595
Oct 2010703
Sep 2010673
Aug 2010657
Jul 2010848
Jun 2010929
May 2010709
Apr 2010885
Mar 2010673
Feb 2010646
Jan 2010638
Dec 2009566
Nov 2009660
Oct 2009604
Sep 2009505
Aug 2009921
Jul 20091312
Jun 20091035
May 2009835
Apr 20091088
Mar 2009884
Feb 2009541
Jan 2009692
Dec 2008522
Nov 2008616
Oct 2008723
Sep 2008455
Aug 2008754
Jul 2008988
Jun 2008871
May 2008842
Apr 20081384
Mar 20081904
Feb 20082074
Jan 20081539
Dec 2007852
Nov 20071273
Oct 20071391
Sep 2007911
Aug 2007908
Jul 20071492
Jun 20072222
May 20072295
Apr 20071394
Mar 20072200
Feb 20071383
Jan 20071360
Dec 20061026
Nov 20061413
Oct 20061324
Sep 20062319
Aug 20063287
Jul 20062434
Jun 20061712
May 20061602
Apr 20061694
Mar 20061985
Feb 20062535
Jan 20061640
Dec 2005741
Nov 20051157
Oct 20051185
Sep 2005783
Aug 2005896
Jul 2005652
Jun 20051494
May 20051323
Apr 2005684
Mar 2005612
Feb 2005351
Jan 2005438
Dec 2004435
Nov 2004274
Oct 2004281
Sep 2004388
Aug 2004160