db-derby-dev mailing list archives: June 2013

Site index · List index
Message list« Previous · 1 · 2 · 3 · 4 · 5 · 6 · 7 · 8 · 9 · 10 · 11 · 12 · Next »Thread · Author · Date
Mamta A. Satoor (JIRA) [jira] [Updated] (DERBY-5134) CallableStatement.getObjet(string,class) returns JDBC method is not yet implemented exception Sun, 30 Jun, 18:06
Mamta A. Satoor (JIRA) [jira] [Updated] (DERBY-5007) Implement an alternative error-logging mechanism using the java.util.logging idiom. Sun, 30 Jun, 18:06
Mamta A. Satoor (JIRA) [jira] [Updated] (DERBY-4648) Eliminate the org.apache.derby.client.am package of abstract classes in the client library. Sun, 30 Jun, 18:08
Mamta A. Satoor (JIRA) [jira] [Updated] (DERBY-4606) Implementing SQLXML support in Derby Sun, 30 Jun, 18:10
Mamta A. Satoor (JIRA) [jira] [Updated] (DERBY-4237) scrollable updatable ResultSets should show rows added with insertRow() Sun, 30 Jun, 18:14
Mamta A. Satoor (JIRA) [jira] [Updated] (DERBY-4163) It would be good if Derby could raise connectionErrorOccurred on pooled connections when the database is shutdown Sun, 30 Jun, 18:16
Mamta A. Satoor (JIRA) [jira] [Updated] (DERBY-4138) Adding an "ORDER BY" clause breaks updatable result sets Sun, 30 Jun, 18:16
Mamta A. Satoor (JIRA) [jira] [Updated] (DERBY-4002) Look at merging the interfaces PositionedStream and Resetable into one Sun, 30 Jun, 18:18
Mamta Satoor Fwd: [Java DB - testing] Error nightly 10.8 (rev 1497868) Sat, 29 Jun, 23:35
Mamta Satoor Re: [Java DB - testing] Error nightly 10.8 (rev 1497868) Sun, 30 Jun, 01:44
Mamta Satoor Re: [Java DB - testing] Error nightly 10.8 (rev 1497868) Sun, 30 Jun, 01:51
Martin Todorov (JIRA) [jira] [Comment Edited] (DERBY-5668) Derby does not publish source artifacts to Maven Central Thu, 13 Jun, 11:55
Martin Todorov (JIRA) [jira] [Comment Edited] (DERBY-5668) Derby does not publish source artifacts to Maven Central Thu, 13 Jun, 11:55
Martin Todorov (JIRA) [jira] [Commented] (DERBY-5668) Derby does not publish source artifacts to Maven Central Thu, 13 Jun, 11:55
Martin Todorov (JIRA) [jira] [Comment Edited] (DERBY-5668) Derby does not publish source artifacts to Maven Central Thu, 13 Jun, 11:57
Mike Matrigali (JIRA) [jira] [Created] (DERBY-6247) updatelocksJDBC30 test failing in nightly regression tests Wed, 05 Jun, 17:06
Mike Matrigali (JIRA) [jira] [Updated] (DERBY-3624) testfailure in storetests/st_derby715 with ibm 1.5 on iseries machine; one deadlock message missing Wed, 05 Jun, 17:08
Mike Matrigali (JIRA) [jira] [Updated] (DERBY-3624) testfailure in storetests/st_derby715 with ibm 1.5 on iseries machine; one deadlock message missing Wed, 05 Jun, 17:08
Mike Matrigali (JIRA) [jira] [Commented] (DERBY-3624) testfailure in storetests/st_derby715 with ibm 1.5 on iseries machine; one deadlock message missing Wed, 05 Jun, 17:10
Mike Matrigali (JIRA) [jira] [Commented] (DERBY-6143) nightly regression test failure: cs_FailedStreamInsertCharBufferBoundaries(org.apache.derbyTesting.functionTests.tests.jdbcapi.Derby2017LayerATest)java.io.IOException Wed, 05 Jun, 17:12
Mike Matrigali (JIRA) [jira] [Commented] (DERBY-6143) nightly regression test failure: cs_FailedStreamInsertCharBufferBoundaries(org.apache.derbyTesting.functionTests.tests.jdbcapi.Derby2017LayerATest)java.io.IOException Wed, 05 Jun, 17:14
Mike Matrigali (JIRA) [jira] [Updated] (DERBY-5850) store/rollForwardRecovery fails with java.lang.ArrayIndexOutOfBoundsException Wed, 05 Jun, 17:22
Mike Matrigali (JIRA) [jira] [Commented] (DERBY-5850) store/rollForwardRecovery fails with java.lang.ArrayIndexOutOfBoundsException Wed, 05 Jun, 17:22
Mike Matrigali (JIRA) [jira] [Created] (DERBY-6248) nightly regression test failure: testDerby966(org.apache.derbyTesting.functionTests.tests.jdbcapi.XATest)java.sql.SQLFeatureNotSupportedException: The DDM object 0x2408 is not supported. The connection has been terminated. Wed, 05 Jun, 17:28
Mike Matrigali (JIRA) [jira] [Updated] (DERBY-4952) Failure in testTriggerBasic(org.apache.derbyTesting.functionTests.tests.upgradeTests.Bas icSetup)java.sql.SQLException: A SAVEPOINT with the passed name already exists i n the current transaction. Wed, 05 Jun, 17:30
Mike Matrigali (JIRA) [jira] [Updated] (DERBY-3624) testfailure in storetests/st_derby715 with ibm 1.5 on iseries machine; one deadlock message missing Wed, 05 Jun, 18:26
Mike Matrigali (JIRA) [jira] [Commented] (DERBY-3624) testfailure in storetests/st_derby715 with ibm 1.5 on iseries machine; one deadlock message missing Wed, 05 Jun, 18:28
Mike Matrigali (JIRA) [jira] [Updated] (DERBY-2767) 'lang/ddlTableLockMode.sql' fails with 'Number of rows visited=1' when expecting '0'. Wed, 05 Jun, 18:30
Mike Matrigali (JIRA) [jira] [Commented] (DERBY-2767) 'lang/ddlTableLockMode.sql' fails with 'Number of rows visited=1' when expecting '0'. Wed, 05 Jun, 18:34
Mike Matrigali (JIRA) [jira] [Created] (DERBY-6249) nightly regression test failure: Wed, 05 Jun, 18:38
Mike Matrigali (JIRA) [jira] [Updated] (DERBY-6249) nightly regression test failure: testReplication_Local_3_p5_DERBY_3878)java.sql.SQLException: DERBY SQL error: ERRORCODE: 0, SQLSTATE: XJ001, SQLERRMC: java.lang.NullPointerExceptionXJ001.U Wed, 05 Jun, 18:42
Mike Matrigali (JIRA) [jira] [Commented] (DERBY-6143) nightly regression test failure: cs_FailedStreamInsertCharBufferBoundaries(org.apache.derbyTesting.functionTests.tests.jdbcapi.Derby2017LayerATest)java.io.IOException Wed, 05 Jun, 18:48
Mike Matrigali (JIRA) [jira] [Created] (DERBY-6250) nightly regression test failure: testBasic(org.apache.derbyTesting.functionTests.tests.jdbc4.LoginTimeoutTest)junit.framework.AssertionFailedError: Should not have been able to connect! Wed, 05 Jun, 18:54
Mike Matrigali (JIRA) [jira] [Created] (DERBY-6251) nightly regression test failure on weme, derbyrunjartest failing with: Process exception: (2) The system cannot find the file specified. Wed, 05 Jun, 19:04
Mike Matrigali (JIRA) [jira] [Commented] (DERBY-6251) nightly regression test failure on weme, derbyrunjartest failing with: Process exception: (2) The system cannot find the file specified. Wed, 05 Jun, 19:06
Mike Matrigali (JIRA) [jira] [Commented] (DERBY-6146) nightly regression test failure: testMultipleLastKeyWaitsInMaxScan(org.apache.derbyTesting.functionTests.tests.store.IndexSplitDeadlockTest)junit.framework.AssertionFailedError: Column value mismatch @ column '1', Wed, 05 Jun, 19:08
Mike Matrigali (JIRA) [jira] [Updated] (DERBY-6146) nightly regression test failure: testMultipleLastKeyWaitsInMaxScan(org.apache.derbyTesting.functionTests.tests.store.IndexSplitDeadlockTest)junit.framework.AssertionFailedError: Column value mismatch @ column '1', Wed, 05 Jun, 19:10
Mike Matrigali (JIRA) [jira] [Commented] (DERBY-4303) Handful of replication tests failed because they failed to get a connection to the slave within two minutes. Wed, 05 Jun, 19:10
Mike Matrigali (JIRA) [jira] [Updated] (DERBY-4303) Handful of replication tests failed because they failed to get a connection to the slave within two minutes. Wed, 05 Jun, 19:12
Mike Matrigali (JIRA) [jira] [Updated] (DERBY-4303) Handful of replication tests failed because they failed to get a connection to the slave within two minutes. Wed, 05 Jun, 19:12
Mike Matrigali (JIRA) [jira] [Created] (DERBY-6252) nightly regression test failure: test_01_WrongUsage()junit.framework.AssertionFailedError: expectedExitValue:1 does not match exitValue:3262096 Wed, 05 Jun, 19:16
Mike Matrigali (JIRA) [jira] [Updated] (DERBY-6171) SecureServerTest failure on 10.8(revision 1465166) with ibm 142, Wed, 05 Jun, 19:20
Mike Matrigali (JIRA) [jira] [Updated] (DERBY-6171) SecureServerTest failure on 10.8(revision 1465166) with ibm 142, AssertionFailedError: expected:<0> but was:<8108160> Wed, 05 Jun, 19:20
Mike Matrigali (JIRA) [jira] [Commented] (DERBY-6171) SecureServerTest failure on 10.8(revision 1465166) with ibm 142, AssertionFailedError: expected:<0> but was:<8108160> Wed, 05 Jun, 19:20
Mike Matrigali (JIRA) [jira] [Commented] (DERBY-6251) nightly regression test failure on weme, derbyrunjartest failing with: Process exception: (2) The system cannot find the file specified. Wed, 05 Jun, 19:24
Mike Matrigali (JIRA) [jira] [Updated] (DERBY-6251) nightly regression test failure on weme, derbyrunjartest failing with: Process exception: (2) The system cannot find the file specified. Wed, 05 Jun, 19:24
Mike Matrigali (JIRA) [jira] [Commented] (DERBY-6251) nightly regression test failure on weme, derbyrunjartest failing with: Process exception: (2) The system cannot find the file specified. Wed, 05 Jun, 19:28
Mike Matrigali (JIRA) [jira] [Updated] (DERBY-6251) nightly regression test failure on weme, derbyrunjartest failing with: Process exception: (2) The system cannot find the file specified. Wed, 05 Jun, 19:28
Mike Matrigali (JIRA) [jira] [Commented] (DERBY-5003) NPE in ReplicationRun_Local_3_p5 when stopping slave after purposely crashing master Thu, 06 Jun, 18:11
Mike Matrigali (JIRA) [jira] [Updated] (DERBY-5003) NPE in ReplicationRun_Local_3_p5 when stopping slave after purposely crashing master Thu, 06 Jun, 18:11
Mike Matrigali (JIRA) [jira] [Commented] (DERBY-6214) PreparedStatement.setObject(int, Object, Types.CLOB) fail with DerbyNet Tue, 11 Jun, 20:03
Mike Matrigali (JIRA) [jira] [Commented] (DERBY-6211) Make Optimizer trace logic pluggable. Tue, 11 Jun, 21:56
Mike Matrigali (JIRA) [jira] [Commented] (DERBY-6256) Move the XmlVTI into the product. Tue, 11 Jun, 22:21
Mike Matrigali (JIRA) [jira] [Commented] (DERBY-6248) nightly regression test failure: testDerby966(org.apache.derbyTesting.functionTests.tests.jdbcapi.XATest)java.sql.SQLFeatureNotSupportedException: The DDM object 0x2408 is not supported. The connection has been terminated. Wed, 12 Jun, 17:21
Mike Matrigali (JIRA) [jira] [Commented] (DERBY-6143) nightly regression test failure: cs_FailedStreamInsertCharBufferBoundaries(org.apache.derbyTesting.functionTests.tests.jdbcapi.Derby2017LayerATest)java.io.IOException Wed, 12 Jun, 17:27
Mike Matrigali (JIRA) [jira] [Commented] (DERBY-6256) Move the XmlVTI into the product. Wed, 12 Jun, 20:30
Mike Matrigali (JIRA) [jira] [Commented] (DERBY-6256) Move the XmlVTI into the product. Wed, 12 Jun, 21:18
Mike Matrigali (JIRA) [jira] [Commented] (DERBY-6256) Move the XmlVTI into the product. Wed, 12 Jun, 21:32
Mike Matrigali (JIRA) [jira] [Commented] (DERBY-6256) Move the XmlVTI into the product. Wed, 12 Jun, 21:34
Mike Matrigali (JIRA) [jira] [Commented] (DERBY-6259) Collapse the level 2 optimizer into its parent module. Wed, 12 Jun, 21:48
Mike Matrigali (JIRA) [jira] [Updated] (DERBY-6222) add release note for 10.11 noting that using a JVM previous to jdk1.6 will not work Wed, 19 Jun, 17:14
Mike Matrigali (JIRA) [jira] [Closed] (DERBY-6249) nightly regression test failure: testReplication_Local_3_p5_DERBY_3878)java.sql.SQLException: DERBY SQL error: ERRORCODE: 0, SQLSTATE: XJ001, SQLERRMC: java.lang.NullPointerExceptionXJ001.U Wed, 19 Jun, 17:16
Mike Matrigali (JIRA) [jira] [Closed] (DERBY-6251) nightly regression test failure on weme, derbyrunjartest failing with: Process exception: (2) The system cannot find the file specified. Wed, 19 Jun, 17:16
Mike Matrigali (JIRA) [jira] [Closed] (DERBY-6154) add non-order by cases to the BlobClob4BlobTest Wed, 19 Jun, 17:16
Mike Matrigali (JIRA) [jira] [Closed] (DERBY-6181) fix AutoloadTest to support running concurrently when different base ports are specified. Wed, 19 Jun, 17:16
Mike Matrigali (JIRA) [jira] [Closed] (DERBY-6178) AutoloadTest does not proprogate original jvm -D flags to spawned JVM, leading to LAB regression test failures Wed, 19 Jun, 17:16
Mike Matrigali (JIRA) [jira] [Closed] (DERBY-6144) nightly regression test failure, intermittent error : testStatisticsCorrectness(org.apache.derbyTesting.functionTests.tests.store.AutomaticIndexStatisticsTest)junit.framework.AssertionFailedError Wed, 19 Jun, 17:16
Mike Matrigali (JIRA) [jira] [Closed] (DERBY-6079) 100's of errors in nightly test run on weme after jacoco property/priviledges checkin Wed, 19 Jun, 17:18
Mike Matrigali (JIRA) [jira] [Closed] (DERBY-6084) org.apache.derbyTesting.functionTests.tests.multi.StressMultiTestjava.security.AccessControlException: Access denied (java.lang.RuntimePermission modifyThread) cascades to 38 errors and 674 failures in nightly test run against ibm16 Wed, 19 Jun, 17:18
Mike Matrigali (JIRA) [jira] [Closed] (DERBY-5975) intermittent nightly test failure across releases in Derby5937SlaveShutdownTest.testSlaveFailoverLeak Wed, 19 Jun, 17:18
Mike Matrigali (JIRA) [jira] [Closed] (DERBY-5670) multiple failures in AutoloadTest, in nightly regression test run Wed, 19 Jun, 17:18
Mike Matrigali (JIRA) [jira] [Closed] (DERBY-5666) nightly suite error in NativeAuthenticationServiceTest : Database restoration unexpectedly failed. Wed, 19 Jun, 17:18
Mike Matrigali (JIRA) [jira] [Closed] (DERBY-5667) testReadCommitted(org.apache.derbyTesting.functionTests.tests.store.UpdateLocksTest)junit.framework.AssertionFailedError: Missing rows in ResultSet Wed, 19 Jun, 17:18
Mike Matrigali (JIRA) [jira] [Closed] (DERBY-5624) System can run out of stack space while processing DropOnCommit requests. Wed, 19 Jun, 17:20
Mike Matrigali (JIRA) [jira] [Closed] (DERBY-5665) nightly regression test failure in rollForwardBackup: ERROR XSRS4: Error renaming file (during backup) from extinout\mybackup\wombat to extinout\mybackup\wombat.OLD. Wed, 19 Jun, 17:20
Mike Matrigali (JIRA) [jira] [Closed] (DERBY-5279) test5DeleteBeforeTriggerNoReferencingClause fails in nightly testing Wed, 19 Jun, 17:20
Mike Matrigali (JIRA) [jira] [Closed] (DERBY-4577) An expanding update fails with an nospc.U error. Wed, 19 Jun, 17:20
Mike Matrigali (JIRA) [jira] [Closed] (DERBY-5573) nightly test failure, encryptParams failed when it found directory already exists. Wed, 19 Jun, 17:20
Mike Matrigali (JIRA) [jira] [Closed] (DERBY-4729) add more information to the XACT_PROTOCOL_VIOLATION returned from store. Wed, 19 Jun, 17:20
Mike Matrigali (JIRA) [jira] [Closed] (DERBY-5574) encryption test in encryption nightly suite test fails with ERROR XBM0S: Unable to rename file error Wed, 19 Jun, 17:20
Mike Matrigali (JIRA) [jira] [Closed] (DERBY-5575) testImportExportProcedures(org.apache.derbyTesting.functionTests.tests.tools.ImportExportProcedureTest)java.sql.SQLException: An IOException occurred while writing data to the file. Wed, 19 Jun, 17:20
Mike Matrigali (JIRA) [jira] [Closed] (DERBY-3519) junit regression test failure in testInertTime(org.apache.derbyTesting.functionTests.tests.lang.TimeHandlingTest)junit.framework.AssertionFailedError: expected:<2> but was:<3> Wed, 19 Jun, 17:22
Mike Matrigali (JIRA) [jira] [Closed] (DERBY-2699) performance of like in territory based collation databases may be improved by changing way collation elements are calculated. Wed, 19 Jun, 17:22
Mike Matrigali (JIRA) [jira] [Updated] (DERBY-5686) multiple intermittent errors in nightly tests during DriverMgrAuthenticationTest test. reason: An SQL data change is not permitted for a read-only connection, user or database. Wed, 19 Jun, 17:24
Mike Matrigali (JIRA) [jira] [Commented] (DERBY-5680) indexStat daemon processing tables over and over even when there are no changes in the tables Mon, 24 Jun, 16:40
Mike Matrigali (JIRA) [jira] [Commented] (DERBY-5680) indexStat daemon processing tables over and over even when there are no changes in the tables Tue, 25 Jun, 19:29
Mike Matrigali (JIRA) [jira] [Reopened] (DERBY-5687) Back out the concurrency improvements for identity columns introduced by derby-4437 Thu, 27 Jun, 22:22
Mike Matrigali (JIRA) [jira] [Closed] (DERBY-5687) Back out the concurrency improvements for identity columns introduced by derby-4437 Thu, 27 Jun, 22:22
Mike Matrigali (JIRA) [jira] [Updated] (DERBY-5687) Back out the concurrency improvements for identity columns introduced by derby-4437 Thu, 27 Jun, 22:22
Mike Matrigali (JIRA) [jira] [Reopened] (DERBY-6221) Can't select from SYS.SYSUSERS if you use a WHERE clause in the query Thu, 27 Jun, 22:31
Mike Matrigali (JIRA) [jira] [Updated] (DERBY-6221) Can't select from SYS.SYSUSERS if you use a WHERE clause in the query Thu, 27 Jun, 22:31
Mike Matrigali (JIRA) [jira] [Closed] (DERBY-6221) Can't select from SYS.SYSUSERS if you use a WHERE clause in the query Thu, 27 Jun, 22:31
Mike Matrigali (JIRA) [jira] [Reopened] (DERBY-5969) Encryption, re-encryption, and un-encryption silently fail if the database is already booted. Thu, 27 Jun, 22:41
Mike Matrigali (JIRA) [jira] [Closed] (DERBY-5969) Encryption, re-encryption, and un-encryption silently fail if the database is already booted. Thu, 27 Jun, 22:43
Mike Matrigali (JIRA) [jira] [Updated] (DERBY-5969) Encryption, re-encryption, and un-encryption silently fail if the database is already booted. Thu, 27 Jun, 22:43
Mike Matrigali (JIRA) [jira] [Reopened] (DERBY-5886) FILE_CANNOT_REMOVE_FILE exception prints garbage. Thu, 27 Jun, 22:51
Mike Matrigali (JIRA) [jira] [Updated] (DERBY-5886) FILE_CANNOT_REMOVE_FILE exception prints garbage. Thu, 27 Jun, 22:53
Mike Matrigali (JIRA) [jira] [Resolved] (DERBY-5886) FILE_CANNOT_REMOVE_FILE exception prints garbage. Thu, 27 Jun, 22:55
Mike Matrigali (JIRA) [jira] [Reopened] (DERBY-5880) Move java.sql.Wrapper implementations to base classes in embedded driver Thu, 27 Jun, 22:57
Mike Matrigali (JIRA) [jira] [Updated] (DERBY-5880) Move java.sql.Wrapper implementations to base classes in embedded driver Thu, 27 Jun, 22:57
Message list« Previous · 1 · 2 · 3 · 4 · 5 · 6 · 7 · 8 · 9 · 10 · 11 · 12 · Next »Thread · Author · Date
Box list
Aug 2014477
Jul 2014570
Jun 2014712
May 2014698
Apr 2014464
Mar 2014895
Feb 2014630
Jan 2014475
Dec 2013329
Nov 2013524
Oct 2013875
Sep 2013562
Aug 2013618
Jul 2013657
Jun 20131166
May 2013788
Apr 20131185
Mar 2013588
Feb 2013664
Jan 2013538
Dec 2012331
Nov 2012446
Oct 2012636
Sep 2012663
Aug 2012384
Jul 2012481
Jun 2012586
May 2012900
Apr 2012709
Mar 2012767
Feb 2012897
Jan 2012391
Dec 2011478
Nov 2011444
Oct 2011576
Sep 2011744
Aug 2011684
Jul 2011722
Jun 2011804
May 2011605
Apr 2011574
Mar 20111193
Feb 20111393
Jan 2011834
Dec 2010535
Nov 2010595
Oct 2010703
Sep 2010673
Aug 2010657
Jul 2010848
Jun 2010929
May 2010709
Apr 2010885
Mar 2010673
Feb 2010646
Jan 2010638
Dec 2009566
Nov 2009660
Oct 2009604
Sep 2009505
Aug 2009921
Jul 20091312
Jun 20091035
May 2009835
Apr 20091088
Mar 2009884
Feb 2009541
Jan 2009692
Dec 2008522
Nov 2008616
Oct 2008723
Sep 2008455
Aug 2008754
Jul 2008988
Jun 2008871
May 2008842
Apr 20081384
Mar 20081904
Feb 20082074
Jan 20081539
Dec 2007852
Nov 20071273
Oct 20071391
Sep 2007911
Aug 2007908
Jul 20071492
Jun 20072222
May 20072295
Apr 20071394
Mar 20072200
Feb 20071383
Jan 20071360
Dec 20061026
Nov 20061413
Oct 20061324
Sep 20062319
Aug 20063287
Jul 20062434
Jun 20061712
May 20061602
Apr 20061694
Mar 20061985
Feb 20062535
Jan 20061640
Dec 2005741
Nov 20051157
Oct 20051185
Sep 2005783
Aug 2005896
Jul 2005652
Jun 20051494
May 20051323
Apr 2005684
Mar 2005612
Feb 2005351
Jan 2005438
Dec 2004435
Nov 2004274
Oct 2004281
Sep 2004388
Aug 2004160