db-derby-dev mailing list archives

Site index · List index
Message view « Date » · « Thread »
Top « Date » · « Thread »
From "Rick Hillegas (JIRA)" <j...@apache.org>
Subject [jira] [Updated] (DERBY-6058) 2 ClassNotFoundException failures on trunk with ibm's weme6.2 since build 1433263
Date Fri, 14 Jun 2013 17:04:20 GMT

     [ https://issues.apache.org/jira/browse/DERBY-6058?page=com.atlassian.jira.plugin.system.issuetabpanels:all-tabpanel
]

Rick Hillegas updated DERBY-6058:
---------------------------------

    Component/s: Test
    
> 2 ClassNotFoundException failures on trunk with ibm's weme6.2 since build 1433263
> ---------------------------------------------------------------------------------
>
>                 Key: DERBY-6058
>                 URL: https://issues.apache.org/jira/browse/DERBY-6058
>             Project: Derby
>          Issue Type: Bug
>          Components: Test
>    Affects Versions: 10.10.1.1
>         Environment: windows xp with ibm's cdc/foundation implementation weme6.2.
>            Reporter: Myrna van Lunteren
>            Assignee: Rick Hillegas
>             Fix For: 10.10.1.1
>
>         Attachments: derby-6058-01-aa-disableOnJSR169.diff
>
>
> Since the build of 1433263 on trunk, we see the following test failures:
> 1) noSpecialCollation(org.apache.derbyTesting.functionTests.tests.lang.TableFunctionTest)java.sql.SQLException:
The class 'org.apache.derbyTesting.functionTests.tests.lang.VarargsRoutines' does not exist
or is inaccessible. This can happen if the class is not public.
> 	at org.apache.derby.impl.jdbc.SQLExceptionFactory.getSQLException(Unknown Source)
> 	at org.apache.derby.impl.jdbc.Util.newEmbedSQLException(Unknown Source)
> 	at org.apache.derby.impl.jdbc.Util.seeNextException(Unknown Source)
> 	at org.apache.derby.impl.jdbc.TransactionResourceImpl.wrapInSQLException(Unknown Source)
> 	at org.apache.derby.impl.jdbc.TransactionResourceImpl.handleException(Unknown Source)
> 	at org.apache.derby.impl.jdbc.EmbedConnection.handleException(Unknown Source)
> 	at org.apache.derby.impl.jdbc.ConnectionChild.handleException(Unknown Source)
> 	at org.apache.derby.impl.jdbc.EmbedPreparedStatement.<init>(Unknown Source)
> 	at org.apache.derby.jdbc.Driver169.newEmbedPreparedStatement(Unknown Source)
> 	at org.apache.derby.impl.jdbc.EmbedConnection.prepareStatement(Unknown Source)
> 	at org.apache.derby.impl.jdbc.EmbedConnection.prepareStatement(Unknown Source)
> 	at org.apache.derbyTesting.junit.BaseJDBCTestCase.prepareStatement(BaseJDBCTestCase.java:217)
> 	at org.apache.derbyTesting.functionTests.tests.lang.TableFunctionTest.assertResults(TableFunctionTest.java:2579)
> 	at org.apache.derbyTesting.functionTests.tests.lang.TableFunctionTest.assertResults(TableFunctionTest.java:2568)
> 	at org.apache.derbyTesting.functionTests.tests.lang.TableFunctionTest.derby_6040(TableFunctionTest.java:2370)
> 	at org.apache.derbyTesting.functionTests.tests.lang.TableFunctionTest.miscBugs(TableFunctionTest.java:1936)
> 	at org.apache.derbyTesting.functionTests.tests.lang.TableFunctionTest.tableFunctionTest(TableFunctionTest.java:1005)
> 	at org.apache.derbyTesting.functionTests.tests.lang.TableFunctionTest.noSpecialCollation(TableFunctionTest.java:971)
> 	at java.lang.reflect.AccessibleObject.invokeV(AccessibleObject.java:195)
> 	at org.apache.derbyTesting.junit.BaseTestCase.runBare(BaseTestCase.java:117)
> 	at org.apache.derbyTesting.junit.BaseJDBCTestCase.runBareOverridable(BaseJDBCTestCase.java:424)
> 	at org.apache.derbyTesting.junit.BaseJDBCTestCase.runBare(BaseJDBCTestCase.java:441)
> Caused by: java.sql.SQLException: Java exception: 'org.apache.derbyTesting.functionTests.tests.lang.VarargsRoutines
: JVMCFRE003 bad major version; class=org/apache/derbyTesting/functionTests/tests/lang/VarargsRoutines,
offset=6: java.lang.ClassNotFoundException'.
> 	at org.apache.derby.impl.jdbc.SQLExceptionFactory.getSQLException(Unknown Source)
> 	at org.apache.derby.impl.jdbc.Util.newEmbedSQLException(Unknown Source)
> 	at org.apache.derby.impl.jdbc.Util.javaException(Unknown Source)
> 	at org.apache.derby.impl.jdbc.TransactionResourceImpl.wrapInSQLException(Unknown Source)
> 	... 37 more
> Caused by: java.lang.ClassNotFoundException: org.apache.derbyTesting.functionTests.tests.lang.VarargsRoutines
: JVMCFRE003 bad major version; class=org/apache/derbyTesting/functionTests/tests/lang/VarargsRoutines,
offset=6
> 	at org.apache.derby.impl.services.reflect.DatabaseClasses.loadApplicationClass(Unknown
Source)
> 	at org.apache.derby.iapi.services.loader.ClassInspector.getClass(Unknown Source)
> 	at org.apache.derby.iapi.services.loader.ClassInspector.accessible(Unknown Source)
> 	at org.apache.derby.impl.sql.compile.QueryTreeNode.verifyClassExist(Unknown Source)
> 	at org.apache.derby.impl.sql.compile.StaticMethodCallNode.bindExpression(Unknown Source)
> 	at org.apache.derby.impl.sql.compile.FromVTI.bindVTITables(Unknown Source)
> 	at org.apache.derby.impl.sql.compile.FromList.bindTables(Unknown Source)
> 	at org.apache.derby.impl.sql.compile.SelectNode.bindNonVTITables(Unknown Source)
> 	at org.apache.derby.impl.sql.compile.DMLStatementNode.bindTables(Unknown Source)
> 	at org.apache.derby.impl.sql.compile.DMLStatementNode.bind(Unknown Source)
> 	at org.apache.derby.impl.sql.compile.CursorNode.bindStatement(Unknown Source)
> 	at org.apache.derby.impl.sql.GenericStatement.prepMinion(Unknown Source)
> 	at org.apache.derby.impl.sql.GenericStatement.prepare(Unknown Source)
> 	at org.apache.derby.impl.sql.conn.GenericLanguageConnectionContext.prepareInternalStatement(Unknown
Source)
> 	... 33 more
> 2) specialCollation(org.apache.derbyTesting.functionTests.tests.lang.TableFunctionTest)java.sql.SQLException:
The class 'org.apache.derbyTesting.functionTests.tests.lang.VarargsRoutines' does not exist
or is inaccessible. This can happen if the class is not public.
> 	at org.apache.derby.impl.jdbc.SQLExceptionFactory.getSQLException(Unknown Source)
> 	at org.apache.derby.impl.jdbc.Util.newEmbedSQLException(Unknown Source)
> 	at org.apache.derby.impl.jdbc.Util.seeNextException(Unknown Source)
> 	at org.apache.derby.impl.jdbc.TransactionResourceImpl.wrapInSQLException(Unknown Source)
> 	at org.apache.derby.impl.jdbc.TransactionResourceImpl.handleException(Unknown Source)
> 	at org.apache.derby.impl.jdbc.EmbedConnection.handleException(Unknown Source)
> 	at org.apache.derby.impl.jdbc.ConnectionChild.handleException(Unknown Source)
> 	at org.apache.derby.impl.jdbc.EmbedPreparedStatement.<init>(Unknown Source)
> 	at org.apache.derby.jdbc.Driver169.newEmbedPreparedStatement(Unknown Source)
> 	at org.apache.derby.impl.jdbc.EmbedConnection.prepareStatement(Unknown Source)
> 	at org.apache.derby.impl.jdbc.EmbedConnection.prepareStatement(Unknown Source)
> 	at org.apache.derbyTesting.junit.BaseJDBCTestCase.prepareStatement(BaseJDBCTestCase.java:217)
> 	at org.apache.derbyTesting.functionTests.tests.lang.TableFunctionTest.assertResults(TableFunctionTest.java:2579)
> 	at org.apache.derbyTesting.functionTests.tests.lang.TableFunctionTest.assertResults(TableFunctionTest.java:2568)
> 	at org.apache.derbyTesting.functionTests.tests.lang.TableFunctionTest.derby_6040(TableFunctionTest.java:2370)
> 	at org.apache.derbyTesting.functionTests.tests.lang.TableFunctionTest.miscBugs(TableFunctionTest.java:1936)
> 	at org.apache.derbyTesting.functionTests.tests.lang.TableFunctionTest.tableFunctionTest(TableFunctionTest.java:1005)
> 	at org.apache.derbyTesting.functionTests.tests.lang.TableFunctionTest.specialCollation(TableFunctionTest.java:981)
> 	at java.lang.reflect.AccessibleObject.invokeV(AccessibleObject.java:195)
> 	at org.apache.derbyTesting.junit.BaseTestCase.runBare(BaseTestCase.java:117)
> 	at org.apache.derbyTesting.junit.BaseJDBCTestCase.runBareOverridable(BaseJDBCTestCase.java:424)
> 	at org.apache.derbyTesting.junit.BaseJDBCTestCase.runBare(BaseJDBCTestCase.java:441)
> 	at junit.extensions.TestDecorator.basicRun(TestDecorator.java:24)
> 	at junit.extensions.TestSetup$1.protect(TestSetup.java:21)
> 	at junit.extensions.TestSetup.run(TestSetup.java:25)
> 	at junit.extensions.TestDecorator.basicRun(TestDecorator.java:24)
> 	at junit.extensions.TestSetup$1.protect(TestSetup.java:21)
> 	at junit.extensions.TestSetup.run(TestSetup.java:25)
> 	at org.apache.derbyTesting.junit.BaseTestSetup.run(BaseTestSetup.java:57)
> 	at junit.extensions.TestDecorator.basicRun(TestDecorator.java:24)
> 	at junit.extensions.TestSetup$1.protect(TestSetup.java:21)
> 	at junit.extensions.TestSetup.run(TestSetup.java:25)
> Caused by: java.sql.SQLException: Java exception: 'org.apache.derbyTesting.functionTests.tests.lang.VarargsRoutines
: JVMCFRE003 bad major version; class=org/apache/derbyTesting/functionTests/tests/lang/VarargsRoutines,
offset=6: java.lang.ClassNotFoundException'.
> 	at org.apache.derby.impl.jdbc.SQLExceptionFactory.getSQLException(Unknown Source)
> 	at org.apache.derby.impl.jdbc.Util.newEmbedSQLException(Unknown Source)
> 	at org.apache.derby.impl.jdbc.Util.javaException(Unknown Source)
> 	at org.apache.derby.impl.jdbc.TransactionResourceImpl.wrapInSQLException(Unknown Source)
> 	... 52 more
> Caused by: java.lang.ClassNotFoundException: org.apache.derbyTesting.functionTests.tests.lang.VarargsRoutines
: JVMCFRE003 bad major version; class=org/apache/derbyTesting/functionTests/tests/lang/VarargsRoutines,
offset=6
> 	at org.apache.derby.impl.services.reflect.DatabaseClasses.loadApplicationClass(Unknown
Source)
> 	at org.apache.derby.iapi.services.loader.ClassInspector.getClass(Unknown Source)
> 	at org.apache.derby.iapi.services.loader.ClassInspector.accessible(Unknown Source)
> 	at org.apache.derby.impl.sql.compile.QueryTreeNode.verifyClassExist(Unknown Source)
> 	at org.apache.derby.impl.sql.compile.StaticMethodCallNode.bindExpression(Unknown Source)
> 	at org.apache.derby.impl.sql.compile.FromVTI.bindVTITables(Unknown Source)
> 	at org.apache.derby.impl.sql.compile.FromList.bindTables(Unknown Source)
> 	at org.apache.derby.impl.sql.compile.SelectNode.bindNonVTITables(Unknown Source)
> 	at org.apache.derby.impl.sql.compile.DMLStatementNode.bindTables(Unknown Source)
> 	at org.apache.derby.impl.sql.compile.DMLStatementNode.bind(Unknown Source)
> 	at org.apache.derby.impl.sql.compile.CursorNode.bindStatement(Unknown Source)
> 	at org.apache.derby.impl.sql.GenericStatement.prepMinion(Unknown Source)
> 	at org.apache.derby.impl.sql.GenericStatement.prepare(Unknown Source)
> 	at org.apache.derby.impl.sql.conn.GenericLanguageConnectionContext.prepareInternalStatement(Unknown
Source)
> 	... 48 more
> Things were fine with build 1432788.
> Things are also fine with ibm 1.5, 1.6, 1.7.
> See also: http://people.apache.org/~myrnavl/derby_test_results/main/windows/testSummary-1433263.html

--
This message is automatically generated by JIRA.
If you think it was sent incorrectly, please contact your JIRA administrators
For more information on JIRA, see: http://www.atlassian.com/software/jira

Mime
View raw message