db-derby-dev mailing list archives

Site index · List index
Message view « Date » · « Thread »
Top « Date » · « Thread »
From "Rick Hillegas (JIRA)" <j...@apache.org>
Subject [jira] [Closed] (DERBY-5059) NPE in StressMultiTest on Solaris on Java 6
Date Fri, 14 Jun 2013 17:30:21 GMT

     [ https://issues.apache.org/jira/browse/DERBY-5059?page=com.atlassian.jira.plugin.system.issuetabpanels:all-tabpanel
]

Rick Hillegas closed DERBY-5059.
--------------------------------

    
> NPE in StressMultiTest on Solaris on Java 6
> -------------------------------------------
>
>                 Key: DERBY-5059
>                 URL: https://issues.apache.org/jira/browse/DERBY-5059
>             Project: Derby
>          Issue Type: Bug
>          Components: Test
>    Affects Versions: 10.8.1.2
>            Reporter: Rick Hillegas
>         Attachments: derby.log
>
>
> The following failure was seen in StressMultiTest on Solaris on Java 6 in test run http://dbtg.foundry.sun.com/derby/test/Daily/jvm1.6/testing/Limited/testSummary-1071696.html
:
> There was 1 failure:
> 1) testStressMulti(org.apache.derbyTesting.functionTests.tests.multi.StressMultiTest)junit.framework.AssertionFailedError:
Caused by: 
> java.sql.SQLException: DERBY SQL error: SQLCODE: -1, SQLSTATE: XJ001, SQLERRMC: java.lang.NullPointerExceptionXJ001.U
> 	at org.apache.derby.client.am.SQLExceptionFactory40.getSQLException(Unknown Source)
> 	at org.apache.derby.client.am.SqlException.getSQLException(Unknown Source)
> 	at org.apache.derby.client.am.Statement.executeQuery(Unknown Source)
> 	at org.apache.derbyTesting.functionTests.tests.multi.StressMultiTest$StressMultiRunnable.select(StressMultiTest.java:555)
> 	at org.apache.derbyTesting.functionTests.tests.multi.StressMultiTest$StressMultiRunnable.run(StressMultiTest.java:429)
> 	at java.lang.Thread.run(Thread.java:619)
> Caused by: org.apache.derby.client.am.SqlException: DERBY SQL error: SQLCODE: -1, SQLSTATE:
XJ001, SQLERRMC: java.lang.NullPointerExceptionXJ001.U
> 	at org.apache.derby.client.am.Statement.completeSqlca(Unknown Source)
> 	at org.apache.derby.client.net.NetStatementReply.parsePrepareError(Unknown Source)
> 	at org.apache.derby.client.net.NetStatementReply.parsePRPSQLSTTreply(Unknown Source)
> 	at org.apache.derby.client.net.NetStatementReply.readPrepareDescribeOutput(Unknown Source)
> 	at org.apache.derby.client.net.StatementReply.readPrepareDescribeOutput(Unknown Source)
> 	at org.apache.derby.client.net.NetStatement.readPrepareDescribeOutput_(Unknown Source)
> 	at org.apache.derby.client.am.Statement.readPrepareDescribeOutput(Unknown Source)
> 	at org.apache.derby.client.am.Statement.flowExecute(Unknown Source)
> 	at org.apache.derby.client.am.Statement.executeQueryX(Unknown Source)
> 	... 4 more
> 	at org.apache.derbyTesting.functionTests.tests.multi.StressMultiTest.handleException(StressMultiTest.java:351)
> 	at org.apache.derbyTesting.functionTests.tests.multi.StressMultiTest.access$200(StressMultiTest.java:70)
> 	at org.apache.derbyTesting.functionTests.tests.multi.StressMultiTest$StressMultiRunnable.run(StressMultiTest.java:445)
> 	at java.lang.Thread.run(Thread.java:619)
> FAILURES!!!
> Tests run: 13364,  Failures: 1,  Errors: 0

--
This message is automatically generated by JIRA.
If you think it was sent incorrectly, please contact your JIRA administrators
For more information on JIRA, see: http://www.atlassian.com/software/jira

Mime
View raw message