db-derby-dev mailing list archives: April 2013

Site index · List index
Message list« Previous · 1 · 2 · 3 · 4 · 5 · 6 · 7 · 8 · 9 · 10 · 11 · 12 · Next »Thread · Author · Date
Mamta A. Satoor (JIRA) [jira] [Commented] (DERBY-6170) testSuccessfulConnect failure on trunk(revision 1465166) with ibm 16 Thu, 11 Apr, 19:10
Mamta A. Satoor (JIRA) [jira] [Created] (DERBY-6171) SecureServerTest failure on 10.8(revision 1465166) with ibm 142 Thu, 11 Apr, 19:18
Mamta A. Satoor (JIRA) [jira] [Commented] (DERBY-5866) testFiringConstraintOrder(org.apache.derbyTesting.functionTests.tests.lang.TriggerTest)junit.framework.AssertionFailedError: matching triggers need to be fired in order creation:1,NO CASCADE BEFORE,DELETE,ROW Thu, 11 Apr, 19:24
Mamta A. Satoor (JIRA) [jira] [Commented] (DERBY-6144) nightly regression test failure, intermittent error : testStatisticsCorrectness(org.apache.derbyTesting.functionTests.tests.store.AutomaticIndexStatisticsTest)junit.framework.AssertionFailedError Thu, 11 Apr, 19:26
Mamta A. Satoor (JIRA) [jira] [Commented] (DERBY-6171) SecureServerTest failure on 10.8(revision 1465166) with ibm 142 Thu, 11 Apr, 19:28
Mamta A. Satoor (JIRA) [jira] [Commented] (DERBY-6092) testPositionAgressive(org.apache.derbyTesting.functionTests.tests.jdbcapi.BlobClob4BlobTest)j fails with : 'The handle is invalid.: java.io.IOException'. Thu, 11 Apr, 19:36
Mamta A. Satoor (JIRA) [jira] [Comment Edited] (DERBY-6092) testPositionAgressive(org.apache.derbyTesting.functionTests.tests.jdbcapi.BlobClob4BlobTest)j fails with : 'The handle is invalid.: java.io.IOException'. Thu, 11 Apr, 19:36
Mamta A. Satoor (JIRA) [jira] [Updated] (DERBY-6170) testSuccessfulConnect failure on trunk(revision 1465166) with ibm 16 Thu, 11 Apr, 19:38
Mamta A. Satoor (JIRA) [jira] [Commented] (DERBY-6170) testSuccessfulConnect failure on trunk(revision 1465166) with ibm 16 Thu, 11 Apr, 19:40
Mamta A. Satoor (JIRA) [jira] [Comment Edited] (DERBY-6170) testSuccessfulConnect failure on trunk(revision 1465166) with ibm 16 Thu, 11 Apr, 19:42
Mamta A. Satoor (JIRA) [jira] [Commented] (DERBY-3861) 'testAutoNetworkServerBoot' fails with 'Network Server state incorrect expected:<false> but was:<true>' Thu, 11 Apr, 19:50
Mamta A. Satoor (JIRA) [jira] [Created] (DERBY-6172) testBlobInTriggerTable failed with Input stream did not have exact amount of data as the requested length.: org.apache.derby.iapi.services.io.DerbyIOException' Thu, 11 Apr, 20:01
Mamta A. Satoor (JIRA) [jira] [Comment Edited] (DERBY-5866) testFiringConstraintOrder(org.apache.derbyTesting.functionTests.tests.lang.TriggerTest)junit.framework.AssertionFailedError: matching triggers need to be fired in order creation:1,NO CASCADE BEFORE,DELETE,ROW Thu, 11 Apr, 20:03
Mamta A. Satoor (JIRA) [jira] [Created] (DERBY-6173) testSetClob failure on 10.10.1.2(1465864) with ibm17 - A communications error has been detected: Connection reset. Thu, 11 Apr, 20:07
Mamta A. Satoor (JIRA) [jira] [Commented] (DERBY-6170) testSuccessfulConnect failure on trunk(revision 1465166) with ibm 16 Thu, 11 Apr, 20:17
Mamta A. Satoor (JIRA) [jira] [Created] (DERBY-6174) testGetTablesModify failure - A communications error has been detected: Connection reset. Thu, 11 Apr, 20:19
Mamta A. Satoor (JIRA) [jira] [Commented] (DERBY-6172) testBlobInTriggerTable failed with Input stream did not have exact amount of data as the requested length.: org.apache.derby.iapi.services.io.DerbyIOException' Thu, 11 Apr, 20:21
Mamta A. Satoor (JIRA) [jira] [Created] (DERBY-6175) testComparisonAcrossPages failure - java.sql.SQLNonTransientConnectionException: No current connection. Thu, 11 Apr, 20:23
Mamta A. Satoor (JIRA) [jira] [Commented] (DERBY-6174) testGetTablesModify failure - A communications error has been detected: Connection reset. Thu, 11 Apr, 20:25
Mamta A. Satoor (JIRA) [jira] [Commented] (DERBY-6175) testComparisonAcrossPages failure - java.sql.SQLNonTransientConnectionException: No current connection. Thu, 11 Apr, 20:27
Mamta A. Satoor (JIRA) [jira] [Created] (DERBY-6176) Couple failures in SequenceGeneratorTest suite on trunk(1466748) with weme 6.2 Thu, 11 Apr, 20:43
Mamta A. Satoor (JIRA) [jira] [Comment Edited] (DERBY-6144) nightly regression test failure, intermittent error : testStatisticsCorrectness(org.apache.derbyTesting.functionTests.tests.store.AutomaticIndexStatisticsTest)junit.framework.AssertionFailedError Thu, 11 Apr, 20:45
ingemar.ab...@oracle.com [Java DB - testing] Success continuous trunk (rev 1467011) Thu, 11 Apr, 22:01
Mike Matrigali (JIRA) [jira] [Updated] (DERBY-6144) nightly regression test failure, intermittent error : testStatisticsCorrectness(org.apache.derbyTesting.functionTests.tests.store.AutomaticIndexStatisticsTest)junit.framework.AssertionFailedError Thu, 11 Apr, 23:05
Mike Matrigali (JIRA) [jira] [Updated] (DERBY-6144) nightly regression test failure, intermittent error : testStatisticsCorrectness(org.apache.derbyTesting.functionTests.tests.store.AutomaticIndexStatisticsTest)junit.framework.AssertionFailedError Thu, 11 Apr, 23:09
Mike Matrigali (JIRA) [jira] [Updated] (DERBY-6144) nightly regression test failure, intermittent error : testStatisticsCorrectness(org.apache.derbyTesting.functionTests.tests.store.AutomaticIndexStatisticsTest)junit.framework.AssertionFailedError Thu, 11 Apr, 23:21
Mike Matrigali (JIRA) [jira] [Resolved] (DERBY-6144) nightly regression test failure, intermittent error : testStatisticsCorrectness(org.apache.derbyTesting.functionTests.tests.store.AutomaticIndexStatisticsTest)junit.framework.AssertionFailedError Thu, 11 Apr, 23:21
Apache Jenkins Server Jenkins build is back to normal : Derby-branch-10.10 #18 Fri, 12 Apr, 00:10
ingemar.ab...@oracle.com [Java DB - testing] Error continuous trunk (rev 1466914) Fri, 12 Apr, 01:11
ingemar.ab...@oracle.com [Java DB - testing] Success continuous 10.8 (rev 1467136) Fri, 12 Apr, 02:23
ingemar.ab...@oracle.com [Java DB - testing] Success continuous 10.10 (rev 1467128) Fri, 12 Apr, 02:53
Apache Jenkins Server Jenkins build is still unstable: Derby-10.10-suites.All #13 Fri, 12 Apr, 04:18
Apache Jenkins Server Jenkins build is unstable: Derby-10.9-suites.All #75 Fri, 12 Apr, 04:29
Mamta A. Satoor (JIRA) [jira] [Commented] (DERBY-5866) testFiringConstraintOrder(org.apache.derbyTesting.functionTests.tests.lang.TriggerTest)junit.framework.AssertionFailedError: matching triggers need to be fired in order creation:1,NO CASCADE BEFORE,DELETE,ROW Fri, 12 Apr, 04:53
ingemar.ab...@oracle.com [Java DB - testing] Error nightly trunk (rev 1466522) Fri, 12 Apr, 07:52
Knut Anders Hatlen (JIRA) [jira] [Closed] (DERBY-6163) Reduce visibility of methods in subclasses of PageBasicOperation Fri, 12 Apr, 08:13
Knut Anders Hatlen (JIRA) [jira] [Updated] (DERBY-6168) Clean up registered format ids Fri, 12 Apr, 08:17
Knut Anders Hatlen (JIRA) [jira] [Commented] (DERBY-6169) Reduce visibility of classes and methods under impl/sql Fri, 12 Apr, 08:23
ingemar.ab...@oracle.com [Java DB - testing] Failure nightly trunk (rev 1467011) Fri, 12 Apr, 08:42
Dag H. Wanvik (JIRA) [jira] [Commented] (DERBY-5363) Tighten permissions of DB files to owner with >= JDK7 Fri, 12 Apr, 08:59
Dag H. Wanvik (JIRA) [jira] [Comment Edited] (DERBY-5363) Tighten permissions of DB files to owner with >= JDK7 Fri, 12 Apr, 09:36
ingemar.ab...@oracle.com [Java DB - testing] Error continuous 10.9 (rev 1467132) Fri, 12 Apr, 09:41
ingemar.ab...@oracle.com [Java DB - testing] Failure continuous trunk (rev 1467170) Fri, 12 Apr, 10:11
ingemar.ab...@oracle.com [Java DB - testing] Success continuous trunk (rev 1467201) Fri, 12 Apr, 11:21
Knut Anders Hatlen (JIRA) [jira] [Updated] (DERBY-6169) Reduce visibility of classes and methods under impl/sql Fri, 12 Apr, 12:04
Knut Anders Hatlen (JIRA) [jira] [Updated] (DERBY-6169) Reduce visibility of classes and methods under impl/sql Fri, 12 Apr, 12:06
Mike Matrigali (JIRA) [jira] [Updated] (DERBY-6176) Couple failures in SequenceGeneratorTest suite on trunk(1466748) with weme 6.2 Fri, 12 Apr, 14:48
Rick Hillegas (JIRA) [jira] [Created] (DERBY-6177) Cleanup suspect coding practices in org.apache.derby.catalog.types Fri, 12 Apr, 14:50
Mike Matrigali (JIRA) [jira] [Commented] (DERBY-6176) Couple failures in SequenceGeneratorTest suite on trunk(1466748) with weme 6.2 Fri, 12 Apr, 15:02
Mike Matrigali (JIRA) [jira] [Updated] (DERBY-6176) Couple failures in SequenceGeneratorTest suite on trunk(1466748) with weme 6.2 Fri, 12 Apr, 15:06
Mamta A. Satoor (JIRA) [jira] [Updated] (DERBY-6175) testComparisonAcrossPages failure - java.sql.SQLNonTransientConnectionException: No current connection. Fri, 12 Apr, 15:14
Mamta A. Satoor (JIRA) [jira] [Updated] (DERBY-6170) testSuccessfulConnect failure on trunk(revision 1465166) with ibm 16 Fri, 12 Apr, 15:16
Mamta A. Satoor (JIRA) [jira] [Updated] (DERBY-6172) testBlobInTriggerTable failed with Input stream did not have exact amount of data as the requested length.: org.apache.derby.iapi.services.io.DerbyIOException' Fri, 12 Apr, 15:16
Mamta A. Satoor (JIRA) [jira] [Updated] (DERBY-6174) testGetTablesModify failure - A communications error has been detected: Connection reset. Fri, 12 Apr, 15:16
Dag H. Wanvik (JIRA) [jira] [Commented] (DERBY-6103) Improve documentation of ROW_NUMBER function Fri, 12 Apr, 16:10
Mike Matrigali question about AutoloadTest and network server port numbers Fri, 12 Apr, 16:25
Dag H. Wanvik (JIRA) [jira] [Commented] (DERBY-973) Restore fails in OnlineBackupTest1 Fri, 12 Apr, 16:32
Rick Hillegas (JIRA) [jira] [Updated] (DERBY-6177) Cleanup suspect coding practices in org.apache.derby.catalog.types Fri, 12 Apr, 17:00
Mamta A. Satoor (JIRA) [jira] [Updated] (DERBY-5866) testFiringConstraintOrder(org.apache.derbyTesting.functionTests.tests.lang.TriggerTest)junit.framework.AssertionFailedError: matching triggers need to be fired in order creation:1,NO CASCADE BEFORE,DELETE,ROW Fri, 12 Apr, 17:12
Mamta A. Satoor (JIRA) [jira] [Commented] (DERBY-5866) testFiringConstraintOrder(org.apache.derbyTesting.functionTests.tests.lang.TriggerTest)junit.framework.AssertionFailedError: matching triggers need to be fired in order creation:1,NO CASCADE BEFORE,DELETE,ROW Fri, 12 Apr, 17:12
Rick Hillegas (JIRA) [jira] [Commented] (DERBY-6176) Couple failures in SequenceGeneratorTest suite on trunk(1466748) with weme 6.2 Fri, 12 Apr, 18:08
Rick Hillegas (JIRA) [jira] [Commented] (DERBY-6160) Required permission RuntimePermission "accessUserInformation" should be documented in the Developers Guide Fri, 12 Apr, 18:22
Mike Matrigali (JIRA) [jira] [Commented] (DERBY-6176) Couple failures in SequenceGeneratorTest suite on trunk(1466748) with weme 6.2 Fri, 12 Apr, 18:22
Rick Hillegas (JIRA) [jira] [Commented] (DERBY-6176) Couple failures in SequenceGeneratorTest suite on trunk(1466748) with weme 6.2 Fri, 12 Apr, 18:36
Mike Matrigali (JIRA) [jira] [Created] (DERBY-6178) AutoloadTest does not proprogate orignal jvm -D flags to spawned JVM, leading to LAB regression test failures Fri, 12 Apr, 20:48
Mike Matrigali (JIRA) [jira] [Commented] (DERBY-6178) AutoloadTest does not proprogate orignal jvm -D flags to spawned JVM, leading to LAB regression test failures Fri, 12 Apr, 21:02
Mike Matrigali (JIRA) [jira] [Updated] (DERBY-6178) AutoloadTest does not proprogate orignal jvm -D flags to spawned JVM, leading to LAB regression test failures Fri, 12 Apr, 21:20
Mike Matrigali (JIRA) [jira] [Assigned] (DERBY-6178) AutoloadTest does not proprogate orignal jvm -D flags to spawned JVM, leading to LAB regression test failures Fri, 12 Apr, 23:32
Mike Matrigali (JIRA) [jira] [Updated] (DERBY-6178) AutoloadTest does not proprogate orignal jvm -D flags to spawned JVM, leading to LAB regression test failures Fri, 12 Apr, 23:34
ingemar.ab...@oracle.com [Java DB - testing] Failure nightly 10.8 (rev 1467136) Sat, 13 Apr, 00:44
ingemar.ab...@oracle.com [Java DB - testing] Failure continuous trunk (rev 1467494) Sat, 13 Apr, 00:54
ingemar.ab...@oracle.com [Java DB - testing] Error nightly 10.9 (rev 1467132) Sat, 13 Apr, 03:54
Dag H. Wanvik (JIRA) [jira] [Commented] (DERBY-5363) Tighten permissions of DB files to owner with >= JDK7 Sat, 13 Apr, 05:46
Dag H. Wanvik (JIRA) [jira] [Comment Edited] (DERBY-5363) Tighten permissions of DB files to owner with >= JDK7 Sat, 13 Apr, 05:46
ingemar.ab...@oracle.com [Java DB - testing] Failure nightly 10.10 (rev 1467128) Sat, 13 Apr, 06:34
ingemar.ab...@oracle.com [Java DB - testing] Failure continuous trunk (rev 1467200) Sat, 13 Apr, 09:01
Dag H. Wanvik (JIRA) [jira] [Created] (DERBY-6179) Insert some guarding code into the first replication test to check port availability Sat, 13 Apr, 13:02
Dag H. Wanvik (JIRA) [jira] [Updated] (DERBY-6179) Insert some guarding code into the first replication test to check port availability Sat, 13 Apr, 13:04
Dag H. Wanvik (JIRA) [jira] [Assigned] (DERBY-6179) Insert some guarding code into the first replication test to check port availability Sat, 13 Apr, 13:04
Dag H. Wanvik (JIRA) [jira] [Commented] (DERBY-6160) Required permission RuntimePermission "accessUserInformation" should be documented in the Developers Guide Sat, 13 Apr, 13:42
Mamta A. Satoor (JIRA) [jira] [Commented] (DERBY-6176) Couple failures in SequenceGeneratorTest suite on trunk(1466748) with weme 6.2 Sat, 13 Apr, 13:54
Mamta A. Satoor (JIRA) [jira] [Commented] (DERBY-6176) Couple failures in SequenceGeneratorTest suite on trunk(1466748) with weme 6.2 Sat, 13 Apr, 14:00
Dag H. Wanvik (JIRA) [jira] [Commented] (DERBY-6169) Reduce visibility of classes and methods under impl/sql Sat, 13 Apr, 14:02
Bryan Pendleton Re: [VOTE] 10.10.1.1 release Sat, 13 Apr, 16:32
Mike Matrigali (JIRA) [jira] [Updated] (DERBY-6178) AutoloadTest does not proprogate original jvm -D flags to spawned JVM, leading to LAB regression test failures Sat, 13 Apr, 17:32
Mike Matrigali (JIRA) [jira] [Commented] (DERBY-6178) AutoloadTest does not proprogate original jvm -D flags to spawned JVM, leading to LAB regression test failures Sat, 13 Apr, 17:38
ingemar.ab...@oracle.com [Java DB - testing] Success continuous 10.10 (rev 1467634) Sat, 13 Apr, 17:44
ingemar.ab...@oracle.com [Java DB - testing] Failure nightly trunk (rev 1467201) Sat, 13 Apr, 18:02
Mike Matrigali (JIRA) [jira] [Commented] (DERBY-6178) AutoloadTest does not proprogate original jvm -D flags to spawned JVM, leading to LAB regression test failures Sat, 13 Apr, 20:04
Mike Matrigali (JIRA) [jira] [Commented] (DERBY-6178) AutoloadTest does not proprogate original jvm -D flags to spawned JVM, leading to LAB regression test failures Sat, 13 Apr, 20:06
Mike Matrigali (JIRA) [jira] [Updated] (DERBY-6178) AutoloadTest does not proprogate original jvm -D flags to spawned JVM, leading to LAB regression test failures Sat, 13 Apr, 20:08
ingemar.ab...@oracle.com [Java DB - testing] Success continuous 10.10 (rev 1467683) Sat, 13 Apr, 22:41
ingemar.ab...@oracle.com [Java DB - testing] Error nightly trunk (rev 1467664) Sun, 14 Apr, 01:02
Dag H. Wanvik (JIRA) [jira] [Commented] (DERBY-6179) Insert some guarding code into the first replication test to check port availability Sun, 14 Apr, 03:20
Dag H. Wanvik (JIRA) [jira] [Commented] (DERBY-6179) Insert some guarding code into the first replication test to check port availability Sun, 14 Apr, 03:26
ingemar.ab...@oracle.com [Java DB - testing] Error continuous trunk (rev 1467664) Sun, 14 Apr, 03:32
Dag H. Wanvik (JIRA) [jira] [Commented] (DERBY-6125) Code clean up in client driver. Sun, 14 Apr, 03:38
ingemar.ab...@oracle.com [Java DB - testing] Failure nightly 10.9 (rev 1467688) Sun, 14 Apr, 04:02
Dag H. Wanvik (JIRA) [jira] [Commented] (DERBY-6125) Code clean up in client driver. Sun, 14 Apr, 04:22
Apache Jenkins Server Jenkins build is still unstable: Derby-10.10-suites.All #14 Sun, 14 Apr, 05:35
Message list« Previous · 1 · 2 · 3 · 4 · 5 · 6 · 7 · 8 · 9 · 10 · 11 · 12 · Next »Thread · Author · Date
Box list
Aug 201425
Jul 2014570
Jun 2014712
May 2014698
Apr 2014464
Mar 2014895
Feb 2014630
Jan 2014475
Dec 2013329
Nov 2013524
Oct 2013875
Sep 2013562
Aug 2013618
Jul 2013657
Jun 20131166
May 2013788
Apr 20131185
Mar 2013588
Feb 2013664
Jan 2013538
Dec 2012331
Nov 2012446
Oct 2012636
Sep 2012663
Aug 2012384
Jul 2012481
Jun 2012586
May 2012900
Apr 2012709
Mar 2012767
Feb 2012897
Jan 2012391
Dec 2011478
Nov 2011444
Oct 2011576
Sep 2011744
Aug 2011684
Jul 2011722
Jun 2011804
May 2011605
Apr 2011574
Mar 20111193
Feb 20111393
Jan 2011834
Dec 2010535
Nov 2010595
Oct 2010703
Sep 2010673
Aug 2010657
Jul 2010848
Jun 2010929
May 2010709
Apr 2010885
Mar 2010673
Feb 2010646
Jan 2010638
Dec 2009566
Nov 2009660
Oct 2009604
Sep 2009505
Aug 2009921
Jul 20091312
Jun 20091035
May 2009835
Apr 20091088
Mar 2009884
Feb 2009541
Jan 2009692
Dec 2008522
Nov 2008616
Oct 2008723
Sep 2008455
Aug 2008754
Jul 2008988
Jun 2008871
May 2008842
Apr 20081384
Mar 20081904
Feb 20082074
Jan 20081539
Dec 2007852
Nov 20071273
Oct 20071391
Sep 2007911
Aug 2007908
Jul 20071492
Jun 20072222
May 20072295
Apr 20071394
Mar 20072200
Feb 20071383
Jan 20071360
Dec 20061026
Nov 20061413
Oct 20061324
Sep 20062319
Aug 20063287
Jul 20062434
Jun 20061712
May 20061602
Apr 20061694
Mar 20061985
Feb 20062535
Jan 20061640
Dec 2005741
Nov 20051157
Oct 20051185
Sep 2005783
Aug 2005896
Jul 2005652
Jun 20051494
May 20051323
Apr 2005684
Mar 2005612
Feb 2005351
Jan 2005438
Dec 2004435
Nov 2004274
Oct 2004281
Sep 2004388
Aug 2004160