db-derby-dev mailing list archives: April 2013

Site index · List index
Message list1 · 2 · 3 · 4 · 5 · 6 · 7 · 8 · 9 · 10 · 11 · 12 · Next »Thread · Author · Date
Tony Brusseau (JIRA) [jira] [Comment Edited] (DERBY-6132) FETCH NEXT extremely slow when used with DISTINCT queries Mon, 01 Apr, 00:29
Dave Brosius (JIRA) [jira] [Created] (DERBY-6133) simple array index typo Mon, 01 Apr, 01:39
Dave Brosius (JIRA) [jira] [Assigned] (DERBY-6133) simple array index typo Mon, 01 Apr, 01:39
Dave Brosius (JIRA) [jira] [Updated] (DERBY-6133) simple array index typo Mon, 01 Apr, 01:39
Dag H. Wanvik (JIRA) [jira] [Commented] (DERBY-6132) FETCH NEXT extremely slow when used with DISTINCT queries Mon, 01 Apr, 02:53
Dag H. Wanvik (JIRA) [jira] [Created] (DERBY-6134) Faster, incremental implementation of DISTINCT in presence of FETCH NEXT clause Mon, 01 Apr, 03:07
Dag H. Wanvik (JIRA) [jira] [Commented] (DERBY-6132) FETCH NEXT extremely slow when used with DISTINCT queries Mon, 01 Apr, 03:09
Dag H. Wanvik (JIRA) [jira] [Closed] (DERBY-6132) FETCH NEXT extremely slow when used with DISTINCT queries Mon, 01 Apr, 03:09
Dag H. Wanvik (JIRA) [jira] [Commented] (DERBY-6133) simple array index typo Mon, 01 Apr, 03:19
Dave Brosius (JIRA) [jira] [Commented] (DERBY-6133) simple array index typo Mon, 01 Apr, 03:29
Apache Jenkins Server Jenkins build is back to normal : Derby-branch-10.9 #57 Mon, 01 Apr, 03:29
Dag H. Wanvik (JIRA) [jira] [Commented] (DERBY-3519) junit regression test failure in testInertTime(org.apache.derbyTesting.functionTests.tests.lang.TimeHandlingTest)junit.framework.AssertionFailedError: expected:<2> but was:<3> Mon, 01 Apr, 03:39
Dag H. Wanvik (JIRA) [jira] [Updated] (DERBY-6125) Code clean up in client driver. Mon, 01 Apr, 03:43
Tony Brusseau (JIRA) [jira] [Created] (DERBY-6135) Request data compression scheme (i.e., gzip of data pages) Mon, 01 Apr, 03:43
Dag H. Wanvik (JIRA) [jira] [Comment Edited] (DERBY-6125) Code clean up in client driver. Mon, 01 Apr, 03:45
Dag H. Wanvik (JIRA) [jira] [Commented] (DERBY-6125) Code clean up in client driver. Mon, 01 Apr, 04:01
Dag H. Wanvik (JIRA) [jira] [Commented] (DERBY-6133) simple array index typo Mon, 01 Apr, 05:23
ingemar.ab...@oracle.com [Java DB - testing] Error nightly 10.9 (rev 1462304) Mon, 01 Apr, 06:02
ingemar.ab...@oracle.com [Java DB - testing] Error continuous trunk (rev 1463080) Mon, 01 Apr, 08:12
ingemar.ab...@oracle.com [Java DB - testing] Error nightly 10.9 (rev 1462677) Mon, 01 Apr, 09:32
Rick Hillegas (JIRA) [jira] [Updated] (DERBY-5201) Create tools for reading the contents of the seg0 directory Mon, 01 Apr, 13:05
Rick Hillegas (JIRA) [jira] [Updated] (DERBY-5201) Create tools for reading the contents of the seg0 directory Mon, 01 Apr, 13:29
Bergquist, Brett RE: Why is the optimizer choosing such a bad path Mon, 01 Apr, 13:55
Kim Haase (JIRA) [jira] [Updated] (DERBY-6103) Improve documentation of ROW_NUMBER function Mon, 01 Apr, 14:53
Mike Matrigali (JIRA) [jira] [Updated] (DERBY-6131) select from view with "upper" and "in" does not work Mon, 01 Apr, 16:33
Myrna van Lunteren Re: [Java DB - testing] Error nightly 10.9 (rev 1462304) Mon, 01 Apr, 17:26
Myrna van Lunteren (JIRA) [jira] [Commented] (DERBY-5172) testTimeAndDateWithCalendar (jdbcapi.CallableTest) fails intermittently with AssertionFailedError: hour expected: differs from actual. Mon, 01 Apr, 18:51
Myrna van Lunteren (JIRA) [jira] [Comment Edited] (DERBY-5172) testTimeAndDateWithCalendar (jdbcapi.CallableTest) fails intermittently with AssertionFailedError: hour expected: differs from actual. Mon, 01 Apr, 18:53
Mamta Satoor Re: Why is the optimizer choosing such a bad path Mon, 01 Apr, 18:55
Rick Hillegas (JIRA) [jira] [Created] (DERBY-6136) Create a custom/optional tool for dumping the data in a corrupted database. Mon, 01 Apr, 19:05
Tony Brusseau (JIRA) [jira] [Resolved] (DERBY-6093) dramatically worse query plan for prepared stamement vs calling directly Mon, 01 Apr, 19:21
Mamta Satoor Re: Why is the optimizer choosing such a bad path Mon, 01 Apr, 19:21
Rick Hillegas (JIRA) [jira] [Updated] (DERBY-6136) Create a custom/optional tool for dumping the data in a corrupted database. Mon, 01 Apr, 19:29
Rick Hillegas (JIRA) [jira] [Updated] (DERBY-6136) Create a custom/optional tool for dumping the data in a corrupted database. Mon, 01 Apr, 19:51
Andrew Clemons (JIRA) [jira] [Created] (DERBY-6137) update/delete statement on table with trigger fails randomly with ERROR XSTA2 Tue, 02 Apr, 00:53
Andrew Clemons (JIRA) [jira] [Updated] (DERBY-6137) update/delete statement on table with trigger fails randomly with ERROR XSTA2 Tue, 02 Apr, 00:53
Dag Wanvik Re: Why is the optimizer choosing such a bad path Tue, 02 Apr, 03:12
ingemar.ab...@oracle.com [Java DB - testing] Failure nightly trunk (rev 1463080) Tue, 02 Apr, 04:02
Dag H. Wanvik (JIRA) [jira] [Commented] (DERBY-6137) update/delete statement on table with trigger fails randomly with ERROR XSTA2 Tue, 02 Apr, 04:19
Dag H. Wanvik (JIRA) [jira] [Comment Edited] (DERBY-6137) update/delete statement on table with trigger fails randomly with ERROR XSTA2 Tue, 02 Apr, 04:19
Mamta A. Satoor (JIRA) [jira] [Commented] (DERBY-6045) in list multi-probe by primary key not chosen on tables with >256 rows Tue, 02 Apr, 04:35
Mamta A. Satoor (JIRA) [jira] [Updated] (DERBY-6045) in list multi-probe by primary key not chosen on tables with >256 rows Tue, 02 Apr, 04:43
Dag H. Wanvik (JIRA) [jira] [Closed] (DERBY-6133) simple array index typo Tue, 02 Apr, 04:45
Dag H. Wanvik (JIRA) [jira] [Closed] (DERBY-6133) simple array index typo Tue, 02 Apr, 04:47
Dag H. Wanvik (JIRA) [jira] [Updated] (DERBY-6125) Code clean up in client driver. Tue, 02 Apr, 05:21
Dag H. Wanvik (JIRA) [jira] [Comment Edited] (DERBY-6125) Code clean up in client driver. Tue, 02 Apr, 05:23
Knut Anders Hatlen (JIRA) [jira] [Commented] (DERBY-6125) Code clean up in client driver. Tue, 02 Apr, 06:51
Knut Anders Hatlen (JIRA) [jira] [Commented] (DERBY-6125) Code clean up in client driver. Tue, 02 Apr, 07:05
ingemar.ab...@oracle.com [Java DB - testing] Error nightly 10.9 (rev 1462304) Tue, 02 Apr, 07:22
Knut Anders Hatlen (JIRA) [jira] [Commented] (DERBY-6125) Code clean up in client driver. Tue, 02 Apr, 08:13
Knut Anders Hatlen (JIRA) [jira] [Commented] (DERBY-6075) Use modern collections in impl/sql/compile Tue, 02 Apr, 10:53
ingemar.ab...@oracle.com [Java DB - testing] Success continuous trunk (rev 1463378) Tue, 02 Apr, 11:11
ingemar.ab...@oracle.com [Java DB - testing] Success continuous trunk (rev 1463379) Tue, 02 Apr, 11:41
Kathey Marsden (JIRA) [jira] [Updated] (DERBY-6096) OutOfMemoryError with Clob or Blob hash join: DataTypeDescriptor.estimatedMemoryUsage() has no case for BLOB or CLOB so would underestimate memory usage for those types at zero Tue, 02 Apr, 13:41
Rick Hillegas (JIRA) [jira] [Updated] (DERBY-6136) Create a custom/optional tool for dumping the data in a corrupted database. Tue, 02 Apr, 14:55
Tony Brusseau (JIRA) [jira] [Commented] (DERBY-6045) in list multi-probe by primary key not chosen on tables with >256 rows Tue, 02 Apr, 15:51
Kathey Marsden (JIRA) [jira] [Updated] (DERBY-6096) OutOfMemoryError with Clob or Blob hash join: DataTypeDescriptor.estimatedMemoryUsage() has no case for BLOB or CLOB so would underestimate memory usage for those types at zero Tue, 02 Apr, 16:01
Rick Hillegas (JIRA) [jira] [Updated] (DERBY-5201) Create tools for reading the contents of the seg0 directory Tue, 02 Apr, 16:43
Knut Anders Hatlen (JIRA) [jira] [Assigned] (DERBY-5172) testTimeAndDateWithCalendar (jdbcapi.CallableTest) fails intermittently with AssertionFailedError: hour expected: differs from actual. Tue, 02 Apr, 17:23
Knut Anders Hatlen (JIRA) [jira] [Updated] (DERBY-5172) testTimeAndDateWithCalendar (jdbcapi.CallableTest) fails intermittently with AssertionFailedError: hour expected: differs from actual. Tue, 02 Apr, 17:59
Kathey Marsden (JIRA) [jira] [Created] (DERBY-6138) org.apache.derbyTesting.functionTests.tests.store.ClassLoaderBootTest fails with sealing violation: package org.apache.derby.iapi.services.sanity is sealed depending on classpath order Tue, 02 Apr, 18:15
Myrna van Lunteren (JIRA) [jira] [Commented] (DERBY-6138) org.apache.derbyTesting.functionTests.tests.store.ClassLoaderBootTest fails with sealing violation: package org.apache.derby.iapi.services.sanity is sealed depending on classpath order Tue, 02 Apr, 18:31
Kathey Marsden (JIRA) [jira] [Commented] (DERBY-6096) OutOfMemoryError with Clob or Blob hash join: DataTypeDescriptor.estimatedMemoryUsage() has no case for BLOB or CLOB so would underestimate memory usage for those types at zero Tue, 02 Apr, 19:15
Mike Matrigali (JIRA) [jira] [Commented] (DERBY-6096) OutOfMemoryError with Clob or Blob hash join: DataTypeDescriptor.estimatedMemoryUsage() has no case for BLOB or CLOB so would underestimate memory usage for those types at zero Tue, 02 Apr, 19:25
Mamta A. Satoor (JIRA) [jira] [Commented] (DERBY-6096) OutOfMemoryError with Clob or Blob hash join: DataTypeDescriptor.estimatedMemoryUsage() has no case for BLOB or CLOB so would underestimate memory usage for those types at zero Tue, 02 Apr, 19:47
Kathey Marsden (JIRA) [jira] [Updated] (DERBY-6096) OutOfMemoryError with Clob or Blob hash join: DataTypeDescriptor.estimatedMemoryUsage() has no case for BLOB or CLOB so would underestimate memory usage for those types at zero Tue, 02 Apr, 19:47
Kathey Marsden (JIRA) [jira] [Updated] (DERBY-6096) OutOfMemoryError with Clob or Blob hash join: DataTypeDescriptor.estimatedMemoryUsage() has no case for BLOB or CLOB so would underestimate memory usage for those types at zero Tue, 02 Apr, 20:19
Kathey Marsden (JIRA) [jira] [Updated] (DERBY-6138) org.apache.derbyTesting.functionTests.tests.store.ClassLoaderBootTest fails with sealing violation: package org.apache.derby.iapi.services.sanity is sealed depending on classpath order Tue, 02 Apr, 21:15
Kathey Marsden (JIRA) [jira] [Commented] (DERBY-6138) org.apache.derbyTesting.functionTests.tests.store.ClassLoaderBootTest fails with sealing violation: package org.apache.derby.iapi.services.sanity is sealed depending on classpath order Tue, 02 Apr, 21:21
Kathey Marsden (JIRA) [jira] [Assigned] (DERBY-6138) org.apache.derbyTesting.functionTests.tests.store.ClassLoaderBootTest fails with sealing violation: package org.apache.derby.iapi.services.sanity is sealed depending on classpath order Tue, 02 Apr, 21:23
Kathey Marsden (JIRA) [jira] [Resolved] (DERBY-6138) org.apache.derbyTesting.functionTests.tests.store.ClassLoaderBootTest fails with sealing violation: package org.apache.derby.iapi.services.sanity is sealed depending on classpath order Tue, 02 Apr, 21:31
Kathey Marsden (JIRA) [jira] [Created] (DERBY-6139) Client build shoud disallow import of org.apache.derby.iapi.services.sanity package Tue, 02 Apr, 21:33
Mike Matrigali (JIRA) [jira] [Updated] (DERBY-6131) select from view with "upper" and "in" list throws a ClassCastException Tue, 02 Apr, 22:03
Myrna van Lunteren (JIRA) [jira] [Commented] (DERBY-5172) testTimeAndDateWithCalendar (jdbcapi.CallableTest) fails intermittently with AssertionFailedError: hour expected: differs from actual. Tue, 02 Apr, 23:09
Mike Matrigali (JIRA) [jira] [Created] (DERBY-6140) nightly regression test failure in derbyall/CompatibilityTest - connection failed Wed, 03 Apr, 00:07
Mike Matrigali (JIRA) [jira] [Commented] (DERBY-6122) InterruptResilienceTest fails with: junit.framework.ComparisonFailure: Database shutdown expected:<[08006]> but was:<[XBDA0]> Wed, 03 Apr, 00:21
Mike Matrigali (JIRA) [jira] [Created] (DERBY-6141) testReplication_Local_3_p5_DERBY_3878 failed in nightly regression test run with AssertionFailedError: Server did not start in time Wed, 03 Apr, 00:25
Mike Matrigali (JIRA) [jira] [Updated] (DERBY-5754) nightly regresstession test failure:RAFReadWriteMultipleThreads(org.apache.derbyTesting.functionTests.tests.store.InterruptResilienceTest)java.sql.SQLException: Wed, 03 Apr, 00:29
Mike Matrigali (JIRA) [jira] [Commented] (DERBY-5754) nightly regresstession test failure:RAFReadWriteMultipleThreads(org.apache.derbyTesting.functionTests.tests.store.InterruptResilienceTest)java.sql.SQLException: Wed, 03 Apr, 00:29
Mike Matrigali (JIRA) [jira] [Created] (DERBY-6142) nightly regression test failure: testCorrectClobDataWithMultiCall(org.apache.derbyTesting.functionTests.tests.jdbcapi.LobRsGetterTest)java.sql.SQLException: Java exception: 'The handle is invalid.: java.io.IOException'. Wed, 03 Apr, 00:35
Mike Matrigali (JIRA) [jira] [Commented] (DERBY-3861) 'testAutoNetworkServerBoot' fails with 'Network Server state incorrect expected:<false> but was:<true>' Wed, 03 Apr, 00:41
Mike Matrigali (JIRA) [jira] [Updated] (DERBY-3861) 'testAutoNetworkServerBoot' fails with 'Network Server state incorrect expected:<false> but was:<true>' Wed, 03 Apr, 00:41
Myrna van Lunteren (JIRA) [jira] [Resolved] (DERBY-3838) Convert derbynet/DerbyNetAutoStart to JUnit Wed, 03 Apr, 00:43
Mike Matrigali (JIRA) [jira] [Created] (DERBY-6143) nightly regression test failure: cs_FailedStreamInsertCharBufferBoundaries(org.apache.derbyTesting.functionTests.tests.jdbcapi.Derby2017LayerATest)java.io.IOException Wed, 03 Apr, 00:49
Mike Matrigali (JIRA) [jira] [Commented] (DERBY-6092) testPositionAgressive(org.apache.derbyTesting.functionTests.tests.jdbcapi.BlobClob4BlobTest)j fails with : 'The handle is invalid.: java.io.IOException'. Wed, 03 Apr, 00:53
Mike Matrigali (JIRA) [jira] [Updated] (DERBY-6092) testPositionAgressive(org.apache.derbyTesting.functionTests.tests.jdbcapi.BlobClob4BlobTest)j fails with : 'The handle is invalid.: java.io.IOException'. Wed, 03 Apr, 00:55
Mike Matrigali (JIRA) [jira] [Updated] (DERBY-6122) InterruptResilienceTest fails with: junit.framework.ComparisonFailure: Database shutdown expected:<[08006]> but was:<[XBDA0]> Wed, 03 Apr, 00:59
Mike Matrigali (JIRA) [jira] [Commented] (DERBY-6122) InterruptResilienceTest fails with: junit.framework.ComparisonFailure: Database shutdown expected:<[08006]> but was:<[XBDA0]> Wed, 03 Apr, 00:59
Mike Matrigali (JIRA) [jira] [Commented] (DERBY-6092) testPositionAgressive(org.apache.derbyTesting.functionTests.tests.jdbcapi.BlobClob4BlobTest)j fails with : 'The handle is invalid.: java.io.IOException'. Wed, 03 Apr, 01:02
Mike Matrigali (JIRA) [jira] [Commented] (DERBY-5866) testFiringConstraintOrder(org.apache.derbyTesting.functionTests.tests.lang.TriggerTest)junit.framework.AssertionFailedError: matching triggers need to be fired in order creation:1,NO CASCADE BEFORE,DELETE,ROW Wed, 03 Apr, 01:04
Mike Matrigali (JIRA) [jira] [Updated] (DERBY-5866) testFiringConstraintOrder(org.apache.derbyTesting.functionTests.tests.lang.TriggerTest)junit.framework.AssertionFailedError: matching triggers need to be fired in order creation:1,NO CASCADE BEFORE,DELETE,ROW Wed, 03 Apr, 01:04
Mike Matrigali (JIRA) [jira] [Commented] (DERBY-6092) testPositionAgressive(org.apache.derbyTesting.functionTests.tests.jdbcapi.BlobClob4BlobTest)j fails with : 'The handle is invalid.: java.io.IOException'. Wed, 03 Apr, 01:08
Mike Matrigali (JIRA) [jira] [Commented] (DERBY-6143) nightly regression test failure: cs_FailedStreamInsertCharBufferBoundaries(org.apache.derbyTesting.functionTests.tests.jdbcapi.Derby2017LayerATest)java.io.IOException Wed, 03 Apr, 01:10
Mike Matrigali (JIRA) [jira] [Created] (DERBY-6144) nightly regression test failure, intermittent error : testStatisticsCorrectness(org.apache.derbyTesting.functionTests.tests.store.AutomaticIndexStatisticsTest)junit.framework.AssertionFailedError Wed, 03 Apr, 01:20
ingemar.ab...@oracle.com [Java DB - testing] Failure nightly trunk (rev 1463379) Wed, 03 Apr, 01:52
Mike Matrigali (JIRA) [jira] [Commented] (DERBY-5866) testFiringConstraintOrder(org.apache.derbyTesting.functionTests.tests.lang.TriggerTest)junit.framework.AssertionFailedError: matching triggers need to be fired in order creation:1,NO CASCADE BEFORE,DELETE,ROW Wed, 03 Apr, 01:55
Mike Matrigali (JIRA) [jira] [Commented] (DERBY-5800) test failure in AutoloadTest; AssertionFailedError: Test process failed:Spawned caused by SQLNonTransientConnectionException - Software caused connection abort: recv failed. Wed, 03 Apr, 01:59
Mike Matrigali (JIRA) [jira] [Updated] (DERBY-5800) test failure in AutoloadTest; AssertionFailedError: Test process failed:Spawned caused by SQLNonTransientConnectionException - Software caused connection abort: recv failed. Wed, 03 Apr, 01:59
Mike Matrigali (JIRA) [jira] [Created] (DERBY-6145) intermittent nightly regression test failures: Wed, 03 Apr, 02:05
Mike Matrigali (JIRA) [jira] [Updated] (DERBY-6145) intermittent nightly regression test failures: testDERBY5289TriggerUpgradeFormat(org.apache.derbyTesting.functionTests.tests.upgradeTests.BasicSetup)junit.framework.AssertionFailedError: Unexpected row count: expected:<1> but was:<2> Wed, 03 Apr, 02:07
Message list1 · 2 · 3 · 4 · 5 · 6 · 7 · 8 · 9 · 10 · 11 · 12 · Next »Thread · Author · Date
Box list
Jul 2014420
Jun 2014712
May 2014698
Apr 2014464
Mar 2014895
Feb 2014630
Jan 2014475
Dec 2013329
Nov 2013524
Oct 2013875
Sep 2013562
Aug 2013618
Jul 2013657
Jun 20131166
May 2013788
Apr 20131185
Mar 2013588
Feb 2013664
Jan 2013538
Dec 2012331
Nov 2012446
Oct 2012636
Sep 2012663
Aug 2012384
Jul 2012481
Jun 2012586
May 2012900
Apr 2012709
Mar 2012767
Feb 2012897
Jan 2012391
Dec 2011478
Nov 2011444
Oct 2011576
Sep 2011744
Aug 2011684
Jul 2011722
Jun 2011804
May 2011605
Apr 2011574
Mar 20111193
Feb 20111393
Jan 2011834
Dec 2010535
Nov 2010595
Oct 2010703
Sep 2010673
Aug 2010657
Jul 2010848
Jun 2010929
May 2010709
Apr 2010885
Mar 2010673
Feb 2010646
Jan 2010638
Dec 2009566
Nov 2009660
Oct 2009604
Sep 2009505
Aug 2009921
Jul 20091312
Jun 20091035
May 2009835
Apr 20091088
Mar 2009884
Feb 2009541
Jan 2009692
Dec 2008522
Nov 2008616
Oct 2008723
Sep 2008455
Aug 2008754
Jul 2008988
Jun 2008871
May 2008842
Apr 20081384
Mar 20081904
Feb 20082074
Jan 20081539
Dec 2007852
Nov 20071273
Oct 20071391
Sep 2007911
Aug 2007908
Jul 20071492
Jun 20072222
May 20072295
Apr 20071394
Mar 20072200
Feb 20071383
Jan 20071360
Dec 20061026
Nov 20061413
Oct 20061324
Sep 20062319
Aug 20063287
Jul 20062434
Jun 20061712
May 20061602
Apr 20061694
Mar 20061985
Feb 20062535
Jan 20061640
Dec 2005741
Nov 20051157
Oct 20051185
Sep 2005783
Aug 2005896
Jul 2005652
Jun 20051494
May 20051323
Apr 2005684
Mar 2005612
Feb 2005351
Jan 2005438
Dec 2004435
Nov 2004274
Oct 2004281
Sep 2004388
Aug 2004160